{"text_format":"1","workbook":"xlsx","n_sheets":26,"sheets":["Change Log","Inputs","Outputs","Allocation Summary","DNO - Final Allocation","Calc - DNO Opex Allocation","Calc-Units","Calc-Drivers","Calc-MEAV","Calc-Net capex","Summary of revenue","Allowed revenue -DPCR4","FBPQ T4","FBPQ LR1","FBPQ LR1 - V5 opt3","FBPQ LR4","FBPQ LR6","FBPQ NL1 0309","NL9 - Legal & Safety","FBPQ C2","RRP 1.3","RRP 2.3","RRP 2.4","RRP 2.6","RRP 5.1","LR1 Refs"],"not_rendered":{"charts":0,"images":3,"macros":1,"external_links":8,"defined_names":65,"comments":1,"pivot_tables":0},"unopened":[],"bounds":{"document_bytes":16777216,"sheet_cells":100000,"rows_first":2000,"rows_last":500,"rows_between":2000,"halvings":0,"cell_chars":16384,"cell_head_chars":4096},"cells_cut":0,"cells_raw":0,"read":"whole","date_system":"1900"}

{"sheet":"Change Log","index":0,"n_rows":13,"n_cols":4,"rows_kept":13,"cut":false,"hidden":false,"merged":[]}
[]
["Method M Version No.",null,"[Extended Disaggregation Model PB LZ v1.0]"]
["Release Date:",null,"[01 April 2013]"]
[]
[]
[]
[]
["This version of Method M incorporates the following change proposals:"]
[]
["Ref","Approval Date","Implementation Date","Title"]
["DCP 071A","2011-06-20","2011-10-01","Allocation of Costs to HV Connected IDNOs with LV End Users"]
["DCP 095","2011-12-09","2012-04-01","Not included in this model"]
["DCP 096","2011-12-09","2012-04-01","Treatment of Transmission Exit Charges in CDCM Price Control Disaggregation Model (Method M)"]

{"sheet":"Inputs","index":1,"n_rows":41,"n_cols":6,"rows_kept":41,"cut":false,"hidden":false,"merged":[]}
[{"$f":"\"Extended Method M for \"&B5&\" in \"&B6&\"  Status: \"&B7&\"\"","v":"Extended Method M for WPD East Midlands in 2015/16  Status: Indicative"}]
[]
[]
["1000. Company, charging year, data version"]
["DNO","WPD East Midlands"]
["Charging Year","2015/16"]
["Version","Indicative"]
[]
[]
["1001. LV/HV Split"]
["Sources: HV main usage value provided each year by the Nominated Calculation Agent"]
["DNO LV Main usage",9.9000000000000005E-2]
["DNO HV Main usage",0.55000000000000004]
["DNO 33kV split",1]
["DNO 132kV split",1]
[]
[]
["1002. Method M input data"]
["Each DNO selects one of the options below to calculate the LDNO discounts:"]
["'LR1 opt 3' is an extended version of LR1, which contains all information from LR1, but breaks down certain lines into more detail."]
["Version LR1"]
["Version LR1, Option 3"]
[]
[]
[null,"This spreadsheet is currently using version: ","LR1"]
[]
["1003. Depreciation Factor"]
["Depreciation Factor",5.5449999999999999E-2]
[]
[]
["1004. CDCM Discounts"]
["Sources: CDCM Table 1037. (Embedded network (LDNO) discounts)"]
[null,"No discount","LDNO LV: LV user","LDNO HV: LV user","LDNO HV: LV sub user","LDNO HV: HV user"]
["LDNO discount using data in this model",null,0.29059721025222551,0.47962372608553505,0.25654622232167351,0.16038251130437403]
[]
["Additional Input Links"]
["Calc-Net capex'!K5","Suggest these values are set to 0 for those using LR1"]
["Calc-Net capex'!O6 to O10","Suggest these values are set to 0 for those using LR1"]
[]
["Notes"]
[" - Where DNOs do not hold asset data required by the Method M model within the RRP data tables, the DNO can substitute equivalent data within the Method M input tables."]

{"sheet":"Outputs","index":2,"n_rows":30,"n_cols":7,"rows_kept":30,"cut":false,"hidden":false,"merged":[[4,1,4,4]]}
[{"$f":"\"Extended Method M for \"&Inputs!B5&\" in \"&Inputs!B6&\"  Status: \"&Inputs!B7&\"\"","v":"Extended Method M for WPD East Midlands in 2015/16  Status: Indicative"},null,null,null,null,null,"Index"]
[]
["The data table below is used to populate EDCM table 1181 (LDNO discounts)"]
[]
[]
["Boundary category","LV demand end user","LV Sub demand or LV generation end user","HV demand or LV Sub generation end user","HV generation end user"]
["Boundary 0000",{"$f":"IF((SUM('Allocation Summary'!B$13:H$13)-SUMPRODUCT('Allocation Summary'!B22:E22,'Allocation Summary'!E$13:H$13))/(1-SUMPRODUCT('Allocation Summary'!F22:I22,'Allocation Summary'!E$13:H$13))>1,1,(SUM('Allocation Summary'!B$13:H$13)-SUMPRODUCT('Allocation Summary'!B22:E22,'Allocation Summary'!E$13:H$13))/(1-SUMPRODUCT('Allocation Summary'!F22:I22,'Allocation Summary'!E$13:H$13)))","v":0.90875727273409557},{"$f":"IF((SUM('Allocation Summary'!C$13:H$13)-SUMPRODUCT('Allocation Summary'!B22:E22,'Allocation Summary'!E$13:H$13))/(1-'Allocation Summary'!B$13-SUMPRODUCT('Allocation Summary'!F22:I22,'Allocation Summary'!E$13:H$13))>1,1,(SUM('Allocation Summary'!C$13:H$13)-SUMPRODUCT('Allocation Summary'!B22:E22,'Allocation Summary'!E$13:H$13))/(1-'Allocation Summary'!B$13-SUMPRODUCT('Allocation Summary'!F22:I22,'Allocation Summary'!E$13:H$13)))","v":0.87083566484530928},{"$f":"IF((SUM('Allocation Summary'!D$13:H$13)-SUMPRODUCT('Allocation Summary'!B22:E22,'Allocation Summary'!E$13:H$13))/(1-SUM('Allocation Summary'!B$13:C$13)-SUMPRODUCT('Allocation Summary'!F22:I22,'Allocation Summary'!E$13:H$13))>1,1,(SUM('Allocation Summary'!D$13:H$13)-SUMPRODUCT('Allocation Summary'!B22:E22,'Allocation Summary'!E$13:H$13))/(1-SUM('Allocation Summary'!B$13:C$13)-SUMPRODUCT('Allocation Summary'!F22:I22,'Allocation Summary'!E$13:H$13)))","v":0.85477176708013125},{"$f":"IF((SUM('Allocation Summary'!E$13:H$13)-SUMPRODUCT('Allocation Summary'!B22:E22,'Allocation Summary'!E$13:H$13))/(1-SUM('Allocation Summary'!B$13:D$13)-SUMPRODUCT('Allocation Summary'!F22:I22,'Allocation Summary'!E$13:H$13))>1,1,(SUM('Allocation Summary'!E$13:H$13)-SUMPRODUCT('Allocation Summary'!B22:E22,'Allocation Summary'!E$13:H$13))/(1-SUM('Allocation Summary'!B$13:D$13)-SUMPRODUCT('Allocation Summary'!F22:I22,'Allocation Summary'!E$13:H$13)))","v":0.78985814989728487}]
["Boundary 132kV",{"$f":"IF((SUM('Allocation Summary'!B$13:H$13)-SUMPRODUCT('Allocation Summary'!B23:E23,'Allocation Summary'!E$13:H$13))/(1-SUMPRODUCT('Allocation Summary'!F23:I23,'Allocation Summary'!E$13:H$13))>1,1,(SUM('Allocation Summary'!B$13:H$13)-SUMPRODUCT('Allocation Summary'!B23:E23,'Allocation Summary'!E$13:H$13))/(1-SUMPRODUCT('Allocation Summary'!F23:I23,'Allocation Summary'!E$13:H$13)))","v":0.73743042443347684},{"$f":"IF((SUM('Allocation Summary'!C$13:H$13)-SUMPRODUCT('Allocation Summary'!B23:E23,'Allocation Summary'!E$13:H$13))/(1-'Allocation Summary'!B$13-SUMPRODUCT('Allocation Summary'!F23:I23,'Allocation Summary'!E$13:H$13))>1,1,(SUM('Allocation Summary'!C$13:H$13)-SUMPRODUCT('Allocation Summary'!B23:E23,'Allocation Summary'!E$13:H$13))/(1-'Allocation Summary'!B$13-SUMPRODUCT('Allocation Summary'!F23:I23,'Allocation Summary'!E$13:H$13)))","v":0.62830325576455548},{"$f":"IF((SUM('Allocation Summary'!D$13:H$13)-SUMPRODUCT('Allocation Summary'!B23:E23,'Allocation Summary'!E$13:H$13))/(1-SUM('Allocation Summary'!B$13:C$13)-SUMPRODUCT('Allocation Summary'!F23:I23,'Allocation Summary'!E$13:H$13))>1,1,(SUM('Allocation Summary'!D$13:H$13)-SUMPRODUCT('Allocation Summary'!B23:E23,'Allocation Summary'!E$13:H$13))/(1-SUM('Allocation Summary'!B$13:C$13)-SUMPRODUCT('Allocation Summary'!F23:I23,'Allocation Summary'!E$13:H$13)))","v":0.58207611038501428},{"$f":"IF((SUM('Allocation Summary'!E$13:H$13)-SUMPRODUCT('Allocation Summary'!B23:E23,'Allocation Summary'!E$13:H$13))/(1-SUM('Allocation Summary'!B$13:D$13)-SUMPRODUCT('Allocation Summary'!F23:I23,'Allocation Summary'!E$13:H$13))>1,1,(SUM('Allocation Summary'!E$13:H$13)-SUMPRODUCT('Allocation Summary'!B23:E23,'Allocation Summary'!E$13:H$13))/(1-SUM('Allocation Summary'!B$13:D$13)-SUMPRODUCT('Allocation Summary'!F23:I23,'Allocation Summary'!E$13:H$13)))","v":0.39527392435964265}]
["Boundary 132kV/EHV",{"$f":"IF((SUM('Allocation Summary'!B$13:H$13)-SUMPRODUCT('Allocation Summary'!B24:E24,'Allocation Summary'!E$13:H$13))/(1-SUMPRODUCT('Allocation Summary'!F24:I24,'Allocation Summary'!E$13:H$13))>1,1,(SUM('Allocation Summary'!B$13:H$13)-SUMPRODUCT('Allocation Summary'!B24:E24,'Allocation Summary'!E$13:H$13))/(1-SUMPRODUCT('Allocation Summary'!F24:I24,'Allocation Summary'!E$13:H$13)))","v":0.64796547536746707},{"$f":"IF((SUM('Allocation Summary'!C$13:H$13)-SUMPRODUCT('Allocation Summary'!B24:E24,'Allocation Summary'!E$13:H$13))/(1-'Allocation Summary'!B$13-SUMPRODUCT('Allocation Summary'!F24:I24,'Allocation Summary'!E$13:H$13))>1,1,(SUM('Allocation Summary'!C$13:H$13)-SUMPRODUCT('Allocation Summary'!B24:E24,'Allocation Summary'!E$13:H$13))/(1-'Allocation Summary'!B$13-SUMPRODUCT('Allocation Summary'!F24:I24,'Allocation Summary'!E$13:H$13)))","v":0.50165556545513235},{"$f":"IF((SUM('Allocation Summary'!D$13:H$13)-SUMPRODUCT('Allocation Summary'!B24:E24,'Allocation Summary'!E$13:H$13))/(1-SUM('Allocation Summary'!B$13:C$13)-SUMPRODUCT('Allocation Summary'!F24:I24,'Allocation Summary'!E$13:H$13))>1,1,(SUM('Allocation Summary'!D$13:H$13)-SUMPRODUCT('Allocation Summary'!B24:E24,'Allocation Summary'!E$13:H$13))/(1-SUM('Allocation Summary'!B$13:C$13)-SUMPRODUCT('Allocation Summary'!F24:I24,'Allocation Summary'!E$13:H$13)))","v":0.43967751215747286},{"$f":"IF((SUM('Allocation Summary'!E$13:H$13)-SUMPRODUCT('Allocation Summary'!B24:E24,'Allocation Summary'!E$13:H$13))/(1-SUM('Allocation Summary'!B$13:D$13)-SUMPRODUCT('Allocation Summary'!F24:I24,'Allocation Summary'!E$13:H$13))>1,1,(SUM('Allocation Summary'!E$13:H$13)-SUMPRODUCT('Allocation Summary'!B24:E24,'Allocation Summary'!E$13:H$13))/(1-SUM('Allocation Summary'!B$13:D$13)-SUMPRODUCT('Allocation Summary'!F24:I24,'Allocation Summary'!E$13:H$13)))","v":0.18922648935380887}]
["Boundary EHV",{"$f":"IF((SUM('Allocation Summary'!B$13:H$13)-SUMPRODUCT('Allocation Summary'!B25:E25,'Allocation Summary'!E$13:H$13))/(1-SUMPRODUCT('Allocation Summary'!F25:I25,'Allocation Summary'!E$13:H$13))>1,1,(SUM('Allocation Summary'!B$13:H$13)-SUMPRODUCT('Allocation Summary'!B25:E25,'Allocation Summary'!E$13:H$13))/(1-SUMPRODUCT('Allocation Summary'!F25:I25,'Allocation Summary'!E$13:H$13)))","v":0.62301716407420193},{"$f":"IF((SUM('Allocation Summary'!C$13:H$13)-SUMPRODUCT('Allocation Summary'!B25:E25,'Allocation Summary'!E$13:H$13))/(1-'Allocation Summary'!B$13-SUMPRODUCT('Allocation Summary'!F25:I25,'Allocation Summary'!E$13:H$13))>1,1,(SUM('Allocation Summary'!C$13:H$13)-SUMPRODUCT('Allocation Summary'!B25:E25,'Allocation Summary'!E$13:H$13))/(1-'Allocation Summary'!B$13-SUMPRODUCT('Allocation Summary'!F25:I25,'Allocation Summary'!E$13:H$13)))","v":0.46633842689530086},{"$f":"IF((SUM('Allocation Summary'!D$13:H$13)-SUMPRODUCT('Allocation Summary'!B25:E25,'Allocation Summary'!E$13:H$13))/(1-SUM('Allocation Summary'!B$13:C$13)-SUMPRODUCT('Allocation Summary'!F25:I25,'Allocation Summary'!E$13:H$13))>1,1,(SUM('Allocation Summary'!D$13:H$13)-SUMPRODUCT('Allocation Summary'!B25:E25,'Allocation Summary'!E$13:H$13))/(1-SUM('Allocation Summary'!B$13:C$13)-SUMPRODUCT('Allocation Summary'!F25:I25,'Allocation Summary'!E$13:H$13)))","v":0.39996805506401284},{"$f":"IF((SUM('Allocation Summary'!E$13:H$13)-SUMPRODUCT('Allocation Summary'!B25:E25,'Allocation Summary'!E$13:H$13))/(1-SUM('Allocation Summary'!B$13:D$13)-SUMPRODUCT('Allocation Summary'!F25:I25,'Allocation Summary'!E$13:H$13))>1,1,(SUM('Allocation Summary'!E$13:H$13)-SUMPRODUCT('Allocation Summary'!B25:E25,'Allocation Summary'!E$13:H$13))/(1-SUM('Allocation Summary'!B$13:D$13)-SUMPRODUCT('Allocation Summary'!F25:I25,'Allocation Summary'!E$13:H$13)))","v":0.13176783539636305}]
["Boundary HVplus",{"$f":"IF((SUM('Allocation Summary'!B$13:H$13)-SUMPRODUCT('Allocation Summary'!B26:E26,'Allocation Summary'!E$13:H$13))/(1-SUMPRODUCT('Allocation Summary'!F26:I26,'Allocation Summary'!E$13:H$13))>1,1,(SUM('Allocation Summary'!B$13:H$13)-SUMPRODUCT('Allocation Summary'!B26:E26,'Allocation Summary'!E$13:H$13))/(1-SUMPRODUCT('Allocation Summary'!F26:I26,'Allocation Summary'!E$13:H$13)))","v":0.56580411174020795},{"$f":"IF((SUM('Allocation Summary'!C$13:H$13)-SUMPRODUCT('Allocation Summary'!B26:E26,'Allocation Summary'!E$13:H$13))/(1-'Allocation Summary'!B$13-SUMPRODUCT('Allocation Summary'!F26:I26,'Allocation Summary'!E$13:H$13))>1,1,(SUM('Allocation Summary'!C$13:H$13)-SUMPRODUCT('Allocation Summary'!B26:E26,'Allocation Summary'!E$13:H$13))/(1-'Allocation Summary'!B$13-SUMPRODUCT('Allocation Summary'!F26:I26,'Allocation Summary'!E$13:H$13)))","v":0.38534692117940034},{"$f":"IF((SUM('Allocation Summary'!D$13:H$13)-SUMPRODUCT('Allocation Summary'!B26:E26,'Allocation Summary'!E$13:H$13))/(1-SUM('Allocation Summary'!B$13:C$13)-SUMPRODUCT('Allocation Summary'!F26:I26,'Allocation Summary'!E$13:H$13))>1,1,(SUM('Allocation Summary'!D$13:H$13)-SUMPRODUCT('Allocation Summary'!B26:E26,'Allocation Summary'!E$13:H$13))/(1-SUM('Allocation Summary'!B$13:C$13)-SUMPRODUCT('Allocation Summary'!F26:I26,'Allocation Summary'!E$13:H$13)))","v":0.30890380545863305},{"$f":"IF((SUM('Allocation Summary'!E$13:H$13)-SUMPRODUCT('Allocation Summary'!B26:E26,'Allocation Summary'!E$13:H$13))/(1-SUM('Allocation Summary'!B$13:D$13)-SUMPRODUCT('Allocation Summary'!F26:I26,'Allocation Summary'!E$13:H$13))>1,1,(SUM('Allocation Summary'!E$13:H$13)-SUMPRODUCT('Allocation Summary'!B26:E26,'Allocation Summary'!E$13:H$13))/(1-SUM('Allocation Summary'!B$13:D$13)-SUMPRODUCT('Allocation Summary'!F26:I26,'Allocation Summary'!E$13:H$13)))","v":0}]
[]
[]
[]
[]
["Input data reconciliation check"]
["Compares results to current CDCM Method M*"]
[null,"LDNO LV: LV user","LDNO HV: LV user","LDNO HV: LV sub user","LDNO HV: HV user"]
["LDNO discount using data in this model",{"$f":"'Allocation Summary'!B9*(1-'Allocation Summary'!B10*Inputs!B12)","v":0.27613031149904582},{"$f":"'Allocation Summary'!B9+'Allocation Summary'!C9+'Allocation Summary'!D9*(1-'Allocation Summary'!D10*Inputs!B13)","v":0.46779662873581013},{"$f":"('Allocation Summary'!C9+'Allocation Summary'!D9*(1-'Allocation Summary'!D10*Inputs!B13))/(1-'Allocation Summary'!B9)","v":0.24660631399044636},{"$f":"'Allocation Summary'!D9*(1-'Allocation Summary'!D10*Inputs!B13)/(1-'Allocation Summary'!B9-'Allocation Summary'!C9)","v":0.15290831961379545}]
["LDNO discount using Method M",{"$f":"+Inputs!C34","v":0.29059721025222551},{"$f":"+Inputs!D34","v":0.47962372608553505},{"$f":"+Inputs!E34","v":0.25654622232167351},{"$f":"+Inputs!F34","v":0.16038251130437403}]
["*Note variances at LV:LV are expected as this version of extended Method M does not implement DCP095"]
[]
[]
[]
[]
["Comparrison to last year's model",{"$f":"B7-'[8]Allocation Summary'!B25","v":0},{"$f":"C7-'[8]Allocation Summary'!C25","v":0},{"$f":"D7-'[8]Allocation Summary'!D25","v":0},{"$f":"E7-'[8]Allocation Summary'!E25","v":0}]
[null,{"$f":"B8-'[8]Allocation Summary'!B26","v":0},{"$f":"C8-'[8]Allocation Summary'!C26","v":0},{"$f":"D8-'[8]Allocation Summary'!D26","v":0},{"$f":"E8-'[8]Allocation Summary'!E26","v":0}]
[null,{"$f":"B9-'[8]Allocation Summary'!B27","v":0},{"$f":"C9-'[8]Allocation Summary'!C27","v":0},{"$f":"D9-'[8]Allocation Summary'!D27","v":0},{"$f":"E9-'[8]Allocation Summary'!E27","v":0}]
[null,{"$f":"B10-'[8]Allocation Summary'!B28","v":0},{"$f":"C10-'[8]Allocation Summary'!C28","v":0},{"$f":"D10-'[8]Allocation Summary'!D28","v":0},{"$f":"E10-'[8]Allocation Summary'!E28","v":0}]
[null,{"$f":"B11-'[8]Allocation Summary'!B29","v":0},{"$f":"C11-'[8]Allocation Summary'!C29","v":0},{"$f":"D11-'[8]Allocation Summary'!D29","v":0},{"$f":"E11-'[8]Allocation Summary'!E29","v":0}]

{"sheet":"Allocation Summary","index":3,"n_rows":40,"n_cols":9,"rows_kept":40,"cut":false,"hidden":false,"merged":[[2,1,2,5],[19,1,19,4],[19,5,19,8],[19,9,19,12]]}
[null,null,null,null,null,null,"Index"]
[]
["Category","% by network tier "]
[null,"LV","LV/HV","HV","EHV","Unallocated"]
["Opex and transmission exit charges",{"$f":"'DNO - Final Allocation'!I47","v":0.47061225443098453},{"$f":"'DNO - Final Allocation'!H47","v":7.8595556024634902E-2},{"$f":"'DNO - Final Allocation'!G47","v":0.1887969141801584},{"$f":"'DNO - Final Allocation'!E47","v":0.26199527536422218}]
["Depreciation",{"$f":"'DNO - Final Allocation'!I46","v":0.13596332621236557},{"$f":"'DNO - Final Allocation'!H46","v":5.9749506838939877E-2},{"$f":"'DNO - Final Allocation'!G46","v":0.27202086792538993},{"$f":"'DNO - Final Allocation'!E46","v":0.53226629902330469}]
["Return",{"$f":"'DNO - Final Allocation'!I45","v":0.13596332621236557},{"$f":"'DNO - Final Allocation'!H45","v":5.9749506838939877E-2},{"$f":"'DNO - Final Allocation'!G45","v":0.27202086792538993},{"$f":"'DNO - Final Allocation'!E45","v":0.53226629902330469}]
["Weighted Average",{"$f":"'DNO - Final Allocation'!N50","v":0.24826709072033157},{"$f":"'DNO - Final Allocation'!M50","v":6.6073992265868187E-2},{"$f":"'DNO - Final Allocation'!L50","v":0.244092007215815},{"$f":"'DNO - Final Allocation'!K50","v":0.44156690979798519}]
["Weighted Average (after incentive and pension deficit costs removed and weighted by units flowing)",{"$f":"'DNO - Final Allocation'!O79","v":0.29359194117610232},{"$f":"'DNO - Final Allocation'!N79","v":7.8136782423746221E-2},{"$f":"'DNO - Final Allocation'!M79","v":0.19407538814035941},{"$f":"'DNO - Final Allocation'!L79","v":0.34295316099388756},{"$f":"'DNO - Final Allocation'!P79","v":9.1242727265904447E-2}]
["Direct cost %",{"$f":"'Calc - DNO Opex Allocation'!AA48","v":0.60076614174586374},{"$f":"'Calc - DNO Opex Allocation'!Z48","v":0.89547713119773154},{"$f":"'Calc - DNO Opex Allocation'!Y48","v":0.91817630948384332},{"$f":"'Calc - DNO Opex Allocation'!X48","v":0.73814967115454633},"N/A"]
[]
[null,"LV","HV/LV","HV","EHV/HV","EHV","132kV/EHV","132kV"]
["Weighted by units flowing",{"$f":"B9","v":0.29359194117610232},7.8136782423746221E-2,0.19407538814035941,{"$f":"E9*'Calc-MEAV'!$N28","v":4.8362918314341266E-2},{"$f":"E9*'Calc-MEAV'!$N29","v":3.3798445312917869E-2},{"$f":"E9*'Calc-MEAV'!$N30","v":2.8688668427148099E-2},{"$f":"E9*'Calc-MEAV'!$N31","v":0.23210312893948032}]
["Direct cost %",0.60076614174586374,0.89547713119773154,0.91817630948384332,{"$f":"E10","v":0.73814967115454633},{"$f":"E10","v":0.73814967115454633},{"$f":"E10","v":0.73814967115454633},{"$f":"E10","v":0.73814967115454633}]
[]
["Options","DCP071"]
[null,true]
["Discount matrix"]
[]
[null,"Network levels provided or bypassed by the DNO",null,null,null,"Network levels bypassed by the DNO"]
["Boundary category","EHV/HV","EHV","132kV/EHV","132kV","EHV/HV","EHV","132kV/EHV","132kV"]
["Boundary 0000",0,0,0,0,0,0,0,0]
["Boundary 132kV",0,0,0,{"$f":"IF($B$17,Inputs!$B$15*$H$14,1)","v":0.73814967115454633},0,0,0,0]
["Boundary 132kV/EHV",0,0,1,1,0,0,0,0]
["Boundary EHV",0,{"$f":"IF($B$17,Inputs!$B$14*$F$14,1)","v":0.73814967115454633},1,1,0,0,0,0]
["Boundary HVplus",1,1,1,1,0,0,0,0]
[]
[]
[]
[null,{"$f":"B13-'[8]Allocation Summary'!B13","v":0},{"$f":"C13-'[8]Allocation Summary'!C13","v":0},{"$f":"D13-'[8]Allocation Summary'!D13","v":0},{"$f":"E13-'[8]Allocation Summary'!E13","v":0},{"$f":"F13-'[8]Allocation Summary'!F13","v":0},{"$f":"G13-'[8]Allocation Summary'!G13","v":0},{"$f":"H13-'[8]Allocation Summary'!H13","v":0}]
[null,{"$f":"B14-'[8]Allocation Summary'!B14","v":0},{"$f":"C14-'[8]Allocation Summary'!C14","v":0},{"$f":"D14-'[8]Allocation Summary'!D14","v":0},{"$f":"E14-'[8]Allocation Summary'!E14","v":0},{"$f":"F14-'[8]Allocation Summary'!F14","v":0},{"$f":"G14-'[8]Allocation Summary'!G14","v":0},{"$f":"H14-'[8]Allocation Summary'!H14","v":0}]
[]
[]
[null,{"$f":"B22-'[8]Allocation Summary'!F25","v":0},{"$f":"C22-'[8]Allocation Summary'!G25","v":0},{"$f":"D22-'[8]Allocation Summary'!H25","v":0},{"$f":"E22-'[8]Allocation Summary'!I25","v":0},{"$f":"F22-'[8]Allocation Summary'!J25","v":0},{"$f":"G22-'[8]Allocation Summary'!K25","v":0},{"$f":"H22-'[8]Allocation Summary'!L25","v":0},{"$f":"I22-'[8]Allocation Summary'!M25","v":0}]
[null,{"$f":"B23-'[8]Allocation Summary'!F26","v":0},{"$f":"C23-'[8]Allocation Summary'!G26","v":0},{"$f":"D23-'[8]Allocation Summary'!H26","v":0},{"$f":"E23-'[8]Allocation Summary'!I26","v":0},{"$f":"F23-'[8]Allocation Summary'!J26","v":0},{"$f":"G23-'[8]Allocation Summary'!K26","v":0},{"$f":"H23-'[8]Allocation Summary'!L26","v":0},{"$f":"I23-'[8]Allocation Summary'!M26","v":0}]
[null,{"$f":"B24-'[8]Allocation Summary'!F27","v":0},{"$f":"C24-'[8]Allocation Summary'!G27","v":0},{"$f":"D24-'[8]Allocation Summary'!H27","v":0},{"$f":"E24-'[8]Allocation Summary'!I27","v":0},{"$f":"F24-'[8]Allocation Summary'!J27","v":0},{"$f":"G24-'[8]Allocation Summary'!K27","v":0},{"$f":"H24-'[8]Allocation Summary'!L27","v":0},{"$f":"I24-'[8]Allocation Summary'!M27","v":0}]
[null,{"$f":"B25-'[8]Allocation Summary'!F28","v":0},{"$f":"C25-'[8]Allocation Summary'!G28","v":0},{"$f":"D25-'[8]Allocation Summary'!H28","v":0},{"$f":"E25-'[8]Allocation Summary'!I28","v":0},{"$f":"F25-'[8]Allocation Summary'!J28","v":0},{"$f":"G25-'[8]Allocation Summary'!K28","v":0},{"$f":"H25-'[8]Allocation Summary'!L28","v":0},{"$f":"I25-'[8]Allocation Summary'!M28","v":0}]
[null,{"$f":"B26-'[8]Allocation Summary'!F29","v":0},{"$f":"C26-'[8]Allocation Summary'!G29","v":0},{"$f":"D26-'[8]Allocation Summary'!H29","v":0},{"$f":"E26-'[8]Allocation Summary'!I29","v":0},{"$f":"F26-'[8]Allocation Summary'!J29","v":0},{"$f":"G26-'[8]Allocation Summary'!K29","v":0},{"$f":"H26-'[8]Allocation Summary'!L29","v":0},{"$f":"I26-'[8]Allocation Summary'!M29","v":0}]
[null,{"$f":"B27-'[8]Allocation Summary'!F30","v":0},{"$f":"C27-'[8]Allocation Summary'!G30","v":0},{"$f":"D27-'[8]Allocation Summary'!H30","v":0},{"$f":"E27-'[8]Allocation Summary'!I30","v":0},{"$f":"F27-'[8]Allocation Summary'!J30","v":0},{"$f":"G27-'[8]Allocation Summary'!K30","v":0},{"$f":"H27-'[8]Allocation Summary'!L30","v":0},{"$f":"I27-'[8]Allocation Summary'!M30","v":0}]
[null,{"$f":"B28-'[8]Allocation Summary'!F31","v":0},{"$f":"C28-'[8]Allocation Summary'!G31","v":0},{"$f":"D28-'[8]Allocation Summary'!H31","v":0},{"$f":"E28-'[8]Allocation Summary'!I31","v":0},{"$f":"F28-'[8]Allocation Summary'!J31","v":0},{"$f":"G28-'[8]Allocation Summary'!K31","v":0},{"$f":"H28-'[8]Allocation Summary'!L31","v":0},{"$f":"I28-'[8]Allocation Summary'!M31","v":0}]

{"sheet":"DNO - Final Allocation","index":4,"n_rows":81,"n_cols":19,"rows_kept":81,"cut":false,"hidden":false,"merged":[[69,3,69,9],[69,11,69,17],[42,4,42,8],[42,10,42,13],[42,15,42,19],[68,3,68,10],[68,11,68,17]]}
["Step 1. Format price control allowed revenue data"]
["Index"]
[]
[null,"I) DPCR3 type presentation",null,null,null,null,null,null,null,null,null,"ii) DPCR4 type presentation"]
[]
[null,null,null,"2005/06","2006/07",null,"2007/08","2008/09","2009/10",null,null,null,null,null,"2005/06","2006/07","2007/08","2008/09","2009/10"]
[null,null,null,null,null,null,null,null,null,null,null,"Opening asset value",null,null,{"$f":"'Allowed revenue -DPCR4'!D3","v":947.9},{"$f":"'Allowed revenue -DPCR4'!E3","v":989.2},{"$f":"'Allowed revenue -DPCR4'!F3","v":1030.2},{"$f":"'Allowed revenue -DPCR4'!G3","v":1064.8},{"$f":"'Allowed revenue -DPCR4'!H3","v":1093.2}]
[null,"Allowed revenue",null,{"$f":"O33","v":241.23880850362539},{"$f":"P33","v":243.40995778015801},null,{"$f":"Q33","v":246.0635846736979},{"$f":"R33","v":249.19968918424502},{"$f":"S33","v":251.85331607778491},null,null,"Total capex",null,null,{"$f":"'Allowed revenue -DPCR4'!D4","v":117.8},{"$f":"'Allowed revenue -DPCR4'!E4","v":117.5},{"$f":"'Allowed revenue -DPCR4'!F4","v":117},{"$f":"'Allowed revenue -DPCR4'!G4","v":116.6},{"$f":"'Allowed revenue -DPCR4'!H4","v":116.4}]
[null,null,null,null,null,null,null,null,null,null,null,"Depreciation",null,null,{"$f":"'Allowed revenue -DPCR4'!D5","v":-76.5},{"$f":"'Allowed revenue -DPCR4'!E5","v":-76.5},{"$f":"'Allowed revenue -DPCR4'!F5","v":-82.4},{"$f":"'Allowed revenue -DPCR4'!G5","v":-88.2},{"$f":"'Allowed revenue -DPCR4'!H5","v":-94.1}]
[null,"Opex (incl pensions after  57.7% capitalized)",null,{"$f":"O14+(1-0.577)*O16","v":80.698999999999998},{"$f":"P14+(1-0.577)*P16","v":83.24130000000001},null,{"$f":"Q14+(1-0.577)*Q16","v":83.74130000000001},{"$f":"R14+(1-0.577)*R16","v":82.441300000000012},{"$f":"S14+(1-0.577)*S16","v":81.74130000000001},null,null,"Closing asset value",null,null,{"$f":"'Allowed revenue -DPCR4'!D6","v":989.2},{"$f":"'Allowed revenue -DPCR4'!E6","v":1030.2},{"$f":"'Allowed revenue -DPCR4'!F6","v":1064.8},{"$f":"'Allowed revenue -DPCR4'!G6","v":1093.2},{"$f":"'Allowed revenue -DPCR4'!H6","v":1115.5999999999999}]
[null,"Quality Reward",null,{"$f":"O20","v":""},{"$f":"P20","v":""},{"$f":"Q20","v":""},{"$f":"Q20","v":""},{"$f":"R20","v":""},{"$f":"S20","v":""},null,null,"Present value of opening/closing RAV",null,null,{"$f":"'Allowed revenue -DPCR4'!D7","v":947.9},null,{"$f":"'Allowed revenue -DPCR4'!F7","v":0},null,{"$f":"'Allowed revenue -DPCR4'!H7","v":851.7}]
[null,"DPCR3 costs",null,{"$f":"O21","v":1.5},null,null,null,null,null,null,null,"5 year movement in closing RAV",null,null,null,{"$f":"'Allowed revenue -DPCR4'!E8","v":0},null,null,{"$f":"'Allowed revenue -DPCR4'!H8","v":96.2}]
[null,"Total Opex",null,{"$f":"SUM(D10:D12)","v":82.198999999999998},{"$f":"SUM(E10:E12)","v":83.24130000000001},null,{"$f":"SUM(G10:G12)","v":83.74130000000001},{"$f":"SUM(H10:H12)","v":82.441300000000012},{"$f":"SUM(I10:I12)","v":81.74130000000001}]
[null,null,null,null,null,null,null,null,null,null,null,"Operating costs (excl pensions)",null,null,{"$f":"'Allowed revenue -DPCR4'!D10","v":75.2},{"$f":"'Allowed revenue -DPCR4'!E10","v":77.7},{"$f":"'Allowed revenue -DPCR4'!F10","v":78.2},{"$f":"'Allowed revenue -DPCR4'!G10","v":76.900000000000006},{"$f":"'Allowed revenue -DPCR4'!H10","v":76.2}]
[null,"Capital elements",null,null,null,null,null,null,null,null,null,"Capex (excl pensions)",null,null,{"$f":"'Allowed revenue -DPCR4'!D11","v":110.3},{"$f":"'Allowed revenue -DPCR4'!E11","v":109.9},{"$f":"'Allowed revenue -DPCR4'!F11","v":109.4},{"$f":"'Allowed revenue -DPCR4'!G11","v":109},{"$f":"'Allowed revenue -DPCR4'!H11","v":108.8}]
[null,"Depreciation",null,{"$f":"-O9","v":76.5},{"$f":"-P9","v":76.5},null,{"$f":"-Q9","v":82.4},{"$f":"-R9","v":88.2},{"$f":"-S9","v":94.1},null,null,"Pensions",null,null,{"$f":"'Allowed revenue -DPCR4'!D12","v":13},{"$f":"'Allowed revenue -DPCR4'!E12","v":13.1},{"$f":"'Allowed revenue -DPCR4'!F12","v":13.1},{"$f":"'Allowed revenue -DPCR4'!G12","v":13.1},{"$f":"'Allowed revenue -DPCR4'!H12","v":13.1}]
[null,"Tax allowance",null,{"$f":"O17","v":27.2},26.3,null,{"$f":"Q17","v":26.4},26.8,26.8,null,null,"Tax allowance",null,null,{"$f":"'Allowed revenue -DPCR4'!D13","v":27.2},{"$f":"'Allowed revenue -DPCR4'!E13","v":26.3},{"$f":"'Allowed revenue -DPCR4'!F13","v":26.4},{"$f":"'Allowed revenue -DPCR4'!G13","v":26.8},{"$f":"'Allowed revenue -DPCR4'!H13","v":26.8}]
[null,"Capital incentive",null,-0.8,0.6,null,-0.6,-0.6,-0.2,null,null,"Capex incentive",null,null,{"$f":"'Allowed revenue -DPCR4'!D14","v":-0.8},{"$f":"'Allowed revenue -DPCR4'!E14","v":0.6},{"$f":"'Allowed revenue -DPCR4'!F14","v":-0.6},{"$f":"'Allowed revenue -DPCR4'!G14","v":-0.6},{"$f":"'Allowed revenue -DPCR4'!H14","v":-0.2}]
[null,"Sliding scale",null,1.4,1.4,null,1.5,1.5,1.6,null,null,"Sliding scale addn income",null,null,{"$f":"'Allowed revenue -DPCR4'!D15","v":1.4},{"$f":"'Allowed revenue -DPCR4'!E15","v":1.4},{"$f":"'Allowed revenue -DPCR4'!F15","v":1.5},{"$f":"'Allowed revenue -DPCR4'!G15","v":1.5},{"$f":"'Allowed revenue -DPCR4'!H15","v":1.6}]
[null,"Return",null,{"$f":"D8-D13-D16-D17-D18-D19","v":54.739808503625405},{"$f":"E8-E13-E16-E17-E18-E19","v":55.368657780158017},null,{"$f":"G8-G13-G16-G17-G18-G19","v":52.622284673697877},{"$f":"H8-H13-H16-H17-H18-H19","v":50.858389184245006},{"$f":"I8-I13-I16-I17-I18-I19","v":47.812016077784925},null,null,"Quality reward/Opex incentive & Other Adjustments",null,null,{"$f":"IF(ISNUMBER('Allowed revenue -DPCR4'!D16+'Allowed revenue -DPCR4'!D17),'Allowed revenue -DPCR4'!D16+'Allowed revenue -DPCR4'!D17,\"\")","v":""},{"$f":"IF(ISNUMBER('Allowed revenue -DPCR4'!E16+'Allowed revenue -DPCR4'!E17),'Allowed revenue -DPCR4'!E16+'Allowed revenue -DPCR4'!E17,\"\")","v":""},{"$f":"IF(ISNUMBER('Allowed revenue -DPCR4'!F16+'Allowed revenue -DPCR4'!F17),'Allowed revenue -DPCR4'!F16+'Allowed revenue -DPCR4'!F17,\"\")","v":""},{"$f":"IF(ISNUMBER('Allowed revenue -DPCR4'!G16+'Allowed revenue -DPCR4'!G17),'Allowed revenue -DPCR4'!G16+'Allowed revenue -DPCR4'!G17,\"\")","v":""},{"$f":"IF(ISNUMBER('Allowed revenue -DPCR4'!H16+'Allowed revenue -DPCR4'!H17),'Allowed revenue -DPCR4'!H16+'Allowed revenue -DPCR4'!H17,\"\")","v":""}]
[null,"Total capital",null,{"$f":"SUM(D16:D20)","v":159.03980850362541},{"$f":"SUM(E16:E20)","v":160.16865778015801},null,{"$f":"SUM(G16:G20)","v":162.32228467369788},{"$f":"SUM(H16:H20)","v":166.758389184245},{"$f":"SUM(I16:I20)","v":170.11201607778492},null,null,"DPCR3 costs",null,null,{"$f":"'Allowed revenue -DPCR4'!D18","v":1.5},{"$f":"'Allowed revenue -DPCR4'!E18","v":"-"},{"$f":"'Allowed revenue -DPCR4'!F18","v":"-"},{"$f":"'Allowed revenue -DPCR4'!G18","v":"-"},{"$f":"'Allowed revenue -DPCR4'!H18","v":"-"}]
[null,"Total capital ex depreciation",null,{"$f":"D21-D16","v":82.539808503625409},{"$f":"E21-E16","v":83.668657780158014},null,{"$f":"G21-G16","v":79.922284673697874},{"$f":"H21-H16","v":78.558389184245002},{"$f":"I21-I16","v":76.012016077784921},null,null,"Total allowed items",null,null,{"$f":"'Allowed revenue -DPCR4'!D19","v":227.7},{"$f":"'Allowed revenue -DPCR4'!E19","v":229},{"$f":"'Allowed revenue -DPCR4'!F19","v":228.1},{"$f":"'Allowed revenue -DPCR4'!G19","v":226.8},{"$f":"'Allowed revenue -DPCR4'!H19","v":226.3}]
[null,null,null,null,null,null,null,null,null,null,null,"PV of allowed items",null,null,{"$f":"'Allowed revenue -DPCR4'!D20","v":221.6},{"$f":"'Allowed revenue -DPCR4'!E20","v":211.2},{"$f":"'Allowed revenue -DPCR4'!F20","v":199.3},{"$f":"'Allowed revenue -DPCR4'!G20","v":187.7},{"$f":"'Allowed revenue -DPCR4'!H20","v":177.5}]
[null,"Allocation of allowed revenue to:-",null,null,null,null,null,null,null,null,null,"5 year movement in closing RAV",null,null,null,null,null,null,{"$f":"'Allowed revenue -DPCR4'!H21","v":96.2}]
[null,null,null,null,null,null,null,null,null,null,null,"TOTAL PV OVER 5 YEARS",null,null,null,null,null,null,{"$f":"'Allowed revenue -DPCR4'!H22","v":1093.5}]
[null,"Opex",null,{"$f":"D13","v":82.198999999999998},{"$f":"E13","v":83.24130000000001},null,{"$f":"G13","v":83.74130000000001},{"$f":"H13","v":82.441300000000012},{"$f":"I13","v":81.74130000000001}]
[null,"Depreciation",null,{"$f":"D16","v":76.5},{"$f":"E16","v":76.5},null,{"$f":"G16","v":82.4},{"$f":"H16","v":88.2},{"$f":"I16","v":94.1},null,null,null,null,null,{"$f":"1/(1+Inputs!B28)","v":0.94746316736936853},{"$f":"O27/(1+Inputs!B28)","v":0.89768645352159604},{"$f":"P27/(1+Inputs!B28)","v":0.85052485055814675},{"$f":"Q27/(1+Inputs!B28)","v":0.8058409688361805},{"$f":"R27/(1+Inputs!B28)","v":0.76350463672952817}]
[null,"Return",null,{"$f":"D20","v":54.739808503625405},{"$f":"E20","v":55.368657780158017},null,{"$f":"G20","v":52.622284673697877},{"$f":"H20","v":50.858389184245006},{"$f":"I20","v":47.812016077784925},null,null,null,null,null,1,{"$f":"O27","v":0.94746316736936853},{"$f":"P27","v":0.89768645352159604},{"$f":"Q27","v":0.85052485055814675},{"$f":"R27","v":0.8058409688361805}]
[null,null,null,null,null,null,null,null,null,null,null,null,null,null,{"$f":"1/(1+Inputs!B28)^0.5","v":0.97337719686120061},{"$f":"1/(1+Inputs!B28)^1.5","v":0.92223904198323059},{"$f":"1/(1+Inputs!B28)^2.5","v":0.87378752378912361},{"$f":"1/(1+Inputs!B28)^3.5","v":0.82788149489708041},{"$f":"1/(1+Inputs!B28)^4.5","v":0.78438722336167555}]
[]
[null,null,null,null,null,null,null,null,null,null,null,"Revenue index",null,null,{"$f":"'Allowed revenue -DPCR4'!D24","v":1},{"$f":"'Allowed revenue -DPCR4'!E24","v":1.0089999999999999},{"$f":"'Allowed revenue -DPCR4'!F24","v":1.02},{"$f":"'Allowed revenue -DPCR4'!G24","v":1.0329999999999999},{"$f":"'Allowed revenue -DPCR4'!H24","v":1.044}]
[null,null,null,null,null,null,null,null,null,null,null,"Discounted revenue index",null,null,{"$f":"O31*O29","v":0.97337719686120061},{"$f":"P31*P29","v":0.9305391933610796},{"$f":"Q31*Q29","v":0.89126327426490615},{"$f":"R31*R29","v":0.85520158422868398},{"$f":"S31*S29","v":0.81890026118958925}]
[null,null,null,null,null,null,null,null,null,null,null,"Price control revenue",null,null,{"$f":"($S$25-$N$39)/SUM($O$32:$U$32)*O31","v":241.23880850362539},{"$f":"($S$25-$N$39)/SUM($O$32:$U$32)*P31","v":243.40995778015801},{"$f":"($S$25-$N$39)/SUM($O$32:$U$32)*Q31","v":246.0635846736979},{"$f":"($S$25-$N$39)/SUM($O$32:$U$32)*R31","v":249.19968918424502},{"$f":"($S$25-$N$39)/SUM($O$32:$U$32)*S31","v":251.85331607778491}]
[null,null,null,null,null,null,null,null,null,null,null,"Excluded services revenue",null,null,{"$f":"'Allowed revenue -DPCR4'!D27","v":3.5},{"$f":"'Allowed revenue -DPCR4'!E27","v":3.5},{"$f":"'Allowed revenue -DPCR4'!F27","v":3.5},{"$f":"'Allowed revenue -DPCR4'!G27","v":3.5},{"$f":"'Allowed revenue -DPCR4'!H27","v":3.5}]
[null,null,null,null,null,null,null,null,null,null,null,"Total revenue",null,null,{"$f":"O34+O33","v":244.73880850362539},{"$f":"P34+P33","v":246.90995778015801},{"$f":"Q34+Q33","v":249.5635846736979},{"$f":"R34+R33","v":252.69968918424502},{"$f":"S34+S33","v":255.35331607778491}]
[null,null,null,null,null,null,null,null,null,null,null,"PV of total revenue",null,null,{"$f":"O35*O29","v":238.22317538440905},{"$f":"P35*P29","v":227.71000291929283},{"$f":"Q35*Q29","v":218.06554667996778},{"$f":"R35*R29","v":209.20539644188034},{"$f":"S35*S29","v":200.29587857445}]
[null,null,null,null,null,null,null,null,null,null,null,"TOTAL PV OVER 5 YEARS",null,null,null,null,null,null,{"$f":"SUM(O36:S36)","v":1093.5}]
[]
[null,null,null,null,null,null,null,null,null,null,null,"PV of excluded service revenue",null,{"$f":"SUM(O39:S39)","v":15.335853683123087},{"$f":"O34*O29","v":3.4068201890142022},{"$f":"P34*P29","v":3.2278366469413071},{"$f":"Q34*Q29","v":3.0582563332619328},{"$f":"R34*R29","v":2.8975852321397815},{"$f":"S34*S29","v":2.7453552817658644}]
[]
["Step 2. Allocate price control revenues to network tiers "]
[]
[null,"Hence DPCR4 revenue made up of","Total DPCR4","Basis of allocation","% used",null,null,null,null,null,"£m"]
[null,null,null,null,"EHV",null,"HV","HV/LV","LV",null,"EHV","HV","HV/LV","LV"]
[null,"Return",{"$f":"SUM(D22:I22)","v":400.70115621951118},"Net Capex",{"$f":"VLOOKUP($D45,'Calc-Drivers'!$B$17:$F$27,E$51,FALSE)","v":0.53226629902330469},null,{"$f":"VLOOKUP($D45,'Calc-Drivers'!$B$17:$F$27,G$51,FALSE)","v":0.27202086792538993},{"$f":"VLOOKUP($D45,'Calc-Drivers'!$B$17:$F$27,H$51,FALSE)","v":5.9749506838939877E-2},{"$f":"VLOOKUP($D45,'Calc-Drivers'!$B$17:$F$27,I$51,FALSE)","v":0.13596332621236557},null,{"$f":"$C45*E45","v":213.27972143531827},{"$f":"$C45*G45","v":108.99907629353869},23.941696473908799,54.480662016745455]
[null,"Depreciation",{"$f":"SUM(D16:I16)","v":417.70000000000005},"Net Capex",{"$f":"VLOOKUP($D46,'Calc-Drivers'!$B$17:$F$27,E$51,FALSE)","v":0.53226629902330469},null,{"$f":"VLOOKUP($D46,'Calc-Drivers'!$B$17:$F$27,G$51,FALSE)","v":0.27202086792538993},{"$f":"VLOOKUP($D46,'Calc-Drivers'!$B$17:$F$27,H$51,FALSE)","v":5.9749506838939877E-2},{"$f":"VLOOKUP($D46,'Calc-Drivers'!$B$17:$F$27,I$51,FALSE)","v":0.13596332621236557},null,{"$f":"$C46*E46","v":222.32763310203438},113.62311653243539,24.957369006625189,56.791881358905101]
[null,"Operating costs",{"$f":"SUM(D13:I13)","v":413.36420000000004},"Overall Opex split",{"$f":"'Calc - DNO Opex Allocation'!AN41","v":0.26199527536422218},null,{"$f":"'Calc - DNO Opex Allocation'!AO41","v":0.1887969141801584},{"$f":"'Calc - DNO Opex Allocation'!AP41","v":7.8595556024634902E-2},{"$f":"'Calc - DNO Opex Allocation'!AQ41","v":0.47061225443098453},null,{"$f":"$C47*E47","v":108.29946740471142},78.041885392549844,32.488589139678389,{"$f":"$C47*I47","v":194.53425806306041}]
[]
[null,"Total",{"$f":"SUM(C45:C47)","v":1231.7653562195112},null,null,null,null,null,null,null,{"$f":"SUM(K45:K48)","v":543.90682194206408},{"$f":"SUM(L45:L48)","v":300.66407821852391},{"$f":"SUM(M45:M48)","v":81.387654620212373},{"$f":"SUM(N45:N48)","v":305.80680143871098}]
[null,null,null,null,null,null,null,null,null,null,{"$f":"K49/SUM($K$49:$N$49)","v":0.44156690979798519},{"$f":"L49/SUM($K$49:$N$49)","v":0.244092007215815},{"$f":"M49/SUM($K$49:$N$49)","v":6.6073992265868187E-2},{"$f":"N49/SUM($K$49:$N$49)","v":0.24826709072033157}]
[null,null,null,null,5,null,4,3,2]
[]
[null,null,null,"NET CAPEX SPLIT FROM \"CALC -NET CAPEX\" SHEET"]
[null,null,null,"OVERALL OPEX SPLIT FROM \"CALC DNO OPEX ALLOCATION\" SHEET"]
[]
["Step 3. Remove incentive revenue and pension deficit payment from allocations"]
[]
[null,"2007/08 allowed revenue source from page \"summary allowed revenue\""]
[null,"Base revenue",null,null,null,{"$f":"'Summary of revenue'!J11","v":276.42685499999999},{"$f":"F59/$F$64","v":0.94327570891569268},null,null,null,null,null,null,null,null,"£m"]
[null,"Allowed pass through items",null,null,null,{"$f":"'Summary of revenue'!J12","v":-4.5983270000000003},{"$f":"F60/$F$64","v":-1.5691276307980895E-2}]
[null,"Incentive revenue",null,null,null,{"$f":"'Summary of revenue'!J13","v":26.407907999999999},{"$f":"F61/$F$64","v":9.0114030851598664E-2},null,null,null,null,null,"Total allowed income",null,null,{"$f":"F64","v":293.04990300000003},"From 2007/08 revenue summary"]
[null,"Under/over revoery",null,null,null,{"$f":"'Summary of revenue'!J21","v":-11.856533000000001},{"$f":"F62/$F$64","v":-4.0459092047541133E-2}]
[null,"Excluded",null,null,null,{"$f":"'Summary of revenue'!J46+'Summary of revenue'!J47","v":6.67},{"$f":"F63/$F$64","v":2.2760628588230584E-2},null,null,null,null,null,"Less incentive revenue ?",null,"Y",{"$f":"IF(O63=\"Y\",-F61,0)","v":-26.407907999999999},"From 2007/08 revenue summary"]
[null,"Total",null,null,null,{"$f":"SUM(F59:F63)","v":293.04990300000003},{"$f":"SUM(G59:G63)","v":0.99999999999999989},null,null,null,null,null,"Less Pension deficit payment?",null,"N",{"$f":"IF(O64=\"Y\",-F66,0)","v":0}]
[null,null,null,null,null,null,null,null,null,null,null,null,"Less transmission exit charges?",null,"Y",{"$f":"IF(O65=\"Y\",-'RRP 1.3'!AH12,0)","v":-4.4000000000000004}]
[null,"Input pension deficit payment",null,null,null,0]
[null,null,null,null,null,null,null,null,null,null,null,null,"Total revenue to share",null,null,{"$f":"P61+P63+P64+P65","v":262.24199500000003}]
[]
[null,null,null,"Step 3.a. Split out pension deficit and incentive payments",null,null,null,null,null,null,null,"Step 2.b. Divide cost by units flowing - effectively adjust the cost because of electricity lost as it flows thorugh the network meaning that there is more cost in the lower tiers"]
[null,"SPLIT OF TARIFFS",null,"£m",null,null,null,null,null,null,null,"p/kWh"]
[null,null,null,"Total",null,"EHV","HV","HV/LV","LV","Not to be split",null,"EHV","HV","HV/LV","LV","Not to be split",null,"Total"]
[]
[null,"Income",null,{"$f":"SUM(F73:J73)","v":293.04990300000003},null,{"$f":"$P$67*K50","v":115.7973873514087},{"$f":"$P$67*L50","v":64.011174935829729},{"$f":"$P$67*M50","v":17.327375549415844},{"$f":"$P$67*N50","v":65.106057163345739},{"$f":"P61-P67","v":30.807907999999998},null,{"$f":"F73*100000000/'Calc-Units'!E21","v":0.39433916492697318},{"$f":"G73*100000000/'Calc-Units'!D21","v":0.22315445721613145},{"$f":"H73*100000000/'Calc-Units'!C21","v":8.9844319970008524E-2},{"$f":"I73*100000000/'Calc-Units'!C21","v":0.33758196185495043},{"$f":"J73*100000000/'Calc-Units'!E21","v":0.10491397942338139}]
[]
[null,"All LV Tariffs",null,null,null,null,null,null,null,null,null,{"$f":"L73","v":0.39433916492697318},{"$f":"M73","v":0.22315445721613145},{"$f":"N73","v":8.9844319970008524E-2},{"$f":"O73","v":0.33758196185495043},{"$f":"P73","v":0.10491397942338139},null,{"$f":"SUM(L75:P75)","v":1.149833883391445}]
[null,"HV Tariffs"]
[null,"EHV Tariffs"]
[]
[null,"All LV Tariffs",null,null,null,null,null,null,null,null,null,{"$f":"L75/$R75","v":0.34295316099388756},{"$f":"M75/$R75","v":0.19407538814035941},{"$f":"N75/$R75","v":7.8136782423746221E-2},{"$f":"O75/$R75","v":0.29359194117610232},{"$f":"P75/$R75","v":9.1242727265904447E-2},null,{"$f":"SUM(L79:P79)","v":1}]
[null,"HV Tariffs"]
[null,"EHV Tariffs"]

{"sheet":"Calc - DNO Opex Allocation","index":5,"n_rows":49,"n_cols":49,"rows_kept":49,"cut":false,"hidden":false,"merged":[[1,34,1,48],[1,3,1,8],[1,10,1,14],[1,17,1,20],[1,23,1,26],[1,29,1,32],[2,4,2,8],[5,0,10,0],[5,1,10,1],[11,1,25,1],[38,45,38,48],[38,29,38,32],[3,11,3,14],[38,23,38,26],[38,39,38,42],[2,17,2,20],[2,23,2,26],[2,45,2,48],[2,34,2,36],[2,39,2,42],[2,29,2,32],[2,10,2,14],[41,38,41,42],[41,0,61,0],[41,1,46,1],[47,1,61,1],[3,4,3,7]]}
["Index"]
[null,null,null,"Step 1 - extract total activity costs from cost report",null,null,null,null,null,null,"Step 2. Identify costs included in price control revenues to be allocated by MEAV",null,null,null,null,null,null,"Step 3.  Allocate costs not directly attributable to network teirs to network tiers using MEAV",null,null,null,null,null,"Step 4.  Sum directly attributed and allocated costs",null,null,null,null,null,"Step 5. Divide cost by units flowing - effectively adjust the cost because of electricity lost as it flows through the network meaning that there is more cost in the lower tiers",null,null,null,null,"Step 6.   Adjust costs so that they are aligned with the definition of opex in the allowed price control revenues"]
[null,null,null,null,"Costs extracted from RRP Tables",null,null,null,null,null,"Cost drivers - lookup from \"Calc-Drivers\"",null,null,null,null,null,null,"Allocation of \"Unallocated\" costs by cost driver to network tiers",null,null,null,null,null,"Sum of allocated and \"unallocated\" costs",null,null,null,null,null,"Sum of allocated and \"unallocated\" costs expressed per unit throughput (p/kWh)",null,null,null,null,"Proportion of costs allocated to Opex and Capex",null,null,null,null,"Operating costs = sum of allocated and unallocated multiplied by 1 minus capitalised proportion",null,null,null,null,null,"Opex only on p/kWh throughput"]
[null,null,null,"Total activity cost - from RRP 1.3","Costs allocated to network tiers in RRP - from 2.2 amd 2.3",null,null,null,"Unallocated costs = Total - costs allocated to network tiers",null,"Insert name of cost driver","Proportion of cost allocated to each network tier",null,null,null,null,null,null,null,null,null,null,null,null,null,null,null,null,null,null,null,null,null,null,"% Cost capitalised (from DCPR settlement - same for all DNOs)","Capex","Opex",null,null,"EHV","HV","HV/LV","LV",null,null,"EHV","HV","HV/LV","LV"]
[null,null,null,null,"EHV","HV","HV/LV","LV",null,null,null,"EHV","HV","HV/LV","LV",null,null,"EHV","HV","HV/LV","LV",null,null,"EHV","HV","HV/LV","LV",null,null,"EHV","HV","HV/LV","LV"]
["Cash typical costs (excluding disallowed related party margins)","Direct activities - From RRP 2.2 Detailed Cost Matrix","Load related new connections & reinforcement (net of contributions)",{"$f":"'RRP 1.3'!D$12","v":46.459524808852009},{"$f":"'RRP 2.4'!L13+'RRP 2.4'!L14+'RRP 2.4'!L18+'RRP 2.4'!L19","v":30.925733493062069},{"$f":"'RRP 2.4'!L12+'RRP 2.4'!L17-'Calc - DNO Opex Allocation'!G6","v":36.86},0,{"$f":"'RRP 2.4'!L11+'RRP 2.4'!L16+'RRP 2.4'!L24","v":-21.4},{"$f":"D6-E6-F6-G6-H6","v":7.3791315789939915E-2},null,"MEAV",{"$f":"IF(ISERROR(VLOOKUP($K6,'Calc-Drivers'!$B$17:$F$27,L$42,FALSE)),\" \",VLOOKUP($K6,'Calc-Drivers'!$B$17:$F$27,L$42,FALSE))","v":0.38747343048261829},{"$f":"IF(ISERROR(VLOOKUP($K6,'Calc-Drivers'!$B$17:$F$27,M$42,FALSE)),\" \",VLOOKUP($K6,'Calc-Drivers'!$B$17:$F$27,M$42,FALSE))","v":0.11030677919037249},{"$f":"IF(ISERROR(VLOOKUP($K6,'Calc-Drivers'!$B$17:$F$27,N$42,FALSE)),\" \",VLOOKUP($K6,'Calc-Drivers'!$B$17:$F$27,N$42,FALSE))","v":3.4004292882242937E-2},{"$f":"IF(ISERROR(VLOOKUP($K6,'Calc-Drivers'!$B$17:$F$27,O$42,FALSE)),\" \",VLOOKUP($K6,'Calc-Drivers'!$B$17:$F$27,O$42,FALSE))","v":0.4682154974447662},null,null,{"$f":"IF(ISERROR($I6*L6),\" \",$I6*L6)","v":2.8592174268954218E-2},8.1396823770079497E-3,2.5092215142871947E-3,3.4550237629690547E-2,null,{"$f":"X6-'[8]Calc - WPD Opex Allocation'!Y6","v":0},{"$f":"IF($K6=\"Do not allocate\",\" \",R6+E6)","v":30.954325667331023},{"$f":"IF($K6=\"Do not allocate\",\" \",S6+F6)","v":36.868139682377006},{"$f":"IF($K6=\"Do not allocate\",\" \",T6+G6)","v":2.5092215142871947E-3},{"$f":"IF($K6=\"Do not allocate\",\" \",U6+H6)","v":-21.365449762370307},null,null,{"$f":"IF(ISERROR(X6*100000000/'Calc-Units'!$E$21),\" \",X6*100000000/'Calc-Units'!$E$21)","v":0.10541259361482816},{"$f":"IF(ISERROR(Y6*100000000/'Calc-Units'!$D$21),\" \",Y6*100000000/'Calc-Units'!$D$21)","v":0.12852895932057326},{"$f":"IF(ISERROR(Z6*100000000/'Calc-Units'!$C$21),\" \",Z6*100000000/'Calc-Units'!$C$21)","v":1.3010585472815486E-5},{"$f":"IF(ISERROR(AA6*100000000/'Calc-Units'!$C$21),\" \",AA6*100000000/'Calc-Units'!$C$21)","v":-0.11078217236529248},null,1,{"$f":"AI6*D6","v":46.459524808852009},{"$f":"D6*(1-AI6)","v":0},null,null,{"$f":"IF(ISERROR(X6*(1-$AI6)),\" \",X6*(1-$AI6))","v":0},{"$f":"IF(ISERROR(Y6*(1-$AI6)),\" \",Y6*(1-$AI6))","v":0},{"$f":"IF(ISERROR(Z6*(1-$AI6)),\" \",Z6*(1-$AI6))","v":0},{"$f":"IF(ISERROR(AA6*(1-$AI6)),\" \",AA6*(1-$AI6))","v":0},null,null,{"$f":"IF(ISERROR(AN6*100000000/'Calc-Units'!$E$21),\" \",AN6*100000000/'Calc-Units'!$E$21)","v":0},{"$f":"IF(ISERROR(AO6*100000000/'Calc-Units'!$D$21),\" \",AO6*100000000/'Calc-Units'!$D$21)","v":0},{"$f":"IF(ISERROR(AP6*100000000/'Calc-Units'!$C$21),\" \",AP6*100000000/'Calc-Units'!$C$21)","v":0},{"$f":"IF(ISERROR(AQ6*100000000/'Calc-Units'!$C$21),\" \",AQ6*100000000/'Calc-Units'!$C$21)","v":0}]
[null,null,"Non-load new & replacement assets (net of contributions)",{"$f":"'RRP 1.3'!E$12","v":62.531667485618783},{"$f":"SUM('RRP 2.4'!G44:G55)+'RRP 2.4'!G71+'RRP 2.4'!H71","v":16.692705678966107},{"$f":"SUM('RRP 2.4'!G38:G40)+'RRP 2.4'!F71","v":16.974055325584295},{"$f":"'RRP 2.4'!G41+'RRP 2.4'!G42+'RRP 2.4'!G43","v":10.149980671044496},{"$f":"SUM('RRP 2.4'!G31:G37)+'RRP 2.4'!E71","v":14.450237342257196},4.264688467766689,null,"MEAV",{"$f":"IF(ISERROR(VLOOKUP($K7,'Calc-Drivers'!$B$17:$F$27,L$42,FALSE)),\" \",VLOOKUP($K7,'Calc-Drivers'!$B$17:$F$27,L$42,FALSE))","v":0.38747343048261829},{"$f":"IF(ISERROR(VLOOKUP($K7,'Calc-Drivers'!$B$17:$F$27,M$42,FALSE)),\" \",VLOOKUP($K7,'Calc-Drivers'!$B$17:$F$27,M$42,FALSE))","v":0.11030677919037249},{"$f":"IF(ISERROR(VLOOKUP($K7,'Calc-Drivers'!$B$17:$F$27,N$42,FALSE)),\" \",VLOOKUP($K7,'Calc-Drivers'!$B$17:$F$27,N$42,FALSE))","v":3.4004292882242937E-2},{"$f":"IF(ISERROR(VLOOKUP($K7,'Calc-Drivers'!$B$17:$F$27,O$42,FALSE)),\" \",VLOOKUP($K7,'Calc-Drivers'!$B$17:$F$27,O$42,FALSE))","v":0.4682154974447662},null,null,1.6524534705452201,0.47042404912966812,0.14501771570946237,1.9967932323823381,null,{"$f":"X7-'[8]Calc - WPD Opex Allocation'!Y7","v":0},18.345159149511325,17.444479374713964,10.294998386753958,16.447030574639534,null,null,{"$f":"IF(ISERROR(X7*100000000/'Calc-Units'!$E$21),\" \",X7*100000000/'Calc-Units'!$E$21)","v":6.2473039374516696E-2},{"$f":"IF(ISERROR(Y7*100000000/'Calc-Units'!$D$21),\" \",Y7*100000000/'Calc-Units'!$D$21)","v":6.0814589486676091E-2},{"$f":"IF(ISERROR(Z7*100000000/'Calc-Units'!$C$21),\" \",Z7*100000000/'Calc-Units'!$C$21)","v":5.3380682291579169E-2},{"$f":"IF(ISERROR(AA7*100000000/'Calc-Units'!$C$21),\" \",AA7*100000000/'Calc-Units'!$C$21)","v":8.5279635873895754E-2},null,1,62.531667485618783,0,null,null,{"$f":"IF(ISERROR(X7*(1-$AI7)),\" \",X7*(1-$AI7))","v":0},0,0,0,null,null,{"$f":"IF(ISERROR(AN7*100000000/'Calc-Units'!$E$21),\" \",AN7*100000000/'Calc-Units'!$E$21)","v":0},{"$f":"IF(ISERROR(AO7*100000000/'Calc-Units'!$D$21),\" \",AO7*100000000/'Calc-Units'!$D$21)","v":0},{"$f":"IF(ISERROR(AP7*100000000/'Calc-Units'!$C$21),\" \",AP7*100000000/'Calc-Units'!$C$21)","v":0},{"$f":"IF(ISERROR(AQ7*100000000/'Calc-Units'!$C$21),\" \",AQ7*100000000/'Calc-Units'!$C$21)","v":0}]
[null,null,"Non-operational capex",{"$f":"'RRP 1.3'!F$12","v":2.3969412916799993},0,0,0,0,2.3969412916799993,null,"MEAV",{"$f":"IF(ISERROR(VLOOKUP($K8,'Calc-Drivers'!$B$17:$F$27,L$42,FALSE)),\" \",VLOOKUP($K8,'Calc-Drivers'!$B$17:$F$27,L$42,FALSE))","v":0.38747343048261829},{"$f":"IF(ISERROR(VLOOKUP($K8,'Calc-Drivers'!$B$17:$F$27,M$42,FALSE)),\" \",VLOOKUP($K8,'Calc-Drivers'!$B$17:$F$27,M$42,FALSE))","v":0.11030677919037249},{"$f":"IF(ISERROR(VLOOKUP($K8,'Calc-Drivers'!$B$17:$F$27,N$42,FALSE)),\" \",VLOOKUP($K8,'Calc-Drivers'!$B$17:$F$27,N$42,FALSE))","v":3.4004292882242937E-2},{"$f":"IF(ISERROR(VLOOKUP($K8,'Calc-Drivers'!$B$17:$F$27,O$42,FALSE)),\" \",VLOOKUP($K8,'Calc-Drivers'!$B$17:$F$27,O$42,FALSE))","v":0.4682154974447662},null,null,0.92875106495268744,0.26439887379363192,8.1506293703828392E-2,1.1222850592298512,null,{"$f":"X8-'[8]Calc - WPD Opex Allocation'!Y8","v":0},0.92875106495268744,0.26439887379363192,8.1506293703828392E-2,1.1222850592298512,null,null,{"$f":"IF(ISERROR(X8*100000000/'Calc-Units'!$E$21),\" \",X8*100000000/'Calc-Units'!$E$21)","v":3.1627908690810749E-3},{"$f":"IF(ISERROR(Y8*100000000/'Calc-Units'!$D$21),\" \",Y8*100000000/'Calc-Units'!$D$21)","v":9.2174198066388875E-4},{"$f":"IF(ISERROR(Z8*100000000/'Calc-Units'!$C$21),\" \",Z8*100000000/'Calc-Units'!$C$21)","v":4.2261896559073105E-4},{"$f":"IF(ISERROR(AA8*100000000/'Calc-Units'!$C$21),\" \",AA8*100000000/'Calc-Units'!$C$21)","v":5.8191696527525212E-3},null,0.23499999999999999,0.56328120354479982,1.8336600881351994,null,null,0.7104945646888059,0.20226513845212843,6.2352314683428722E-2,0.85854807031083624,null,null,{"$f":"IF(ISERROR(AN8*100000000/'Calc-Units'!$E$21),\" \",AN8*100000000/'Calc-Units'!$E$21)","v":2.4195350148470225E-3},{"$f":"IF(ISERROR(AO8*100000000/'Calc-Units'!$D$21),\" \",AO8*100000000/'Calc-Units'!$D$21)","v":7.0513261520787501E-4},{"$f":"IF(ISERROR(AP8*100000000/'Calc-Units'!$C$21),\" \",AP8*100000000/'Calc-Units'!$C$21)","v":3.2330350867690929E-4},{"$f":"IF(ISERROR(AQ8*100000000/'Calc-Units'!$C$21),\" \",AQ8*100000000/'Calc-Units'!$C$21)","v":4.4516647843556795E-3}]
[null,null,"Faults",{"$f":"'RRP 1.3'!G$12","v":26.514424209436648},{"$f":"SUM('RRP 2.3'!I20:I27)","v":1.5815681672983535},{"$f":"SUM('RRP 2.3'!I17:I18)","v":6.2658253461024884},{"$f":"SUM('RRP 2.3'!I19)","v":0.55050054364771606},{"$f":"SUM('RRP 2.3'!I11:I16)","v":15.945861262597509},2.1706688897905817,null,"MEAV",{"$f":"IF(ISERROR(VLOOKUP($K9,'Calc-Drivers'!$B$17:$F$27,L$42,FALSE)),\" \",VLOOKUP($K9,'Calc-Drivers'!$B$17:$F$27,L$42,FALSE))","v":0.38747343048261829},{"$f":"IF(ISERROR(VLOOKUP($K9,'Calc-Drivers'!$B$17:$F$27,M$42,FALSE)),\" \",VLOOKUP($K9,'Calc-Drivers'!$B$17:$F$27,M$42,FALSE))","v":0.11030677919037249},{"$f":"IF(ISERROR(VLOOKUP($K9,'Calc-Drivers'!$B$17:$F$27,N$42,FALSE)),\" \",VLOOKUP($K9,'Calc-Drivers'!$B$17:$F$27,N$42,FALSE))","v":3.4004292882242937E-2},{"$f":"IF(ISERROR(VLOOKUP($K9,'Calc-Drivers'!$B$17:$F$27,O$42,FALSE)),\" \",VLOOKUP($K9,'Calc-Drivers'!$B$17:$F$27,O$42,FALSE))","v":0.4682154974447662},null,null,0.84107652116905318,0.23943949392154068,7.3812060678812061E-2,1.0163408140211756,null,{"$f":"X9-'[8]Calc - WPD Opex Allocation'!Y9","v":0},2.4226446884674067,6.5052648400240294,0.62431260432652813,16.962202076618684,null,null,{"$f":"IF(ISERROR(X9*100000000/'Calc-Units'!$E$21),\" \",X9*100000000/'Calc-Units'!$E$21)","v":8.2501315894618257E-3},{"$f":"IF(ISERROR(Y9*100000000/'Calc-Units'!$D$21),\" \",Y9*100000000/'Calc-Units'!$D$21)","v":2.267852208427721E-2},{"$f":"IF(ISERROR(Z9*100000000/'Calc-Units'!$C$21),\" \",Z9*100000000/'Calc-Units'!$C$21)","v":3.2371285094188952E-3},{"$f":"IF(ISERROR(AA9*100000000/'Calc-Units'!$C$21),\" \",AA9*100000000/'Calc-Units'!$C$21)","v":8.7950855940157016E-2},null,0.23499999999999999,6.2308896892176122,20.283534520219035,null,null,1.8533231866775661,4.9765276026183827,0.47759914230979406,12.976084588613293,null,null,{"$f":"IF(ISERROR(AN9*100000000/'Calc-Units'!$E$21),\" \",AN9*100000000/'Calc-Units'!$E$21)","v":6.311350665938297E-3},{"$f":"IF(ISERROR(AO9*100000000/'Calc-Units'!$D$21),\" \",AO9*100000000/'Calc-Units'!$D$21)","v":1.7349069394472068E-2},{"$f":"IF(ISERROR(AP9*100000000/'Calc-Units'!$C$21),\" \",AP9*100000000/'Calc-Units'!$C$21)","v":2.4764033097054551E-3},{"$f":"IF(ISERROR(AQ9*100000000/'Calc-Units'!$C$21),\" \",AQ9*100000000/'Calc-Units'!$C$21)","v":6.7282404794220124E-2}]
[null,null,"Inspections, & Maintenance",{"$f":"'RRP 1.3'!H$12","v":11.606716180984},{"$f":"SUM('RRP 2.3'!G20:G27)","v":4.3025137775305708},{"$f":"SUM('RRP 2.3'!G17:G18)","v":0.50908962554451409},{"$f":"SUM('RRP 2.3'!G19)","v":4.2769388247393829},{"$f":"SUM('RRP 2.3'!G11:G16)","v":1.219180953169533},1.2989929999999987,null,"MEAV",{"$f":"IF(ISERROR(VLOOKUP($K10,'Calc-Drivers'!$B$17:$F$27,L$42,FALSE)),\" \",VLOOKUP($K10,'Calc-Drivers'!$B$17:$F$27,L$42,FALSE))","v":0.38747343048261829},{"$f":"IF(ISERROR(VLOOKUP($K10,'Calc-Drivers'!$B$17:$F$27,M$42,FALSE)),\" \",VLOOKUP($K10,'Calc-Drivers'!$B$17:$F$27,M$42,FALSE))","v":0.11030677919037249},{"$f":"IF(ISERROR(VLOOKUP($K10,'Calc-Drivers'!$B$17:$F$27,N$42,FALSE)),\" \",VLOOKUP($K10,'Calc-Drivers'!$B$17:$F$27,N$42,FALSE))","v":3.4004292882242937E-2},{"$f":"IF(ISERROR(VLOOKUP($K10,'Calc-Drivers'!$B$17:$F$27,O$42,FALSE)),\" \",VLOOKUP($K10,'Calc-Drivers'!$B$17:$F$27,O$42,FALSE))","v":0.4682154974447662},null,null,0.50332527388290726,0.14328773402083939,4.4171338423983353E-2,0.60820865367226862,null,{"$f":"X10-'[8]Calc - WPD Opex Allocation'!Y10","v":0},4.8058390514134786,0.65237735956535348,4.3211101631633664,1.8273896068418016,null,null,{"$f":"IF(ISERROR(X10*100000000/'Calc-Units'!$E$21),\" \",X10*100000000/'Calc-Units'!$E$21)","v":1.636591810622378E-2},{"$f":"IF(ISERROR(Y10*100000000/'Calc-Units'!$D$21),\" \",Y10*100000000/'Calc-Units'!$D$21)","v":2.2743046932014953E-3},{"$f":"IF(ISERROR(Z10*100000000/'Calc-Units'!$C$21),\" \",Z10*100000000/'Calc-Units'!$C$21)","v":2.2405424469373464E-2},{"$f":"IF(ISERROR(AA10*100000000/'Calc-Units'!$C$21),\" \",AA10*100000000/'Calc-Units'!$C$21)","v":9.4752131434294399E-3},null,0.23499999999999999,2.7275783025312399,8.8791378784527595,null,null,3.6764668743313114,0.49906868006749544,3.3056492748199755,1.3979530492339782,null,null,{"$f":"IF(ISERROR(AN10*100000000/'Calc-Units'!$E$21),\" \",AN10*100000000/'Calc-Units'!$E$21)","v":1.2519927351261192E-2},{"$f":"IF(ISERROR(AO10*100000000/'Calc-Units'!$D$21),\" \",AO10*100000000/'Calc-Units'!$D$21)","v":1.7398430902991438E-3},{"$f":"IF(ISERROR(AP10*100000000/'Calc-Units'!$C$21),\" \",AP10*100000000/'Calc-Units'!$C$21)","v":1.7140149719070703E-2},{"$f":"IF(ISERROR(AQ10*100000000/'Calc-Units'!$C$21),\" \",AQ10*100000000/'Calc-Units'!$C$21)","v":7.2485380547235205E-3}]
[null,null,"Tree Cutting",{"$f":"'RRP 1.3'!I$12","v":3.1208690599999995},{"$f":"'RRP 2.3'!G46+'RRP 2.3'!G47","v":0.81105305641463454},{"$f":"'RRP 2.3'!G45","v":3.8399956961413602},0,{"$f":"'RRP 2.3'!G44","v":2.6698203074440059},-4.2000000000000011,null,"MEAV",{"$f":"IF(ISERROR(VLOOKUP($K11,'Calc-Drivers'!$B$17:$F$27,L$42,FALSE)),\" \",VLOOKUP($K11,'Calc-Drivers'!$B$17:$F$27,L$42,FALSE))","v":0.38747343048261829},{"$f":"IF(ISERROR(VLOOKUP($K11,'Calc-Drivers'!$B$17:$F$27,M$42,FALSE)),\" \",VLOOKUP($K11,'Calc-Drivers'!$B$17:$F$27,M$42,FALSE))","v":0.11030677919037249},{"$f":"IF(ISERROR(VLOOKUP($K11,'Calc-Drivers'!$B$17:$F$27,N$42,FALSE)),\" \",VLOOKUP($K11,'Calc-Drivers'!$B$17:$F$27,N$42,FALSE))","v":3.4004292882242937E-2},{"$f":"IF(ISERROR(VLOOKUP($K11,'Calc-Drivers'!$B$17:$F$27,O$42,FALSE)),\" \",VLOOKUP($K11,'Calc-Drivers'!$B$17:$F$27,O$42,FALSE))","v":0.4682154974447662},null,null,-1.6273884080269971,-0.46328847259956457,-0.14281803010542038,-1.9665050892680185,null,{"$f":"X11-'[8]Calc - WPD Opex Allocation'!Y11","v":0},-0.81633535161236259,3.3767072235417954,-0.14281803010542038,0.70331521817598741,null,null,{"$f":"IF(ISERROR(X11*100000000/'Calc-Units'!$E$21),\" \",X11*100000000/'Calc-Units'!$E$21)","v":-2.7799677369082709E-3},{"$f":"IF(ISERROR(Y11*100000000/'Calc-Units'!$D$21),\" \",Y11*100000000/'Calc-Units'!$D$21)","v":1.1771808100736469E-2},{"$f":"IF(ISERROR(Z11*100000000/'Calc-Units'!$C$21),\" \",Z11*100000000/'Calc-Units'!$C$21)","v":-7.4052696311013367E-4},{"$f":"IF(ISERROR(AA11*100000000/'Calc-Units'!$C$21),\" \",AA11*100000000/'Calc-Units'!$C$21)","v":3.6467656236440289E-3},null,0.23499999999999999,0.7334042290999998,2.3874648308999995,null,null,-0.62449654398345744,2.5831810260094734,-0.10925579303064659,0.53803614190463034,null,null,{"$f":"IF(ISERROR(AN11*100000000/'Calc-Units'!$E$21),\" \",AN11*100000000/'Calc-Units'!$E$21)","v":-2.1266753187348278E-3},{"$f":"IF(ISERROR(AO11*100000000/'Calc-Units'!$D$21),\" \",AO11*100000000/'Calc-Units'!$D$21)","v":9.0054331970633988E-3},{"$f":"IF(ISERROR(AP11*100000000/'Calc-Units'!$C$21),\" \",AP11*100000000/'Calc-Units'!$C$21)","v":-5.6650312677925224E-4},{"$f":"IF(ISERROR(AQ11*100000000/'Calc-Units'!$C$21),\" \",AQ11*100000000/'Calc-Units'!$C$21)","v":2.7897757020876822E-3}]
[null,"Indirect activities - From RRP 2.2 Detailed Cost Matrix","Network Policy",{"$f":"'RRP 1.3'!J$12","v":0.63889207162799966},0,0,0,0,0.63889207162799966,null,"MEAV",{"$f":"IF(ISERROR(VLOOKUP($K12,'Calc-Drivers'!$B$17:$F$27,L$42,FALSE)),\" \",VLOOKUP($K12,'Calc-Drivers'!$B$17:$F$27,L$42,FALSE))","v":0.38747343048261829},{"$f":"IF(ISERROR(VLOOKUP($K12,'Calc-Drivers'!$B$17:$F$27,M$42,FALSE)),\" \",VLOOKUP($K12,'Calc-Drivers'!$B$17:$F$27,M$42,FALSE))","v":0.11030677919037249},{"$f":"IF(ISERROR(VLOOKUP($K12,'Calc-Drivers'!$B$17:$F$27,N$42,FALSE)),\" \",VLOOKUP($K12,'Calc-Drivers'!$B$17:$F$27,N$42,FALSE))","v":3.4004292882242937E-2},{"$f":"IF(ISERROR(VLOOKUP($K12,'Calc-Drivers'!$B$17:$F$27,O$42,FALSE)),\" \",VLOOKUP($K12,'Calc-Drivers'!$B$17:$F$27,O$42,FALSE))","v":0.4682154974447662},null,null,0.24755370270184771,7.0474126671549397E-2,2.1725073123781434E-2,0.29913916913082106,null,{"$f":"X12-'[8]Calc - WPD Opex Allocation'!Y12","v":0},0.24755370270184771,7.0474126671549397E-2,2.1725073123781434E-2,0.29913916913082106,null,null,{"$f":"IF(ISERROR(X12*100000000/'Calc-Units'!$E$21),\" \",X12*100000000/'Calc-Units'!$E$21)","v":8.4302524116351956E-4},{"$f":"IF(ISERROR(Y12*100000000/'Calc-Units'!$D$21),\" \",Y12*100000000/'Calc-Units'!$D$21)","v":2.4568546821607636E-4},{"$f":"IF(ISERROR(Z12*100000000/'Calc-Units'!$C$21),\" \",Z12*100000000/'Calc-Units'!$C$21)","v":1.1264685846614868E-4},{"$f":"IF(ISERROR(AA12*100000000/'Calc-Units'!$C$21),\" \",AA12*100000000/'Calc-Units'!$C$21)","v":1.5510690092856011E-3},null,0.52569999999999995,0.33586556205483936,0.3030265095731603,null,null,0.11741472119148638,3.3425878280315881E-2,1.0304202182609535E-2,0.14188170791874843,null,null,{"$f":"IF(ISERROR(AN12*100000000/'Calc-Units'!$E$21),\" \",AN12*100000000/'Calc-Units'!$E$21)","v":3.9984687188385735E-4},{"$f":"IF(ISERROR(AO12*100000000/'Calc-Units'!$D$21),\" \",AO12*100000000/'Calc-Units'!$D$21)","v":1.1652861757488501E-4},{"$f":"IF(ISERROR(AP12*100000000/'Calc-Units'!$C$21),\" \",AP12*100000000/'Calc-Units'!$C$21)","v":5.3428404970494324E-5},{"$f":"IF(ISERROR(AQ12*100000000/'Calc-Units'!$C$21),\" \",AQ12*100000000/'Calc-Units'!$C$21)","v":7.3567203110416063E-4}]
[null,null,"Network Design & Engineering",{"$f":"'RRP 1.3'!K$12","v":5.1305774955097965},0,0,0,0,5.1305774955097965,null,"MEAV",{"$f":"IF(ISERROR(VLOOKUP($K13,'Calc-Drivers'!$B$17:$F$27,L$42,FALSE)),\" \",VLOOKUP($K13,'Calc-Drivers'!$B$17:$F$27,L$42,FALSE))","v":0.38747343048261829},{"$f":"IF(ISERROR(VLOOKUP($K13,'Calc-Drivers'!$B$17:$F$27,M$42,FALSE)),\" \",VLOOKUP($K13,'Calc-Drivers'!$B$17:$F$27,M$42,FALSE))","v":0.11030677919037249},{"$f":"IF(ISERROR(VLOOKUP($K13,'Calc-Drivers'!$B$17:$F$27,N$42,FALSE)),\" \",VLOOKUP($K13,'Calc-Drivers'!$B$17:$F$27,N$42,FALSE))","v":3.4004292882242937E-2},{"$f":"IF(ISERROR(VLOOKUP($K13,'Calc-Drivers'!$B$17:$F$27,O$42,FALSE)),\" \",VLOOKUP($K13,'Calc-Drivers'!$B$17:$F$27,O$42,FALSE))","v":0.4682154974447662},null,null,1.9879624625421008,0.56593747891629342,0.17446165981235956,2.4022158942390419,null,{"$f":"X13-'[8]Calc - WPD Opex Allocation'!Y13","v":0},1.9879624625421008,0.56593747891629342,0.17446165981235956,2.4022158942390419,null,null,{"$f":"IF(ISERROR(X13*100000000/'Calc-Units'!$E$21),\" \",X13*100000000/'Calc-Units'!$E$21)","v":6.7698544441770134E-3},{"$f":"IF(ISERROR(Y13*100000000/'Calc-Units'!$D$21),\" \",Y13*100000000/'Calc-Units'!$D$21)","v":1.972959737927583E-3},{"$f":"IF(ISERROR(Z13*100000000/'Calc-Units'!$C$21),\" \",Z13*100000000/'Calc-Units'!$C$21)","v":9.0460261232168176E-4},{"$f":"IF(ISERROR(AA13*100000000/'Calc-Units'!$C$21),\" \",AA13*100000000/'Calc-Units'!$C$21)","v":1.2455749736798931E-2},null,0.52569999999999995,2.6971445893894996,2.4334329061202968,null,null,0.94289059598371849,0.268424146249998,8.274716524900215E-2,1.1393709986375777,null,null,{"$f":"IF(ISERROR(AN13*100000000/'Calc-Units'!$E$21),\" \",AN13*100000000/'Calc-Units'!$E$21)","v":3.2109419628731577E-3},{"$f":"IF(ISERROR(AO13*100000000/'Calc-Units'!$D$21),\" \",AO13*100000000/'Calc-Units'!$D$21)","v":9.3577480369905273E-4},{"$f":"IF(ISERROR(AP13*100000000/'Calc-Units'!$C$21),\" \",AP13*100000000/'Calc-Units'!$C$21)","v":4.2905301902417372E-4},{"$f":"IF(ISERROR(AQ13*100000000/'Calc-Units'!$C$21),\" \",AQ13*100000000/'Calc-Units'!$C$21)","v":5.9077621001637336E-3}]
[null,null,"Project Management",{"$f":"'RRP 1.3'!L$12","v":2.2167176620892537},0,0,0,0,2.2167176620892537,null,"MEAV",{"$f":"IF(ISERROR(VLOOKUP($K14,'Calc-Drivers'!$B$17:$F$27,L$42,FALSE)),\" \",VLOOKUP($K14,'Calc-Drivers'!$B$17:$F$27,L$42,FALSE))","v":0.38747343048261829},{"$f":"IF(ISERROR(VLOOKUP($K14,'Calc-Drivers'!$B$17:$F$27,M$42,FALSE)),\" \",VLOOKUP($K14,'Calc-Drivers'!$B$17:$F$27,M$42,FALSE))","v":0.11030677919037249},{"$f":"IF(ISERROR(VLOOKUP($K14,'Calc-Drivers'!$B$17:$F$27,N$42,FALSE)),\" \",VLOOKUP($K14,'Calc-Drivers'!$B$17:$F$27,N$42,FALSE))","v":3.4004292882242937E-2},{"$f":"IF(ISERROR(VLOOKUP($K14,'Calc-Drivers'!$B$17:$F$27,O$42,FALSE)),\" \",VLOOKUP($K14,'Calc-Drivers'!$B$17:$F$27,O$42,FALSE))","v":0.4682154974447662},null,null,0.85891919694113261,0.24451898567947805,7.5377916618923818E-2,1.037901562849719,null,{"$f":"X14-'[8]Calc - WPD Opex Allocation'!Y14","v":0},0.85891919694113261,0.24451898567947805,7.5377916618923818E-2,1.037901562849719,null,null,{"$f":"IF(ISERROR(X14*100000000/'Calc-Units'!$E$21),\" \",X14*100000000/'Calc-Units'!$E$21)","v":2.9249837721610065E-3},{"$f":"IF(ISERROR(Y14*100000000/'Calc-Units'!$D$21),\" \",Y14*100000000/'Calc-Units'!$D$21)","v":8.5243711872253652E-4},{"$f":"IF(ISERROR(Z14*100000000/'Calc-Units'!$C$21),\" \",Z14*100000000/'Calc-Units'!$C$21)","v":3.9084266628084524E-4},{"$f":"IF(ISERROR(AA14*100000000/'Calc-Units'!$C$21),\" \",AA14*100000000/'Calc-Units'!$C$21)","v":5.3816320794862543E-3},null,0.52569999999999995,1.1653284749603205,1.0513891871289331,null,null,0.40738537510917927,0.11597535490777645,3.575174585235557E-2,0.4922767112596218,null,null,{"$f":"IF(ISERROR(AN14*100000000/'Calc-Units'!$E$21),\" \",AN14*100000000/'Calc-Units'!$E$21)","v":1.3873198031359656E-3},{"$f":"IF(ISERROR(AO14*100000000/'Calc-Units'!$D$21),\" \",AO14*100000000/'Calc-Units'!$D$21)","v":4.0431092541009915E-4},{"$f":"IF(ISERROR(AP14*100000000/'Calc-Units'!$C$21),\" \",AP14*100000000/'Calc-Units'!$C$21)","v":1.8537667661700492E-4},{"$f":"IF(ISERROR(AQ14*100000000/'Calc-Units'!$C$21),\" \",AQ14*100000000/'Calc-Units'!$C$21)","v":2.5525080953003308E-3}]
[null,null,"Engineering Mgt & Clerical Support",{"$f":"'RRP 1.3'!M$12","v":16.939612814221448},0,0,0,0,16.939612814221448,null,"MEAV",{"$f":"IF(ISERROR(VLOOKUP($K15,'Calc-Drivers'!$B$17:$F$27,L$42,FALSE)),\" \",VLOOKUP($K15,'Calc-Drivers'!$B$17:$F$27,L$42,FALSE))","v":0.38747343048261829},{"$f":"IF(ISERROR(VLOOKUP($K15,'Calc-Drivers'!$B$17:$F$27,M$42,FALSE)),\" \",VLOOKUP($K15,'Calc-Drivers'!$B$17:$F$27,M$42,FALSE))","v":0.11030677919037249},{"$f":"IF(ISERROR(VLOOKUP($K15,'Calc-Drivers'!$B$17:$F$27,N$42,FALSE)),\" \",VLOOKUP($K15,'Calc-Drivers'!$B$17:$F$27,N$42,FALSE))","v":3.4004292882242937E-2},{"$f":"IF(ISERROR(VLOOKUP($K15,'Calc-Drivers'!$B$17:$F$27,O$42,FALSE)),\" \",VLOOKUP($K15,'Calc-Drivers'!$B$17:$F$27,O$42,FALSE))","v":0.4682154974447662},null,null,6.5636498881737042,1.8685541302687296,0.57601955544658168,7.9313892403324315,null,{"$f":"X15-'[8]Calc - WPD Opex Allocation'!Y15","v":0},6.5636498881737042,1.8685541302687296,0.57601955544658168,7.9313892403324315,null,null,{"$f":"IF(ISERROR(X15*100000000/'Calc-Units'!$E$21),\" \",X15*100000000/'Calc-Units'!$E$21)","v":2.235200875405547E-2},{"$f":"IF(ISERROR(Y15*100000000/'Calc-Units'!$D$21),\" \",Y15*100000000/'Calc-Units'!$D$21)","v":6.5141154358921158E-3},{"$f":"IF(ISERROR(Z15*100000000/'Calc-Units'!$C$21),\" \",Z15*100000000/'Calc-Units'!$C$21)","v":2.9867238175183123E-3},{"$f":"IF(ISERROR(AA15*100000000/'Calc-Units'!$C$21),\" \",AA15*100000000/'Calc-Units'!$C$21)","v":4.1125112725979629E-2},null,0.52569999999999995,8.9051544564362146,8.0344583577852333,null,null,3.1131391419607883,0.88625522398645862,0.27320607514831374,3.7618579166896726,null,null,{"$f":"IF(ISERROR(AN15*100000000/'Calc-Units'!$E$21),\" \",AN15*100000000/'Calc-Units'!$E$21)","v":1.0601557752048511E-2},{"$f":"IF(ISERROR(AO15*100000000/'Calc-Units'!$D$21),\" \",AO15*100000000/'Calc-Units'!$D$21)","v":3.0896449512436311E-3},{"$f":"IF(ISERROR(AP15*100000000/'Calc-Units'!$C$21),\" \",AP15*100000000/'Calc-Units'!$C$21)","v":1.4166031066489358E-3},{"$f":"IF(ISERROR(AQ15*100000000/'Calc-Units'!$C$21),\" \",AQ15*100000000/'Calc-Units'!$C$21)","v":1.9505640965932141E-2}]
[null,null,"Control Centre",{"$f":"'RRP 1.3'!N$12","v":4.4300162415596507},0,0,0,0,4.4300162415596507,null,"MEAV",{"$f":"IF(ISERROR(VLOOKUP($K16,'Calc-Drivers'!$B$17:$F$27,L$42,FALSE)),\" \",VLOOKUP($K16,'Calc-Drivers'!$B$17:$F$27,L$42,FALSE))","v":0.38747343048261829},{"$f":"IF(ISERROR(VLOOKUP($K16,'Calc-Drivers'!$B$17:$F$27,M$42,FALSE)),\" \",VLOOKUP($K16,'Calc-Drivers'!$B$17:$F$27,M$42,FALSE))","v":0.11030677919037249},{"$f":"IF(ISERROR(VLOOKUP($K16,'Calc-Drivers'!$B$17:$F$27,N$42,FALSE)),\" \",VLOOKUP($K16,'Calc-Drivers'!$B$17:$F$27,N$42,FALSE))","v":3.4004292882242937E-2},{"$f":"IF(ISERROR(VLOOKUP($K16,'Calc-Drivers'!$B$17:$F$27,O$42,FALSE)),\" \",VLOOKUP($K16,'Calc-Drivers'!$B$17:$F$27,O$42,FALSE))","v":0.4682154974447662},null,null,1.7165135902108333,0.48866082336748423,0.15063956975108744,2.0742022582302453,null,{"$f":"X16-'[8]Calc - WPD Opex Allocation'!Y16","v":0},1.7165135902108333,0.48866082336748423,0.15063956975108744,2.0742022582302453,null,null,{"$f":"IF(ISERROR(X16*100000000/'Calc-Units'!$E$21),\" \",X16*100000000/'Calc-Units'!$E$21)","v":5.8454560265284441E-3},{"$f":"IF(ISERROR(Y16*100000000/'Calc-Units'!$D$21),\" \",Y16*100000000/'Calc-Units'!$D$21)","v":1.7035594317816646E-3},{"$f":"IF(ISERROR(Z16*100000000/'Calc-Units'!$C$21),\" \",Z16*100000000/'Calc-Units'!$C$21)","v":7.8108249378350844E-4},{"$f":"IF(ISERROR(AA16*100000000/'Calc-Units'!$C$21),\" \",AA16*100000000/'Calc-Units'!$C$21)","v":1.0754963487660715E-2},null,0.52569999999999995,2.328859538187908,2.1011567033717427,null,null,0.81414239583699832,0.2317718285231978,7.1448347932940789E-2,0.98379413107860547,null,null,{"$f":"IF(ISERROR(AN16*100000000/'Calc-Units'!$E$21),\" \",AN16*100000000/'Calc-Units'!$E$21)","v":2.7724997933824417E-3},{"$f":"IF(ISERROR(AO16*100000000/'Calc-Units'!$D$21),\" \",AO16*100000000/'Calc-Units'!$D$21)","v":8.0799823849404373E-4},{"$f":"IF(ISERROR(AP16*100000000/'Calc-Units'!$C$21),\" \",AP16*100000000/'Calc-Units'!$C$21)","v":3.7046742680151815E-4},{"$f":"IF(ISERROR(AQ16*100000000/'Calc-Units'!$C$21),\" \",AQ16*100000000/'Calc-Units'!$C$21)","v":5.1010791821974773E-3}]
[null,null,"System Mapping - Cartographical",{"$f":"'RRP 1.3'!O$12","v":1.5094657008872003},0,0,0,0,1.5094657008872003,null,"MEAV",{"$f":"IF(ISERROR(VLOOKUP($K17,'Calc-Drivers'!$B$17:$F$27,L$42,FALSE)),\" \",VLOOKUP($K17,'Calc-Drivers'!$B$17:$F$27,L$42,FALSE))","v":0.38747343048261829},{"$f":"IF(ISERROR(VLOOKUP($K17,'Calc-Drivers'!$B$17:$F$27,M$42,FALSE)),\" \",VLOOKUP($K17,'Calc-Drivers'!$B$17:$F$27,M$42,FALSE))","v":0.11030677919037249},{"$f":"IF(ISERROR(VLOOKUP($K17,'Calc-Drivers'!$B$17:$F$27,N$42,FALSE)),\" \",VLOOKUP($K17,'Calc-Drivers'!$B$17:$F$27,N$42,FALSE))","v":3.4004292882242937E-2},{"$f":"IF(ISERROR(VLOOKUP($K17,'Calc-Drivers'!$B$17:$F$27,O$42,FALSE)),\" \",VLOOKUP($K17,'Calc-Drivers'!$B$17:$F$27,O$42,FALSE))","v":0.4682154974447662},null,null,0.58487785331861331,0.16650429976320524,5.1328313788668471E-2,0.70675523401671314,null,{"$f":"X17-'[8]Calc - WPD Opex Allocation'!Y17","v":0},0.58487785331861331,0.16650429976320524,5.1328313788668471E-2,0.70675523401671314,null,null,{"$f":"IF(ISERROR(X17*100000000/'Calc-Units'!$E$21),\" \",X17*100000000/'Calc-Units'!$E$21)","v":1.9917568913884213E-3},{"$f":"IF(ISERROR(Y17*100000000/'Calc-Units'!$D$21),\" \",Y17*100000000/'Calc-Units'!$D$21)","v":5.8046390610793557E-4},{"$f":"IF(ISERROR(Z17*100000000/'Calc-Units'!$C$21),\" \",Z17*100000000/'Calc-Units'!$C$21)","v":2.6614286938021607E-4},{"$f":"IF(ISERROR(AA17*100000000/'Calc-Units'!$C$21),\" \",AA17*100000000/'Calc-Units'!$C$21)","v":3.6646024785684599E-3},null,0.52569999999999995,0.79352611895640113,0.71593958193079921,null,null,0.27740756582901832,7.8972989377688263E-2,2.4345019229965459E-2,0.33521400749412711,null,null,{"$f":"IF(ISERROR(AN17*100000000/'Calc-Units'!$E$21),\" \",AN17*100000000/'Calc-Units'!$E$21)","v":9.4469029358552827E-4},{"$f":"IF(ISERROR(AO17*100000000/'Calc-Units'!$D$21),\" \",AO17*100000000/'Calc-Units'!$D$21)","v":2.7531403066699393E-4},{"$f":"IF(ISERROR(AP17*100000000/'Calc-Units'!$C$21),\" \",AP17*100000000/'Calc-Units'!$C$21)","v":1.2623156294703648E-4},{"$f":"IF(ISERROR(AQ17*100000000/'Calc-Units'!$C$21),\" \",AQ17*100000000/'Calc-Units'!$C$21)","v":1.7381209555850207E-3}]
[null,null,"Customer Call Centre",{"$f":"'RRP 1.3'!P$12","v":1.3239399267640004},0,0,0,0,1.3239399267640004,null,"MEAV",{"$f":"IF(ISERROR(VLOOKUP($K18,'Calc-Drivers'!$B$17:$F$27,L$42,FALSE)),\" \",VLOOKUP($K18,'Calc-Drivers'!$B$17:$F$27,L$42,FALSE))","v":0.38747343048261829},{"$f":"IF(ISERROR(VLOOKUP($K18,'Calc-Drivers'!$B$17:$F$27,M$42,FALSE)),\" \",VLOOKUP($K18,'Calc-Drivers'!$B$17:$F$27,M$42,FALSE))","v":0.11030677919037249},{"$f":"IF(ISERROR(VLOOKUP($K18,'Calc-Drivers'!$B$17:$F$27,N$42,FALSE)),\" \",VLOOKUP($K18,'Calc-Drivers'!$B$17:$F$27,N$42,FALSE))","v":3.4004292882242937E-2},{"$f":"IF(ISERROR(VLOOKUP($K18,'Calc-Drivers'!$B$17:$F$27,O$42,FALSE)),\" \",VLOOKUP($K18,'Calc-Drivers'!$B$17:$F$27,O$42,FALSE))","v":0.4682154974447662},null,null,0.51299154517615364,0.14603954916287451,4.5019641028178334E-2,0.61988919139679377,null,{"$f":"X18-'[8]Calc - WPD Opex Allocation'!Y18","v":0},0.51299154517615364,0.14603954916287451,4.5019641028178334E-2,0.61988919139679377,null,null,{"$f":"IF(ISERROR(X18*100000000/'Calc-Units'!$E$21),\" \",X18*100000000/'Calc-Units'!$E$21)","v":1.7469535553981661E-3},{"$f":"IF(ISERROR(Y18*100000000/'Calc-Units'!$D$21),\" \",Y18*100000000/'Calc-Units'!$D$21)","v":5.0912010845294091E-4},{"$f":"IF(ISERROR(Z18*100000000/'Calc-Units'!$C$21),\" \",Z18*100000000/'Calc-Units'!$C$21)","v":2.3343171745399946E-4},{"$f":"IF(ISERROR(AA18*100000000/'Calc-Units'!$C$21),\" \",AA18*100000000/'Calc-Units'!$C$21)","v":3.214192634018427E-3},null,0.52569999999999995,0.69599521949983489,0.62794470726416551,null,null,0.24331188987704969,6.9266558167951395E-2,2.1352815739664986E-2,0.29401344347949931,null,null,{"$f":"IF(ISERROR(AN18*100000000/'Calc-Units'!$E$21),\" \",AN18*100000000/'Calc-Units'!$E$21)","v":8.2858007132535034E-4},{"$f":"IF(ISERROR(AO18*100000000/'Calc-Units'!$D$21),\" \",AO18*100000000/'Calc-Units'!$D$21)","v":2.4147566743922994E-4},{"$f":"IF(ISERROR(AP18*100000000/'Calc-Units'!$C$21),\" \",AP18*100000000/'Calc-Units'!$C$21)","v":1.1071666358843194E-4},{"$f":"IF(ISERROR(AQ18*100000000/'Calc-Units'!$C$21),\" \",AQ18*100000000/'Calc-Units'!$C$21)","v":1.52449156631494E-3}]
[null,null,"Stores",{"$f":"'RRP 1.3'!Q$12","v":1.562325762189239},0,0,0,0,1.562325762189239,null,"MEAV",{"$f":"IF(ISERROR(VLOOKUP($K19,'Calc-Drivers'!$B$17:$F$27,L$42,FALSE)),\" \",VLOOKUP($K19,'Calc-Drivers'!$B$17:$F$27,L$42,FALSE))","v":0.38747343048261829},{"$f":"IF(ISERROR(VLOOKUP($K19,'Calc-Drivers'!$B$17:$F$27,M$42,FALSE)),\" \",VLOOKUP($K19,'Calc-Drivers'!$B$17:$F$27,M$42,FALSE))","v":0.11030677919037249},{"$f":"IF(ISERROR(VLOOKUP($K19,'Calc-Drivers'!$B$17:$F$27,N$42,FALSE)),\" \",VLOOKUP($K19,'Calc-Drivers'!$B$17:$F$27,N$42,FALSE))","v":3.4004292882242937E-2},{"$f":"IF(ISERROR(VLOOKUP($K19,'Calc-Drivers'!$B$17:$F$27,O$42,FALSE)),\" \",VLOOKUP($K19,'Calc-Drivers'!$B$17:$F$27,O$42,FALSE))","v":0.4682154974447662},null,null,0.60535972260683568,0.17233512287323879,5.3125782794956312E-2,0.73150513391420802,null,{"$f":"X19-'[8]Calc - WPD Opex Allocation'!Y19","v":0},0.60535972260683568,0.17233512287323879,5.3125782794956312E-2,0.73150513391420802,null,null,{"$f":"IF(ISERROR(X19*100000000/'Calc-Units'!$E$21),\" \",X19*100000000/'Calc-Units'!$E$21)","v":2.0615063340658321E-3},{"$f":"IF(ISERROR(Y19*100000000/'Calc-Units'!$D$21),\" \",Y19*100000000/'Calc-Units'!$D$21)","v":6.0079120313923096E-4},{"$f":"IF(ISERROR(Z19*100000000/'Calc-Units'!$C$21),\" \",Z19*100000000/'Calc-Units'!$C$21)","v":2.7546294096731473E-4},{"$f":"IF(ISERROR(AA19*100000000/'Calc-Units'!$C$21),\" \",AA19*100000000/'Calc-Units'!$C$21)","v":3.7929333916530538E-3},null,0.52569999999999995,0.82131465318288288,0.74101110900635614,null,null,0.28712211643242219,8.1738548778777176E-2,2.5197558779647782E-2,0.34695288501550892,null,null,{"$f":"IF(ISERROR(AN19*100000000/'Calc-Units'!$E$21),\" \",AN19*100000000/'Calc-Units'!$E$21)","v":9.777724542474242E-4},{"$f":"IF(ISERROR(AO19*100000000/'Calc-Units'!$D$21),\" \",AO19*100000000/'Calc-Units'!$D$21)","v":2.8495526764893729E-4},{"$f":"IF(ISERROR(AP19*100000000/'Calc-Units'!$C$21),\" \",AP19*100000000/'Calc-Units'!$C$21)","v":1.3065207290079739E-4},{"$f":"IF(ISERROR(AQ19*100000000/'Calc-Units'!$C$21),\" \",AQ19*100000000/'Calc-Units'!$C$21)","v":1.7989883076610438E-3}]
[null,null,"Vehicles & Transport",{"$f":"'RRP 1.3'!R$12","v":6.1510443854799997},0,0,0,0,6.1510443854799997,null,"MEAV",{"$f":"IF(ISERROR(VLOOKUP($K20,'Calc-Drivers'!$B$17:$F$27,L$42,FALSE)),\" \",VLOOKUP($K20,'Calc-Drivers'!$B$17:$F$27,L$42,FALSE))","v":0.38747343048261829},{"$f":"IF(ISERROR(VLOOKUP($K20,'Calc-Drivers'!$B$17:$F$27,M$42,FALSE)),\" \",VLOOKUP($K20,'Calc-Drivers'!$B$17:$F$27,M$42,FALSE))","v":0.11030677919037249},{"$f":"IF(ISERROR(VLOOKUP($K20,'Calc-Drivers'!$B$17:$F$27,N$42,FALSE)),\" \",VLOOKUP($K20,'Calc-Drivers'!$B$17:$F$27,N$42,FALSE))","v":3.4004292882242937E-2},{"$f":"IF(ISERROR(VLOOKUP($K20,'Calc-Drivers'!$B$17:$F$27,O$42,FALSE)),\" \",VLOOKUP($K20,'Calc-Drivers'!$B$17:$F$27,O$42,FALSE))","v":0.4682154974447662},null,null,2.3833662690927842,0.67850189481932277,0.20916191481553792,2.8800143067523543,null,{"$f":"X20-'[8]Calc - WPD Opex Allocation'!Y20","v":0},2.3833662690927842,0.67850189481932277,0.20916191481553792,2.8800143067523543,null,null,{"$f":"IF(ISERROR(X20*100000000/'Calc-Units'!$E$21),\" \",X20*100000000/'Calc-Units'!$E$21)","v":8.1163719300246431E-3},{"$f":"IF(ISERROR(Y20*100000000/'Calc-Units'!$D$21),\" \",Y20*100000000/'Calc-Units'!$D$21)","v":2.3653795170969715E-3},{"$f":"IF(ISERROR(Z20*100000000/'Calc-Units'!$C$21),\" \",Z20*100000000/'Calc-Units'!$C$21)","v":1.0845271949369384E-3},{"$f":"IF(ISERROR(AA20*100000000/'Calc-Units'!$C$21),\" \",AA20*100000000/'Calc-Units'!$C$21)","v":1.4933186284104297E-2},null,0.52569999999999995,3.2336040334468357,2.917440352033164,null,null,1.1304306214307076,0.32181344871280482,9.9205496197009649E-2,1.3659907856926419,null,null,{"$f":"IF(ISERROR(AN20*100000000/'Calc-Units'!$E$21),\" \",AN20*100000000/'Calc-Units'!$E$21)","v":3.8495952064106879E-3},{"$f":"IF(ISERROR(AO20*100000000/'Calc-Units'!$D$21),\" \",AO20*100000000/'Calc-Units'!$D$21)","v":1.1218995049590936E-3},{"$f":"IF(ISERROR(AP20*100000000/'Calc-Units'!$C$21),\" \",AP20*100000000/'Calc-Units'!$C$21)","v":5.1439124855858984E-4},{"$f":"IF(ISERROR(AQ20*100000000/'Calc-Units'!$C$21),\" \",AQ20*100000000/'Calc-Units'!$C$21)","v":7.0828102545506672E-3}]
[null,null,"IT & Telecoms",{"$f":"'RRP 1.3'!S$12","v":10.240069047105548},0,0,0,0,10.240069047105548,null,"Do not allocate",{"$f":"IF(ISERROR(VLOOKUP($K21,'Calc-Drivers'!$B$17:$F$27,L$42,FALSE)),\" \",VLOOKUP($K21,'Calc-Drivers'!$B$17:$F$27,L$42,FALSE))","v":" "},{"$f":"IF(ISERROR(VLOOKUP($K21,'Calc-Drivers'!$B$17:$F$27,M$42,FALSE)),\" \",VLOOKUP($K21,'Calc-Drivers'!$B$17:$F$27,M$42,FALSE))","v":" "},{"$f":"IF(ISERROR(VLOOKUP($K21,'Calc-Drivers'!$B$17:$F$27,N$42,FALSE)),\" \",VLOOKUP($K21,'Calc-Drivers'!$B$17:$F$27,N$42,FALSE))","v":" "},{"$f":"IF(ISERROR(VLOOKUP($K21,'Calc-Drivers'!$B$17:$F$27,O$42,FALSE)),\" \",VLOOKUP($K21,'Calc-Drivers'!$B$17:$F$27,O$42,FALSE))","v":" "},null,null," "," "," "," ",null,null," "," "," "," ",null,null,{"$f":"IF(ISERROR(X21*100000000/'Calc-Units'!$E$21),\" \",X21*100000000/'Calc-Units'!$E$21)","v":" "},{"$f":"IF(ISERROR(Y21*100000000/'Calc-Units'!$D$21),\" \",Y21*100000000/'Calc-Units'!$D$21)","v":" "},{"$f":"IF(ISERROR(Z21*100000000/'Calc-Units'!$C$21),\" \",Z21*100000000/'Calc-Units'!$C$21)","v":" "},{"$f":"IF(ISERROR(AA21*100000000/'Calc-Units'!$C$21),\" \",AA21*100000000/'Calc-Units'!$C$21)","v":" "},null,0.52569999999999995,5.3832042980633856,4.8568647490421624,null,null," "," "," "," ",null,null,{"$f":"IF(ISERROR(AN21*100000000/'Calc-Units'!$E$21),\" \",AN21*100000000/'Calc-Units'!$E$21)","v":" "},{"$f":"IF(ISERROR(AO21*100000000/'Calc-Units'!$D$21),\" \",AO21*100000000/'Calc-Units'!$D$21)","v":" "},{"$f":"IF(ISERROR(AP21*100000000/'Calc-Units'!$C$21),\" \",AP21*100000000/'Calc-Units'!$C$21)","v":" "},{"$f":"IF(ISERROR(AQ21*100000000/'Calc-Units'!$C$21),\" \",AQ21*100000000/'Calc-Units'!$C$21)","v":" "}]
[null,null,"Property Mgt",{"$f":"'RRP 1.3'!T$12","v":4.5836090382398558},0,0,0,0,4.5836090382398558,null,"Do not allocate",{"$f":"IF(ISERROR(VLOOKUP($K22,'Calc-Drivers'!$B$17:$F$27,L$42,FALSE)),\" \",VLOOKUP($K22,'Calc-Drivers'!$B$17:$F$27,L$42,FALSE))","v":" "},{"$f":"IF(ISERROR(VLOOKUP($K22,'Calc-Drivers'!$B$17:$F$27,M$42,FALSE)),\" \",VLOOKUP($K22,'Calc-Drivers'!$B$17:$F$27,M$42,FALSE))","v":" "},{"$f":"IF(ISERROR(VLOOKUP($K22,'Calc-Drivers'!$B$17:$F$27,N$42,FALSE)),\" \",VLOOKUP($K22,'Calc-Drivers'!$B$17:$F$27,N$42,FALSE))","v":" "},{"$f":"IF(ISERROR(VLOOKUP($K22,'Calc-Drivers'!$B$17:$F$27,O$42,FALSE)),\" \",VLOOKUP($K22,'Calc-Drivers'!$B$17:$F$27,O$42,FALSE))","v":" "},null,null," "," "," "," ",null,null," "," "," "," ",null,null,{"$f":"IF(ISERROR(X22*100000000/'Calc-Units'!$E$21),\" \",X22*100000000/'Calc-Units'!$E$21)","v":" "},{"$f":"IF(ISERROR(Y22*100000000/'Calc-Units'!$D$21),\" \",Y22*100000000/'Calc-Units'!$D$21)","v":" "},{"$f":"IF(ISERROR(Z22*100000000/'Calc-Units'!$C$21),\" \",Z22*100000000/'Calc-Units'!$C$21)","v":" "},{"$f":"IF(ISERROR(AA22*100000000/'Calc-Units'!$C$21),\" \",AA22*100000000/'Calc-Units'!$C$21)","v":" "},null,0.52569999999999995,2.409603271402692,2.1740057668371637,null,null," "," "," "," ",null,null,{"$f":"IF(ISERROR(AN22*100000000/'Calc-Units'!$E$21),\" \",AN22*100000000/'Calc-Units'!$E$21)","v":" "},{"$f":"IF(ISERROR(AO22*100000000/'Calc-Units'!$D$21),\" \",AO22*100000000/'Calc-Units'!$D$21)","v":" "},{"$f":"IF(ISERROR(AP22*100000000/'Calc-Units'!$C$21),\" \",AP22*100000000/'Calc-Units'!$C$21)","v":" "},{"$f":"IF(ISERROR(AQ22*100000000/'Calc-Units'!$C$21),\" \",AQ22*100000000/'Calc-Units'!$C$21)","v":" "}]
[null,null,"HR & Non-operational Training",{"$f":"'RRP 1.3'!U$12","v":1.4397993171236436},0,0,0,0,1.4397993171236436,null,"MEAV",{"$f":"IF(ISERROR(VLOOKUP($K23,'Calc-Drivers'!$B$17:$F$27,L$42,FALSE)),\" \",VLOOKUP($K23,'Calc-Drivers'!$B$17:$F$27,L$42,FALSE))","v":0.38747343048261829},{"$f":"IF(ISERROR(VLOOKUP($K23,'Calc-Drivers'!$B$17:$F$27,M$42,FALSE)),\" \",VLOOKUP($K23,'Calc-Drivers'!$B$17:$F$27,M$42,FALSE))","v":0.11030677919037249},{"$f":"IF(ISERROR(VLOOKUP($K23,'Calc-Drivers'!$B$17:$F$27,N$42,FALSE)),\" \",VLOOKUP($K23,'Calc-Drivers'!$B$17:$F$27,N$42,FALSE))","v":3.4004292882242937E-2},{"$f":"IF(ISERROR(VLOOKUP($K23,'Calc-Drivers'!$B$17:$F$27,O$42,FALSE)),\" \",VLOOKUP($K23,'Calc-Drivers'!$B$17:$F$27,O$42,FALSE))","v":0.4682154974447662},null,null,0.55788398061242939,0.15881962535240685,4.8959357671125754E-2,0.67413635348768153,null,{"$f":"X23-'[8]Calc - WPD Opex Allocation'!Y23","v":0},0.55788398061242939,0.15881962535240685,4.8959357671125754E-2,0.67413635348768153,null,null,{"$f":"IF(ISERROR(X23*100000000/'Calc-Units'!$E$21),\" \",X23*100000000/'Calc-Units'!$E$21)","v":1.899831318069585E-3},{"$f":"IF(ISERROR(Y23*100000000/'Calc-Units'!$D$21),\" \",Y23*100000000/'Calc-Units'!$D$21)","v":5.5367375034617145E-4},{"$f":"IF(ISERROR(Z23*100000000/'Calc-Units'!$C$21),\" \",Z23*100000000/'Calc-Units'!$C$21)","v":2.538595751899085E-4},{"$f":"IF(ISERROR(AA23*100000000/'Calc-Units'!$C$21),\" \",AA23*100000000/'Calc-Units'!$C$21)","v":3.4954700481576355E-3},null,0.52569999999999995,0.75690250101189938,0.68289681611174424,null,null,0.26460437200447529,7.5328148304646569E-2,2.3221423343414947E-2,0.31974287245920741,null,null,{"$f":"IF(ISERROR(AN23*100000000/'Calc-Units'!$E$21),\" \",AN23*100000000/'Calc-Units'!$E$21)","v":9.0108999416040438E-4},{"$f":"IF(ISERROR(AO23*100000000/'Calc-Units'!$D$21),\" \",AO23*100000000/'Calc-Units'!$D$21)","v":2.6260745978918919E-4},{"$f":"IF(ISERROR(AP23*100000000/'Calc-Units'!$C$21),\" \",AP23*100000000/'Calc-Units'!$C$21)","v":1.2040559651257363E-4},{"$f":"IF(ISERROR(AQ23*100000000/'Calc-Units'!$C$21),\" \",AQ23*100000000/'Calc-Units'!$C$21)","v":1.6579014438411665E-3}]
[null,null,"Health & Safety & Operational Training",{"$f":"'RRP 1.3'!V$12","v":2.0706365899867683},0,0,0,0,2.0706365899867683,null,"MEAV",{"$f":"IF(ISERROR(VLOOKUP($K24,'Calc-Drivers'!$B$17:$F$27,L$42,FALSE)),\" \",VLOOKUP($K24,'Calc-Drivers'!$B$17:$F$27,L$42,FALSE))","v":0.38747343048261829},{"$f":"IF(ISERROR(VLOOKUP($K24,'Calc-Drivers'!$B$17:$F$27,M$42,FALSE)),\" \",VLOOKUP($K24,'Calc-Drivers'!$B$17:$F$27,M$42,FALSE))","v":0.11030677919037249},{"$f":"IF(ISERROR(VLOOKUP($K24,'Calc-Drivers'!$B$17:$F$27,N$42,FALSE)),\" \",VLOOKUP($K24,'Calc-Drivers'!$B$17:$F$27,N$42,FALSE))","v":3.4004292882242937E-2},{"$f":"IF(ISERROR(VLOOKUP($K24,'Calc-Drivers'!$B$17:$F$27,O$42,FALSE)),\" \",VLOOKUP($K24,'Calc-Drivers'!$B$17:$F$27,O$42,FALSE))","v":0.4682154974447662},null,null,0.8023166628050038,0.22840525311517629,7.0410533058598845E-2,0.9695041410079891,null,{"$f":"X24-'[8]Calc - WPD Opex Allocation'!Y24","v":0},0.8023166628050038,0.22840525311517629,7.0410533058598845E-2,0.9695041410079891,null,null,{"$f":"IF(ISERROR(X24*100000000/'Calc-Units'!$E$21),\" \",X24*100000000/'Calc-Units'!$E$21)","v":2.7322281620861823E-3},{"$f":"IF(ISERROR(Y24*100000000/'Calc-Units'!$D$21),\" \",Y24*100000000/'Calc-Units'!$D$21)","v":7.9626175172267373E-4},{"$f":"IF(ISERROR(Z24*100000000/'Calc-Units'!$C$21),\" \",Z24*100000000/'Calc-Units'!$C$21)","v":3.6508624421133901E-4},{"$f":"IF(ISERROR(AA24*100000000/'Calc-Units'!$C$21),\" \",AA24*100000000/'Calc-Units'!$C$21)","v":5.0269840350927568E-3},null,0.52569999999999995,1.0885336553560438,0.98210293463072429,null,null,0.38053879316841333,0.10833261155252813,3.3395715829693438E-2,0.45983581408008928,null,null,{"$f":"IF(ISERROR(AN24*100000000/'Calc-Units'!$E$21),\" \",AN24*100000000/'Calc-Units'!$E$21)","v":1.2958958172774764E-3},{"$f":"IF(ISERROR(AO24*100000000/'Calc-Units'!$D$21),\" \",AO24*100000000/'Calc-Units'!$D$21)","v":3.7766694884206414E-4},{"$f":"IF(ISERROR(AP24*100000000/'Calc-Units'!$C$21),\" \",AP24*100000000/'Calc-Units'!$C$21)","v":1.7316040562943814E-4},{"$f":"IF(ISERROR(AQ24*100000000/'Calc-Units'!$C$21),\" \",AQ24*100000000/'Calc-Units'!$C$21)","v":2.3842985278444946E-3}]
[null,null,"Finance & Regulation",{"$f":"'RRP 1.3'!W$12","v":7.5444930721556567},0,0,0,0,7.5444930721556567,null,"MEAV",{"$f":"IF(ISERROR(VLOOKUP($K25,'Calc-Drivers'!$B$17:$F$27,L$42,FALSE)),\" \",VLOOKUP($K25,'Calc-Drivers'!$B$17:$F$27,L$42,FALSE))","v":0.38747343048261829},{"$f":"IF(ISERROR(VLOOKUP($K25,'Calc-Drivers'!$B$17:$F$27,M$42,FALSE)),\" \",VLOOKUP($K25,'Calc-Drivers'!$B$17:$F$27,M$42,FALSE))","v":0.11030677919037249},{"$f":"IF(ISERROR(VLOOKUP($K25,'Calc-Drivers'!$B$17:$F$27,N$42,FALSE)),\" \",VLOOKUP($K25,'Calc-Drivers'!$B$17:$F$27,N$42,FALSE))","v":3.4004292882242937E-2},{"$f":"IF(ISERROR(VLOOKUP($K25,'Calc-Drivers'!$B$17:$F$27,O$42,FALSE)),\" \",VLOOKUP($K25,'Calc-Drivers'!$B$17:$F$27,O$42,FALSE))","v":0.4682154974447662},null,null,2.9232906119205002,0.83220873141356899,0.25654515207363376,3.532448576747953,null,{"$f":"X25-'[8]Calc - WPD Opex Allocation'!Y25","v":0},2.9232906119205002,0.83220873141356899,0.25654515207363376,3.532448576747953,null,null,{"$f":"IF(ISERROR(X25*100000000/'Calc-Units'!$E$21),\" \",X25*100000000/'Calc-Units'!$E$21)","v":9.9550430723044023E-3},{"$f":"IF(ISERROR(Y25*100000000/'Calc-Units'!$D$21),\" \",Y25*100000000/'Calc-Units'!$D$21)","v":2.9012291671773401E-3},{"$f":"IF(ISERROR(Z25*100000000/'Calc-Units'!$C$21),\" \",Z25*100000000/'Calc-Units'!$C$21)","v":1.3302144149830643E-3},{"$f":"IF(ISERROR(AA25*100000000/'Calc-Units'!$C$21),\" \",AA25*100000000/'Calc-Units'!$C$21)","v":1.8316128677527493E-2},null,0.52569999999999995,3.9661400080322284,3.5783530641234282,null,null,1.3865167372338933,0.39471660130945579,0.12167936562852451,1.6754403599515544,null,null,{"$f":"IF(ISERROR(AN25*100000000/'Calc-Units'!$E$21),\" \",AN25*100000000/'Calc-Units'!$E$21)","v":4.7216769291939771E-3},{"$f":"IF(ISERROR(AO25*100000000/'Calc-Units'!$D$21),\" \",AO25*100000000/'Calc-Units'!$D$21)","v":1.3760529939922125E-3},{"$f":"IF(ISERROR(AP25*100000000/'Calc-Units'!$C$21),\" \",AP25*100000000/'Calc-Units'!$C$21)","v":6.3092069702646745E-4},{"$f":"IF(ISERROR(AQ25*100000000/'Calc-Units'!$C$21),\" \",AQ25*100000000/'Calc-Units'!$C$21)","v":8.6873398317512916E-3}]
[null,null,"CEO etc",{"$f":"'RRP 1.3'!X$12","v":1.6451252035656032},0,0,0,0,1.6451252035656032,null,"MEAV",{"$f":"IF(ISERROR(VLOOKUP($K26,'Calc-Drivers'!$B$17:$F$27,L$42,FALSE)),\" \",VLOOKUP($K26,'Calc-Drivers'!$B$17:$F$27,L$42,FALSE))","v":0.38747343048261829},{"$f":"IF(ISERROR(VLOOKUP($K26,'Calc-Drivers'!$B$17:$F$27,M$42,FALSE)),\" \",VLOOKUP($K26,'Calc-Drivers'!$B$17:$F$27,M$42,FALSE))","v":0.11030677919037249},{"$f":"IF(ISERROR(VLOOKUP($K26,'Calc-Drivers'!$B$17:$F$27,N$42,FALSE)),\" \",VLOOKUP($K26,'Calc-Drivers'!$B$17:$F$27,N$42,FALSE))","v":3.4004292882242937E-2},{"$f":"IF(ISERROR(VLOOKUP($K26,'Calc-Drivers'!$B$17:$F$27,O$42,FALSE)),\" \",VLOOKUP($K26,'Calc-Drivers'!$B$17:$F$27,O$42,FALSE))","v":0.4682154974447662},null,null,0.63744230619898001,0.18146846257022758,5.5941319250004305E-2,0.77027311554639122,null,{"$f":"X26-'[8]Calc - WPD Opex Allocation'!Y26","v":0},0.63744230619898001,0.18146846257022758,5.5941319250004305E-2,0.77027311554639122,null,null,{"$f":"IF(ISERROR(X26*100000000/'Calc-Units'!$E$21),\" \",X26*100000000/'Calc-Units'!$E$21)","v":2.1707611239345612E-3},{"$f":"IF(ISERROR(Y26*100000000/'Calc-Units'!$D$21),\" \",Y26*100000000/'Calc-Units'!$D$21)","v":6.3263166638170831E-4},{"$f":"IF(ISERROR(Z26*100000000/'Calc-Units'!$C$21),\" \",Z26*100000000/'Calc-Units'!$C$21)","v":2.9006180260294671E-4},{"$f":"IF(ISERROR(AA26*100000000/'Calc-Units'!$C$21),\" \",AA26*100000000/'Calc-Units'!$C$21)","v":3.993949577654211E-3},null,0.52569999999999995,0.86484231951443746,0.78028288405116575,null,null,0.30233888583017626,8.6070491797058959E-2,2.6532967720277044E-2,0.36534053870365341,null,null,{"$f":"IF(ISERROR(AN26*100000000/'Calc-Units'!$E$21),\" \",AN26*100000000/'Calc-Units'!$E$21)","v":1.0295920010821625E-3},{"$f":"IF(ISERROR(AO26*100000000/'Calc-Units'!$D$21),\" \",AO26*100000000/'Calc-Units'!$D$21)","v":3.000571993648443E-4},{"$f":"IF(ISERROR(AP26*100000000/'Calc-Units'!$C$21),\" \",AP26*100000000/'Calc-Units'!$C$21)","v":1.3757631297457764E-4},{"$f":"IF(ISERROR(AQ26*100000000/'Calc-Units'!$C$21),\" \",AQ26*100000000/'Calc-Units'!$C$21)","v":1.8943302846813929E-3}]
["Other Costs from full activitty cost allocation",null,"Atypical cash costs",{"$f":"'RRP 1.3'!Y$12","v":1.32151902},0,0,0,0,1.32151902,null,"Do not allocate",{"$f":"IF(ISERROR(VLOOKUP($K27,'Calc-Drivers'!$B$17:$F$27,L$42,FALSE)),\" \",VLOOKUP($K27,'Calc-Drivers'!$B$17:$F$27,L$42,FALSE))","v":" "},{"$f":"IF(ISERROR(VLOOKUP($K27,'Calc-Drivers'!$B$17:$F$27,M$42,FALSE)),\" \",VLOOKUP($K27,'Calc-Drivers'!$B$17:$F$27,M$42,FALSE))","v":" "},{"$f":"IF(ISERROR(VLOOKUP($K27,'Calc-Drivers'!$B$17:$F$27,N$42,FALSE)),\" \",VLOOKUP($K27,'Calc-Drivers'!$B$17:$F$27,N$42,FALSE))","v":" "},{"$f":"IF(ISERROR(VLOOKUP($K27,'Calc-Drivers'!$B$17:$F$27,O$42,FALSE)),\" \",VLOOKUP($K27,'Calc-Drivers'!$B$17:$F$27,O$42,FALSE))","v":" "},null,null," "," "," "," ",null,null," "," "," "," ",null,null,{"$f":"IF(ISERROR(X27*100000000/'Calc-Units'!$E$21),\" \",X27*100000000/'Calc-Units'!$E$21)","v":" "},{"$f":"IF(ISERROR(Y27*100000000/'Calc-Units'!$D$21),\" \",Y27*100000000/'Calc-Units'!$D$21)","v":" "},{"$f":"IF(ISERROR(Z27*100000000/'Calc-Units'!$C$21),\" \",Z27*100000000/'Calc-Units'!$C$21)","v":" "},{"$f":"IF(ISERROR(AA27*100000000/'Calc-Units'!$C$21),\" \",AA27*100000000/'Calc-Units'!$C$21)","v":" "},null,0,0,1.32151902,null,null," "," "," "," ",null,null,{"$f":"IF(ISERROR(AN27*100000000/'Calc-Units'!$E$21),\" \",AN27*100000000/'Calc-Units'!$E$21)","v":" "},{"$f":"IF(ISERROR(AO27*100000000/'Calc-Units'!$D$21),\" \",AO27*100000000/'Calc-Units'!$D$21)","v":" "},{"$f":"IF(ISERROR(AP27*100000000/'Calc-Units'!$C$21),\" \",AP27*100000000/'Calc-Units'!$C$21)","v":" "},{"$f":"IF(ISERROR(AQ27*100000000/'Calc-Units'!$C$21),\" \",AQ27*100000000/'Calc-Units'!$C$21)","v":" "}]
[null,null,"Pension deficit payments",{"$f":"'RRP 1.3'!Z$12","v":9.5},0,0,0,0,9.5,null,"Do not allocate",{"$f":"IF(ISERROR(VLOOKUP($K28,'Calc-Drivers'!$B$17:$F$27,L$42,FALSE)),\" \",VLOOKUP($K28,'Calc-Drivers'!$B$17:$F$27,L$42,FALSE))","v":" "},{"$f":"IF(ISERROR(VLOOKUP($K28,'Calc-Drivers'!$B$17:$F$27,M$42,FALSE)),\" \",VLOOKUP($K28,'Calc-Drivers'!$B$17:$F$27,M$42,FALSE))","v":" "},{"$f":"IF(ISERROR(VLOOKUP($K28,'Calc-Drivers'!$B$17:$F$27,N$42,FALSE)),\" \",VLOOKUP($K28,'Calc-Drivers'!$B$17:$F$27,N$42,FALSE))","v":" "},{"$f":"IF(ISERROR(VLOOKUP($K28,'Calc-Drivers'!$B$17:$F$27,O$42,FALSE)),\" \",VLOOKUP($K28,'Calc-Drivers'!$B$17:$F$27,O$42,FALSE))","v":" "},null,null," "," "," "," ",null,null," "," "," "," ",null,null,{"$f":"IF(ISERROR(X28*100000000/'Calc-Units'!$E$21),\" \",X28*100000000/'Calc-Units'!$E$21)","v":" "},{"$f":"IF(ISERROR(Y28*100000000/'Calc-Units'!$D$21),\" \",Y28*100000000/'Calc-Units'!$D$21)","v":" "},{"$f":"IF(ISERROR(Z28*100000000/'Calc-Units'!$C$21),\" \",Z28*100000000/'Calc-Units'!$C$21)","v":" "},{"$f":"IF(ISERROR(AA28*100000000/'Calc-Units'!$C$21),\" \",AA28*100000000/'Calc-Units'!$C$21)","v":" "},null,0.57699999999999996,5.4814999999999996,4.0185000000000004,null,null," "," "," "," ",null,null,{"$f":"IF(ISERROR(AN28*100000000/'Calc-Units'!$E$21),\" \",AN28*100000000/'Calc-Units'!$E$21)","v":" "},{"$f":"IF(ISERROR(AO28*100000000/'Calc-Units'!$D$21),\" \",AO28*100000000/'Calc-Units'!$D$21)","v":" "},{"$f":"IF(ISERROR(AP28*100000000/'Calc-Units'!$C$21),\" \",AP28*100000000/'Calc-Units'!$C$21)","v":" "},{"$f":"IF(ISERROR(AQ28*100000000/'Calc-Units'!$C$21),\" \",AQ28*100000000/'Calc-Units'!$C$21)","v":" "}]
[null,null,"Metering",{"$f":"'RRP 1.3'!AA$12","v":0.79378199999999999},0,0,0,0,0.79378199999999999,null,"Do not allocate",{"$f":"IF(ISERROR(VLOOKUP($K29,'Calc-Drivers'!$B$17:$F$27,L$42,FALSE)),\" \",VLOOKUP($K29,'Calc-Drivers'!$B$17:$F$27,L$42,FALSE))","v":" "},{"$f":"IF(ISERROR(VLOOKUP($K29,'Calc-Drivers'!$B$17:$F$27,M$42,FALSE)),\" \",VLOOKUP($K29,'Calc-Drivers'!$B$17:$F$27,M$42,FALSE))","v":" "},{"$f":"IF(ISERROR(VLOOKUP($K29,'Calc-Drivers'!$B$17:$F$27,N$42,FALSE)),\" \",VLOOKUP($K29,'Calc-Drivers'!$B$17:$F$27,N$42,FALSE))","v":" "},{"$f":"IF(ISERROR(VLOOKUP($K29,'Calc-Drivers'!$B$17:$F$27,O$42,FALSE)),\" \",VLOOKUP($K29,'Calc-Drivers'!$B$17:$F$27,O$42,FALSE))","v":" "},null,null," "," "," "," ",null,null," "," "," "," ",null,null,{"$f":"IF(ISERROR(X29*100000000/'Calc-Units'!$E$21),\" \",X29*100000000/'Calc-Units'!$E$21)","v":" "},{"$f":"IF(ISERROR(Y29*100000000/'Calc-Units'!$D$21),\" \",Y29*100000000/'Calc-Units'!$D$21)","v":" "},{"$f":"IF(ISERROR(Z29*100000000/'Calc-Units'!$C$21),\" \",Z29*100000000/'Calc-Units'!$C$21)","v":" "},{"$f":"IF(ISERROR(AA29*100000000/'Calc-Units'!$C$21),\" \",AA29*100000000/'Calc-Units'!$C$21)","v":" "},null,0,0,0.79378199999999999,null,null," "," "," "," ",null,null,{"$f":"IF(ISERROR(AN29*100000000/'Calc-Units'!$E$21),\" \",AN29*100000000/'Calc-Units'!$E$21)","v":" "},{"$f":"IF(ISERROR(AO29*100000000/'Calc-Units'!$D$21),\" \",AO29*100000000/'Calc-Units'!$D$21)","v":" "},{"$f":"IF(ISERROR(AP29*100000000/'Calc-Units'!$C$21),\" \",AP29*100000000/'Calc-Units'!$C$21)","v":" "},{"$f":"IF(ISERROR(AQ29*100000000/'Calc-Units'!$C$21),\" \",AQ29*100000000/'Calc-Units'!$C$21)","v":" "}]
[null,null,"Excluded services & de minimis",{"$f":"'RRP 1.3'!AB$12","v":9.751431000299192},0,0,0,0,9.751431000299192,null,"Do not allocate",{"$f":"IF(ISERROR(VLOOKUP($K30,'Calc-Drivers'!$B$17:$F$27,L$42,FALSE)),\" \",VLOOKUP($K30,'Calc-Drivers'!$B$17:$F$27,L$42,FALSE))","v":" "},{"$f":"IF(ISERROR(VLOOKUP($K30,'Calc-Drivers'!$B$17:$F$27,M$42,FALSE)),\" \",VLOOKUP($K30,'Calc-Drivers'!$B$17:$F$27,M$42,FALSE))","v":" "},{"$f":"IF(ISERROR(VLOOKUP($K30,'Calc-Drivers'!$B$17:$F$27,N$42,FALSE)),\" \",VLOOKUP($K30,'Calc-Drivers'!$B$17:$F$27,N$42,FALSE))","v":" "},{"$f":"IF(ISERROR(VLOOKUP($K30,'Calc-Drivers'!$B$17:$F$27,O$42,FALSE)),\" \",VLOOKUP($K30,'Calc-Drivers'!$B$17:$F$27,O$42,FALSE))","v":" "},null,null," "," "," "," ",null,null," "," "," "," ",null,null,{"$f":"IF(ISERROR(X30*100000000/'Calc-Units'!$E$21),\" \",X30*100000000/'Calc-Units'!$E$21)","v":" "},{"$f":"IF(ISERROR(Y30*100000000/'Calc-Units'!$D$21),\" \",Y30*100000000/'Calc-Units'!$D$21)","v":" "},{"$f":"IF(ISERROR(Z30*100000000/'Calc-Units'!$C$21),\" \",Z30*100000000/'Calc-Units'!$C$21)","v":" "},{"$f":"IF(ISERROR(AA30*100000000/'Calc-Units'!$C$21),\" \",AA30*100000000/'Calc-Units'!$C$21)","v":" "},null,0,0,9.751431000299192,null,null," "," "," "," ",null,null,{"$f":"IF(ISERROR(AN30*100000000/'Calc-Units'!$E$21),\" \",AN30*100000000/'Calc-Units'!$E$21)","v":" "},{"$f":"IF(ISERROR(AO30*100000000/'Calc-Units'!$D$21),\" \",AO30*100000000/'Calc-Units'!$D$21)","v":" "},{"$f":"IF(ISERROR(AP30*100000000/'Calc-Units'!$C$21),\" \",AP30*100000000/'Calc-Units'!$C$21)","v":" "},{"$f":"IF(ISERROR(AQ30*100000000/'Calc-Units'!$C$21),\" \",AQ30*100000000/'Calc-Units'!$C$21)","v":" "}]
[null,null,"Relevant distributed generation (less contributions)",{"$f":"'RRP 1.3'!AC$12","v":-8.3266726846886741E-16},0,0,0,0,-8.3266726846886741E-16,null,"Do not allocate",{"$f":"IF(ISERROR(VLOOKUP($K31,'Calc-Drivers'!$B$17:$F$27,L$42,FALSE)),\" \",VLOOKUP($K31,'Calc-Drivers'!$B$17:$F$27,L$42,FALSE))","v":" "},{"$f":"IF(ISERROR(VLOOKUP($K31,'Calc-Drivers'!$B$17:$F$27,M$42,FALSE)),\" \",VLOOKUP($K31,'Calc-Drivers'!$B$17:$F$27,M$42,FALSE))","v":" "},{"$f":"IF(ISERROR(VLOOKUP($K31,'Calc-Drivers'!$B$17:$F$27,N$42,FALSE)),\" \",VLOOKUP($K31,'Calc-Drivers'!$B$17:$F$27,N$42,FALSE))","v":" "},{"$f":"IF(ISERROR(VLOOKUP($K31,'Calc-Drivers'!$B$17:$F$27,O$42,FALSE)),\" \",VLOOKUP($K31,'Calc-Drivers'!$B$17:$F$27,O$42,FALSE))","v":" "},null,null," "," "," "," ",null,null," "," "," "," ",null,null,{"$f":"IF(ISERROR(X31*100000000/'Calc-Units'!$E$21),\" \",X31*100000000/'Calc-Units'!$E$21)","v":" "},{"$f":"IF(ISERROR(Y31*100000000/'Calc-Units'!$D$21),\" \",Y31*100000000/'Calc-Units'!$D$21)","v":" "},{"$f":"IF(ISERROR(Z31*100000000/'Calc-Units'!$C$21),\" \",Z31*100000000/'Calc-Units'!$C$21)","v":" "},{"$f":"IF(ISERROR(AA31*100000000/'Calc-Units'!$C$21),\" \",AA31*100000000/'Calc-Units'!$C$21)","v":" "},null,0,0,-8.3266726846886741E-16,null,null," "," "," "," ",null,null,{"$f":"IF(ISERROR(AN31*100000000/'Calc-Units'!$E$21),\" \",AN31*100000000/'Calc-Units'!$E$21)","v":" "},{"$f":"IF(ISERROR(AO31*100000000/'Calc-Units'!$D$21),\" \",AO31*100000000/'Calc-Units'!$D$21)","v":" "},{"$f":"IF(ISERROR(AP31*100000000/'Calc-Units'!$C$21),\" \",AP31*100000000/'Calc-Units'!$C$21)","v":" "},{"$f":"IF(ISERROR(AQ31*100000000/'Calc-Units'!$C$21),\" \",AQ31*100000000/'Calc-Units'!$C$21)","v":" "}]
[null,null,"IFI",{"$f":"'RRP 1.3'!AD$12","v":1.0145090392},0,0,0,0,1.0145090392,null,"Do not allocate",{"$f":"IF(ISERROR(VLOOKUP($K32,'Calc-Drivers'!$B$17:$F$27,L$42,FALSE)),\" \",VLOOKUP($K32,'Calc-Drivers'!$B$17:$F$27,L$42,FALSE))","v":" "},{"$f":"IF(ISERROR(VLOOKUP($K32,'Calc-Drivers'!$B$17:$F$27,M$42,FALSE)),\" \",VLOOKUP($K32,'Calc-Drivers'!$B$17:$F$27,M$42,FALSE))","v":" "},{"$f":"IF(ISERROR(VLOOKUP($K32,'Calc-Drivers'!$B$17:$F$27,N$42,FALSE)),\" \",VLOOKUP($K32,'Calc-Drivers'!$B$17:$F$27,N$42,FALSE))","v":" "},{"$f":"IF(ISERROR(VLOOKUP($K32,'Calc-Drivers'!$B$17:$F$27,O$42,FALSE)),\" \",VLOOKUP($K32,'Calc-Drivers'!$B$17:$F$27,O$42,FALSE))","v":" "},null,null," "," "," "," ",null,null," "," "," "," ",null,null,{"$f":"IF(ISERROR(X32*100000000/'Calc-Units'!$E$21),\" \",X32*100000000/'Calc-Units'!$E$21)","v":" "},{"$f":"IF(ISERROR(Y32*100000000/'Calc-Units'!$D$21),\" \",Y32*100000000/'Calc-Units'!$D$21)","v":" "},{"$f":"IF(ISERROR(Z32*100000000/'Calc-Units'!$C$21),\" \",Z32*100000000/'Calc-Units'!$C$21)","v":" "},{"$f":"IF(ISERROR(AA32*100000000/'Calc-Units'!$C$21),\" \",AA32*100000000/'Calc-Units'!$C$21)","v":" "},null,0,0,1.0145090392,null,null," "," "," "," ",null,null,{"$f":"IF(ISERROR(AN32*100000000/'Calc-Units'!$E$21),\" \",AN32*100000000/'Calc-Units'!$E$21)","v":" "},{"$f":"IF(ISERROR(AO32*100000000/'Calc-Units'!$D$21),\" \",AO32*100000000/'Calc-Units'!$D$21)","v":" "},{"$f":"IF(ISERROR(AP32*100000000/'Calc-Units'!$C$21),\" \",AP32*100000000/'Calc-Units'!$C$21)","v":" "},{"$f":"IF(ISERROR(AQ32*100000000/'Calc-Units'!$C$21),\" \",AQ32*100000000/'Calc-Units'!$C$21)","v":" "}]
[null,null,"Disallowed Related Party Margins",{"$f":"'RRP 1.3'!AE$12","v":4.3032873328058328},0,0,0,0,4.3032873328058328,null,"Do not allocate",{"$f":"IF(ISERROR(VLOOKUP($K33,'Calc-Drivers'!$B$17:$F$27,L$42,FALSE)),\" \",VLOOKUP($K33,'Calc-Drivers'!$B$17:$F$27,L$42,FALSE))","v":" "},{"$f":"IF(ISERROR(VLOOKUP($K33,'Calc-Drivers'!$B$17:$F$27,M$42,FALSE)),\" \",VLOOKUP($K33,'Calc-Drivers'!$B$17:$F$27,M$42,FALSE))","v":" "},{"$f":"IF(ISERROR(VLOOKUP($K33,'Calc-Drivers'!$B$17:$F$27,N$42,FALSE)),\" \",VLOOKUP($K33,'Calc-Drivers'!$B$17:$F$27,N$42,FALSE))","v":" "},{"$f":"IF(ISERROR(VLOOKUP($K33,'Calc-Drivers'!$B$17:$F$27,O$42,FALSE)),\" \",VLOOKUP($K33,'Calc-Drivers'!$B$17:$F$27,O$42,FALSE))","v":" "},null,null," "," "," "," ",null,null," "," "," "," ",null,null,{"$f":"IF(ISERROR(X33*100000000/'Calc-Units'!$E$21),\" \",X33*100000000/'Calc-Units'!$E$21)","v":" "},{"$f":"IF(ISERROR(Y33*100000000/'Calc-Units'!$D$21),\" \",Y33*100000000/'Calc-Units'!$D$21)","v":" "},{"$f":"IF(ISERROR(Z33*100000000/'Calc-Units'!$C$21),\" \",Z33*100000000/'Calc-Units'!$C$21)","v":" "},{"$f":"IF(ISERROR(AA33*100000000/'Calc-Units'!$C$21),\" \",AA33*100000000/'Calc-Units'!$C$21)","v":" "},null,0,0,4.3032873328058328,null,null," "," "," "," ",null,null,{"$f":"IF(ISERROR(AN33*100000000/'Calc-Units'!$E$21),\" \",AN33*100000000/'Calc-Units'!$E$21)","v":" "},{"$f":"IF(ISERROR(AO33*100000000/'Calc-Units'!$D$21),\" \",AO33*100000000/'Calc-Units'!$D$21)","v":" "},{"$f":"IF(ISERROR(AP33*100000000/'Calc-Units'!$C$21),\" \",AP33*100000000/'Calc-Units'!$C$21)","v":" "},{"$f":"IF(ISERROR(AQ33*100000000/'Calc-Units'!$C$21),\" \",AQ33*100000000/'Calc-Units'!$C$21)","v":" "}]
[null,null,"Statutory Depreciation",{"$f":"'RRP 1.3'!AF$12","v":41.912756859700004},0,0,0,0,41.912756859700004,null,"Do not allocate",{"$f":"IF(ISERROR(VLOOKUP($K34,'Calc-Drivers'!$B$17:$F$27,L$42,FALSE)),\" \",VLOOKUP($K34,'Calc-Drivers'!$B$17:$F$27,L$42,FALSE))","v":" "},{"$f":"IF(ISERROR(VLOOKUP($K34,'Calc-Drivers'!$B$17:$F$27,M$42,FALSE)),\" \",VLOOKUP($K34,'Calc-Drivers'!$B$17:$F$27,M$42,FALSE))","v":" "},{"$f":"IF(ISERROR(VLOOKUP($K34,'Calc-Drivers'!$B$17:$F$27,N$42,FALSE)),\" \",VLOOKUP($K34,'Calc-Drivers'!$B$17:$F$27,N$42,FALSE))","v":" "},{"$f":"IF(ISERROR(VLOOKUP($K34,'Calc-Drivers'!$B$17:$F$27,O$42,FALSE)),\" \",VLOOKUP($K34,'Calc-Drivers'!$B$17:$F$27,O$42,FALSE))","v":" "},null,null," "," "," "," ",null,null," "," "," "," ",null,null,{"$f":"IF(ISERROR(X34*100000000/'Calc-Units'!$E$21),\" \",X34*100000000/'Calc-Units'!$E$21)","v":" "},{"$f":"IF(ISERROR(Y34*100000000/'Calc-Units'!$D$21),\" \",Y34*100000000/'Calc-Units'!$D$21)","v":" "},{"$f":"IF(ISERROR(Z34*100000000/'Calc-Units'!$C$21),\" \",Z34*100000000/'Calc-Units'!$C$21)","v":" "},{"$f":"IF(ISERROR(AA34*100000000/'Calc-Units'!$C$21),\" \",AA34*100000000/'Calc-Units'!$C$21)","v":" "},null,0,0,41.912756859700004,null,null," "," "," "," ",null,null,{"$f":"IF(ISERROR(AN34*100000000/'Calc-Units'!$E$21),\" \",AN34*100000000/'Calc-Units'!$E$21)","v":" "},{"$f":"IF(ISERROR(AO34*100000000/'Calc-Units'!$D$21),\" \",AO34*100000000/'Calc-Units'!$D$21)","v":" "},{"$f":"IF(ISERROR(AP34*100000000/'Calc-Units'!$C$21),\" \",AP34*100000000/'Calc-Units'!$C$21)","v":" "},{"$f":"IF(ISERROR(AQ34*100000000/'Calc-Units'!$C$21),\" \",AQ34*100000000/'Calc-Units'!$C$21)","v":" "}]
[null,null,"Network Rates",{"$f":"'RRP 1.3'!AG$12","v":27.091992000000001},0,0,0,0,27.091992000000001,null,"Do not allocate",{"$f":"IF(ISERROR(VLOOKUP($K35,'Calc-Drivers'!$B$17:$F$27,L$42,FALSE)),\" \",VLOOKUP($K35,'Calc-Drivers'!$B$17:$F$27,L$42,FALSE))","v":" "},{"$f":"IF(ISERROR(VLOOKUP($K35,'Calc-Drivers'!$B$17:$F$27,M$42,FALSE)),\" \",VLOOKUP($K35,'Calc-Drivers'!$B$17:$F$27,M$42,FALSE))","v":" "},{"$f":"IF(ISERROR(VLOOKUP($K35,'Calc-Drivers'!$B$17:$F$27,N$42,FALSE)),\" \",VLOOKUP($K35,'Calc-Drivers'!$B$17:$F$27,N$42,FALSE))","v":" "},{"$f":"IF(ISERROR(VLOOKUP($K35,'Calc-Drivers'!$B$17:$F$27,O$42,FALSE)),\" \",VLOOKUP($K35,'Calc-Drivers'!$B$17:$F$27,O$42,FALSE))","v":" "},null,null," "," "," "," ",null,null," "," "," "," ",null,null,{"$f":"IF(ISERROR(X35*100000000/'Calc-Units'!$E$21),\" \",X35*100000000/'Calc-Units'!$E$21)","v":" "},{"$f":"IF(ISERROR(Y35*100000000/'Calc-Units'!$D$21),\" \",Y35*100000000/'Calc-Units'!$D$21)","v":" "},{"$f":"IF(ISERROR(Z35*100000000/'Calc-Units'!$C$21),\" \",Z35*100000000/'Calc-Units'!$C$21)","v":" "},{"$f":"IF(ISERROR(AA35*100000000/'Calc-Units'!$C$21),\" \",AA35*100000000/'Calc-Units'!$C$21)","v":" "},null,0,0,27.091992000000001,null,null," "," "," "," ",null,null,{"$f":"IF(ISERROR(AN35*100000000/'Calc-Units'!$E$21),\" \",AN35*100000000/'Calc-Units'!$E$21)","v":" "},{"$f":"IF(ISERROR(AO35*100000000/'Calc-Units'!$D$21),\" \",AO35*100000000/'Calc-Units'!$D$21)","v":" "},{"$f":"IF(ISERROR(AP35*100000000/'Calc-Units'!$C$21),\" \",AP35*100000000/'Calc-Units'!$C$21)","v":" "},{"$f":"IF(ISERROR(AQ35*100000000/'Calc-Units'!$C$21),\" \",AQ35*100000000/'Calc-Units'!$C$21)","v":" "}]
[null,null,"Transmission Exit Charges",{"$f":"'RRP 1.3'!AH$12","v":4.4000000000000004},0,0,0,0,4.4000000000000004,null,"Do not allocate",{"$f":"IF(ISERROR(VLOOKUP($K36,'Calc-Drivers'!$B$17:$F$27,L$42,FALSE)),\" \",VLOOKUP($K36,'Calc-Drivers'!$B$17:$F$27,L$42,FALSE))","v":" "},{"$f":"IF(ISERROR(VLOOKUP($K36,'Calc-Drivers'!$B$17:$F$27,M$42,FALSE)),\" \",VLOOKUP($K36,'Calc-Drivers'!$B$17:$F$27,M$42,FALSE))","v":" "},{"$f":"IF(ISERROR(VLOOKUP($K36,'Calc-Drivers'!$B$17:$F$27,N$42,FALSE)),\" \",VLOOKUP($K36,'Calc-Drivers'!$B$17:$F$27,N$42,FALSE))","v":" "},{"$f":"IF(ISERROR(VLOOKUP($K36,'Calc-Drivers'!$B$17:$F$27,O$42,FALSE)),\" \",VLOOKUP($K36,'Calc-Drivers'!$B$17:$F$27,O$42,FALSE))","v":" "},null,null," "," "," "," ",null,null," "," "," "," ",null,null,{"$f":"IF(ISERROR(X36*100000000/'Calc-Units'!$E$21),\" \",X36*100000000/'Calc-Units'!$E$21)","v":" "},{"$f":"IF(ISERROR(Y36*100000000/'Calc-Units'!$D$21),\" \",Y36*100000000/'Calc-Units'!$D$21)","v":" "},{"$f":"IF(ISERROR(Z36*100000000/'Calc-Units'!$C$21),\" \",Z36*100000000/'Calc-Units'!$C$21)","v":" "},{"$f":"IF(ISERROR(AA36*100000000/'Calc-Units'!$C$21),\" \",AA36*100000000/'Calc-Units'!$C$21)","v":" "},null,0,0,4.4000000000000004,null,null," "," "," "," ",null,null,{"$f":"IF(ISERROR(AN36*100000000/'Calc-Units'!$E$21),\" \",AN36*100000000/'Calc-Units'!$E$21)","v":" "},{"$f":"IF(ISERROR(AO36*100000000/'Calc-Units'!$D$21),\" \",AO36*100000000/'Calc-Units'!$D$21)","v":" "},{"$f":"IF(ISERROR(AP36*100000000/'Calc-Units'!$C$21),\" \",AP36*100000000/'Calc-Units'!$C$21)","v":" "},{"$f":"IF(ISERROR(AQ36*100000000/'Calc-Units'!$C$21),\" \",AQ36*100000000/'Calc-Units'!$C$21)","v":" "}]
[null,null,"Pension deficit repair payments by related parties (note 2)",{"$f":"'RRP 1.3'!AI$12","v":-9.5},0,0,0,0,-9.5,null,"Do not allocate",{"$f":"IF(ISERROR(VLOOKUP($K37,'Calc-Drivers'!$B$17:$F$27,L$42,FALSE)),\" \",VLOOKUP($K37,'Calc-Drivers'!$B$17:$F$27,L$42,FALSE))","v":" "},{"$f":"IF(ISERROR(VLOOKUP($K37,'Calc-Drivers'!$B$17:$F$27,M$42,FALSE)),\" \",VLOOKUP($K37,'Calc-Drivers'!$B$17:$F$27,M$42,FALSE))","v":" "},{"$f":"IF(ISERROR(VLOOKUP($K37,'Calc-Drivers'!$B$17:$F$27,N$42,FALSE)),\" \",VLOOKUP($K37,'Calc-Drivers'!$B$17:$F$27,N$42,FALSE))","v":" "},{"$f":"IF(ISERROR(VLOOKUP($K37,'Calc-Drivers'!$B$17:$F$27,O$42,FALSE)),\" \",VLOOKUP($K37,'Calc-Drivers'!$B$17:$F$27,O$42,FALSE))","v":" "},null,null," "," "," "," ",null,null," "," "," "," ",null,null,{"$f":"IF(ISERROR(X37*100000000/'Calc-Units'!$E$21),\" \",X37*100000000/'Calc-Units'!$E$21)","v":" "},{"$f":"IF(ISERROR(Y37*100000000/'Calc-Units'!$D$21),\" \",Y37*100000000/'Calc-Units'!$D$21)","v":" "},{"$f":"IF(ISERROR(Z37*100000000/'Calc-Units'!$C$21),\" \",Z37*100000000/'Calc-Units'!$C$21)","v":" "},{"$f":"IF(ISERROR(AA37*100000000/'Calc-Units'!$C$21),\" \",AA37*100000000/'Calc-Units'!$C$21)","v":" "},null,0,0,-9.5,null,null," "," "," "," ",null,null,{"$f":"IF(ISERROR(AN37*100000000/'Calc-Units'!$E$21),\" \",AN37*100000000/'Calc-Units'!$E$21)","v":" "},{"$f":"IF(ISERROR(AO37*100000000/'Calc-Units'!$D$21),\" \",AO37*100000000/'Calc-Units'!$D$21)","v":" "},{"$f":"IF(ISERROR(AP37*100000000/'Calc-Units'!$C$21),\" \",AP37*100000000/'Calc-Units'!$C$21)","v":" "},{"$f":"IF(ISERROR(AQ37*100000000/'Calc-Units'!$C$21),\" \",AQ37*100000000/'Calc-Units'!$C$21)","v":" "}]
[null,null,"Non activity costs and reconciling amounts (note 3)",{"$f":"'RRP 1.3'!AJ$12","v":2.3542553829179269},0,0,0,0,2.3542553829179269,null,"Do not allocate",{"$f":"IF(ISERROR(VLOOKUP($K38,'Calc-Drivers'!$B$17:$F$27,L$42,FALSE)),\" \",VLOOKUP($K38,'Calc-Drivers'!$B$17:$F$27,L$42,FALSE))","v":" "},{"$f":"IF(ISERROR(VLOOKUP($K38,'Calc-Drivers'!$B$17:$F$27,M$42,FALSE)),\" \",VLOOKUP($K38,'Calc-Drivers'!$B$17:$F$27,M$42,FALSE))","v":" "},{"$f":"IF(ISERROR(VLOOKUP($K38,'Calc-Drivers'!$B$17:$F$27,N$42,FALSE)),\" \",VLOOKUP($K38,'Calc-Drivers'!$B$17:$F$27,N$42,FALSE))","v":" "},{"$f":"IF(ISERROR(VLOOKUP($K38,'Calc-Drivers'!$B$17:$F$27,O$42,FALSE)),\" \",VLOOKUP($K38,'Calc-Drivers'!$B$17:$F$27,O$42,FALSE))","v":" "},null,null," "," "," "," ",null,null," "," "," "," ",null,null,{"$f":"IF(ISERROR(X38*100000000/'Calc-Units'!$E$21),\" \",X38*100000000/'Calc-Units'!$E$21)","v":" "},{"$f":"IF(ISERROR(Y38*100000000/'Calc-Units'!$D$21),\" \",Y38*100000000/'Calc-Units'!$D$21)","v":" "},{"$f":"IF(ISERROR(Z38*100000000/'Calc-Units'!$C$21),\" \",Z38*100000000/'Calc-Units'!$C$21)","v":" "},{"$f":"IF(ISERROR(AA38*100000000/'Calc-Units'!$C$21),\" \",AA38*100000000/'Calc-Units'!$C$21)","v":" "},null,0,0,2.3542553829179269,null,null," "," "," "," ",null,null,{"$f":"IF(ISERROR(AN38*100000000/'Calc-Units'!$E$21),\" \",AN38*100000000/'Calc-Units'!$E$21)","v":" "},{"$f":"IF(ISERROR(AO38*100000000/'Calc-Units'!$D$21),\" \",AO38*100000000/'Calc-Units'!$D$21)","v":" "},{"$f":"IF(ISERROR(AP38*100000000/'Calc-Units'!$C$21),\" \",AP38*100000000/'Calc-Units'!$C$21)","v":" "},{"$f":"IF(ISERROR(AQ38*100000000/'Calc-Units'!$C$21),\" \",AQ38*100000000/'Calc-Units'!$C$21)","v":" "}]
[null,null,"Total Annual Operating & Capital Expenditure per Regulatory Accounts",{"$f":"SUM(D6:D38)","v":313},{"$f":"SUM(E6:E38)","v":54.313574173271732},{"$f":"SUM(F6:F38)","v":64.448965993372653},{"$f":"SUM(G6:G38)","v":14.977420039431596},{"$f":"SUM(H6:H38)","v":12.885099865468245},166.37493992845577,null,null,null,null,null,null,null,"Total",{"$f":"SUM(R6:R38)","v":22.708937889092748},{"$f":"SUM(S6:S38)","v":6.4648298446166788},{"$f":"SUM(T6:T38)","v":1.9929143891583903},{"$f":"SUM(U6:U38)","v":27.441047085319649},null,"Total all network tiers",{"$f":"SUM(X40:AA40)","v":205.23278927973169},null,null,null,null,"Total all network tiers",{"$f":"SUM(AD40:AG40)","v":0.80660098547264891},null,null,null,null,"Total",{"$f":"SUM(AJ6:AJ38)","v":160.17386441835984},{"$f":"SUM(AK6:AK38)","v":152.82613558164019},null,"Total all network tiers",{"$f":"SUM(AN40:AQ40)","v":58.33323243083791},null,null,null,null,"Total all network tiers",{"$f":"SUM(AT40:AW40)","v":0.25655462505727411}]
[null,null,null,null,null,null,null,null,null,null,null,null,null,null,null,null,null,null,null,null,null,null,"Total by network tiers",{"$f":"SUM(X6:X38)","v":77.022512062364484},{"$f":"SUM(Y6:Y38)","v":70.91379583798934},{"$f":"SUM(Z6:Z38)","v":16.970334428589993},{"$f":"SUM(AA6:AA38)","v":40.326146950787894},null,"Total by network tiers",{"$f":"SUM(AD6:AD38)","v":0.26229428644256053},{"$f":"SUM(AE6:AE38)","v":0.24721823392909337},{"$f":"SUM(AF6:AF38)","v":8.799302306642115E-2},{"$f":"SUM(AG6:AG38)","v":0.20909544203457375},null,null,null,null,null,"Total by network tiers",{"$f":"SUM(AN6:AN38)","v":15.283031293602555},{"$f":"SUM(AO6:AO38)","v":11.013134277096137},{"$f":"SUM(AP6:AP38)","v":4.5847328376159702},{"$f":"SUM(AQ6:AQ38)","v":27.45233402252325},null,"Total by network tiers",{"$f":"SUM(AT6:AT38)","v":5.204519666391863E-2},{"$f":"SUM(AU6:AU38)","v":3.839376490616675E-2},{"$f":"SUM(AV6:AV38)","v":2.3772336604873854E-2},{"$f":"SUM(AW6:AW38)","v":0.14234332688231491}]
[null,null,null,null,null,null,null,null,null,null,null,null,null,null,null,null,null,null,null,null,null,null,"% ",{"$f":"X40/$X$39","v":0.37529340381074794},{"$f":"Y40/$X$39","v":0.3455285877410848},{"$f":"Z40/$X$39","v":8.2688221936405473E-2},{"$f":"AA40/$X$39","v":0.19648978651176188},null,"% ",{"$f":"AD40/$AD$39","v":0.32518468383579069},{"$f":"AE40/$AD$39","v":0.30649384067418339},{"$f":"AF40/$AD$39","v":0.10909114252427964},{"$f":"AG40/$AD$39","v":0.25923033296574616},null,null,null,null,null,"% ",{"$f":"AN40/$AN$39","v":0.26199527536422218},{"$f":"AO40/$AN$39","v":0.1887969141801584},{"$f":"AP40/$AN$39","v":7.8595556024634902E-2},{"$f":"AQ40/$AN$39","v":0.47061225443098453},null,"% ",{"$f":"AT40/$AT$39","v":0.20286204800361674},{"$f":"AU40/$AT$39","v":0.14965142373713045},{"$f":"AV40/$AT$39","v":9.2659941716376537E-2},{"$f":"AW40/$AT$39","v":0.55482658654287642}]
[null,null,null,null,null,null,null,null,null,null,"Vlookup Values:",5,4,3,2,null,null,null,null,null,null,null,null,null,null,null,null,null,null,null,null,null,null,null,null,null,null,null,"THESE % ARE USED TO ALLOCATE PRICE CONTROL OPEX"]
[]
[null,null,null,null,null,null,null,null,null,null,null,null,null,null,null,null,null,null,null,null,null,null,"Step 4.a. calculate proportion of cost classified as direct costs"]
[]
[null,null,null,null,null,null,null,null,null,null,null,null,null,null,null,null,null,null,null,null,null,null,"Total direct+other",{"$f":"SUMIF(X6:X11,\">0\",X6:X11)+SUMIF(X27:X38,\">0\",X27:X38)","v":57.456719621675923},{"$f":"SUMIF(Y6:Y11,\">0\",Y6:Y11)+SUMIF(Y27:Y38,\">0\",Y27:Y38)","v":65.111367354015783},{"$f":"SUMIF(Z6:Z11,\">0\",Z6:Z11)+SUMIF(Z27:Z38,\">0\",Z27:Z38)","v":15.324436669461969},{"$f":"SUMIF(AA6:AA11,\">0\",AA6:AA11)+SUMIF(AA27:AA38,\">0\",AA27:AA38)","v":37.06222253550586},"Max of zero or total from each catergory"]
[null,null,null,null,null,null,null,null,null,null,null,null,null,null,null,null,null,null,null,null,null,null,"Total indirect",{"$f":"SUMIF(X12:X27,\">0\",X12:X27)","v":20.382127792300921},{"$f":"SUMIF(Y12:Y27,\">0\",Y12:Y27)","v":5.8024284839735545},{"$f":"SUMIF(Z12:Z27,\">0\",Z12:Z27)","v":1.7887157892334373},{"$f":"SUMIF(AA12:AA27,\">0\",AA12:AA27)","v":24.629374177652345},"Max of zero or total from each catergory"]
[null,null,null,null,null,null,null,null,null,null,null,null,null,null,null,null,null,null,null,null,null,null,"% direct+other",{"$f":"X46/(X47+X46)","v":0.73814967115454633},{"$f":"Y46/(Y47+Y46)","v":0.91817630948384332},{"$f":"Z46/(Z47+Z46)","v":0.89547713119773154},{"$f":"AA46/(AA47+AA46)","v":0.60076614174586374}]
[null,null,null,null,null,null,null,null,null,null,null,null,null,null,null,null,null,null,null,null,null,null,"% indirect",{"$f":"X47/(X46+X47)","v":0.26185032884545356},{"$f":"Y47/(Y46+Y47)","v":8.1823690516156608E-2},{"$f":"Z47/(Z46+Z47)","v":0.10452286880226842},{"$f":"AA47/(AA46+AA47)","v":0.39923385825413632}]

{"sheet":"Calc-Units","index":6,"n_rows":21,"n_cols":6,"rows_kept":21,"cut":false,"hidden":false,"merged":[]}
["103. Units distributed (GWh) from RRP table 5.1",null,null,"Index"]
[null,"Units distributed (GWh) from RRP table 5.1"]
["Units distributed at LV",{"$f":"'RRP 5.1'!G36","v":19286}]
["Units distributed at HV",{"$f":"'RRP 5.1'!G35","v":9669}]
["Units distributed at EHV+",{"$f":"'RRP 5.1'!G34","v":710}]
["Losses",{"$f":"'RRP 5.1'!G40","v":1439}]
[]
["104. Estimated line loss adjustment factors relative to LV"]
[null,"LV services","LV","HV","EHV","132kV"]
["Units distributed at LV",1,1,1,1,1]
["Units distributed at HV",0,0,{"$f":"(1+$B$6/($B$3+$B$4/2+$B$5/4)/2)/(1+$B$6/($B$3+$B$4/2+$B$5/4))","v":0.97204413878851448},{"$f":"(1+$B$6/($B$3+$B$4/2+$B$5/4)/2)/(1+$B$6/($B$3+$B$4/2+$B$5/4))","v":0.97204413878851448},{"$f":"(1+$B$6/($B$3+$B$4/2+$B$5/4)/2)/(1+$B$6/($B$3+$B$4/2+$B$5/4))","v":0.97204413878851448}]
["Units distributed at EHV+",0,0,0,{"$f":"(1+$B$6/($B$3+$B$4/2+$B$5/4)/4)/(1+$B$6/($B$3+$B$4/2+$B$5/4))","v":0.95806620818277188},{"$f":"(1+$B$6/($B$3+$B$4/2+$B$5/4)/4)/(1+$B$6/($B$3+$B$4/2+$B$5/4))","v":0.95806620818277188}]
[]
[]
[]
[]
[]
[]
[null,"LV services","LV","HV","EHV","132kV"]
["Units (GWh) flowing through each level, loss-adjusted to LV",{"$f":"SUMPRODUCT(B$10:B$12,$B$3:$B$5)","v":19286},{"$f":"SUMPRODUCT(C$10:C$12,$B$3:$B$5)","v":19286},{"$f":"SUMPRODUCT(D$10:D$12,$B$3:$B$5)","v":28684.694777946148},{"$f":"SUMPRODUCT(E$10:E$12,$B$3:$B$5)","v":29364.921785755916},{"$f":"SUMPRODUCT(F$10:F$12,$B$3:$B$5)","v":29364.921785755916}]
["Units (kWh) flowing through each level, loss-adjusted to LV",{"$f":"B20*1000000","v":19286000000},{"$f":"C20*1000000","v":19286000000},{"$f":"D20*1000000","v":28684694777.946148},{"$f":"E20*1000000","v":29364921785.755917},{"$f":"F20*1000000","v":29364921785.755917}]

{"sheet":"Calc-Drivers","index":7,"n_rows":27,"n_cols":8,"rows_kept":27,"cut":false,"hidden":false,"merged":[]}
["Drivers - LV, HV, EHV split",null,null,null,null,null,null,"Index"]
[]
[null,"Category","LV","HV","EHV",null,"Source"]
[null,"Net Capex",{"$f":"'Calc-Net capex'!$D$6","v":0.13596332621236557},{"$f":"'Calc-Net capex'!$D$7","v":0.3317703747643298},{"$f":"'Calc-Net capex'!$D$8+'Calc-Net capex'!$D$9","v":0.53226629902330469},null,"FBPQ capex - see \"Calc Net capex\""]
[null,"Customers",1,0,0,null,"Assumption"]
[null,"Network Length",{"$f":"'RRP 5.1'!$G$64/'RRP 5.1'!$G$65","v":0.53646332525229745},{"$f":"'RRP 5.1'!$G$63/'RRP 5.1'!$G$65","v":0.3647882956531544},{"$f":"('RRP 5.1'!$G$61+'RRP 5.1'!$G$62)/'RRP 5.1'!$G$65","v":9.8748379094548117E-2},null,"RRP table 5.1"]
[null,"Substations",{"$f":"0/'RRP 5.1'!$G$73","v":0},{"$f":"('RRP 5.1'!$G$71+'RRP 5.1'!$G$72)/'RRP 5.1'!$G$73","v":0.99025499431541331},{"$f":"('RRP 5.1'!$G$68+'RRP 5.1'!$G$69+'RRP 5.1'!$G$70)/'RRP 5.1'!$G$73","v":9.7450056845866488E-3},null,"RRP table 5.1"]
[null,"Transmission Exit Charges",0,0,1,null,"Assumption"]
[null,"MEAV",{"$f":"'Calc-MEAV'!D6","v":0.4682154974447662},{"$f":"'Calc-MEAV'!D7","v":0.1443110720726154},{"$f":"'Calc-MEAV'!D8+'Calc-MEAV'!D9","v":0.38747343048261829},null,"FBPQ capex - see \"Calc MEAV\""]
[null,"EHV only",0,0,1,null,"Assumption"]
[null,"LV only",1,0,0,null,"Assumption"]
[null,"HV only",0,1,0,null,"Assumption"]
[]
["Drivers - LV, LV/HV, HV, EHV split"]
[]
[null,"Category","LV","LV/HV","HV","EHV","Source"]
[null,"Net Capex",{"$f":"'Calc-Net capex'!H6","v":0.13596332621236557},{"$f":"'Calc-Net capex'!H7","v":5.9749506838939877E-2},{"$f":"'Calc-Net capex'!H8","v":0.27202086792538993},{"$f":"'Calc-Net capex'!$D$8+'Calc-Net capex'!$D$9","v":0.53226629902330469},"FBPQ capex - see \"Calc Net capex\""]
[null,"No. of Customers",1,0,0,0,"Assumption"]
[null,"Network Length",{"$f":"'RRP 5.1'!$G$64/'RRP 5.1'!$G$65","v":0.53646332525229745},0,{"$f":"'RRP 5.1'!$G$63/'RRP 5.1'!$G$65","v":0.3647882956531544},{"$f":"('RRP 5.1'!$G$61+'RRP 5.1'!$G$62)/'RRP 5.1'!$G$65","v":9.8748379094548117E-2},"RRP table 5.1"]
[null,"No. of Substations",{"$f":"0/'RRP 5.1'!$G$73","v":0},0,{"$f":"('RRP 5.1'!$G$71+'RRP 5.1'!$G$72)/'RRP 5.1'!$G$73","v":0.99025499431541331},{"$f":"('RRP 5.1'!$G$68+'RRP 5.1'!$G$69+'RRP 5.1'!$G$70)/'RRP 5.1'!$G$73","v":9.7450056845866488E-3},"RRP table 5.1"]
[null,"Transmission Exit Charges",0,0,0,1,"Assumption"]
[null,"MEAV",{"$f":"'Calc-MEAV'!H6","v":0.4682154974447662},{"$f":"'Calc-MEAV'!H7","v":3.4004292882242937E-2},{"$f":"'Calc-MEAV'!H8","v":0.11030677919037249},{"$f":"'Calc-MEAV'!H9+'Calc-MEAV'!H10","v":0.38747343048261829},"FBPQ capex - see \"Calc MEAV\""]
[null,"MEAV excl services",{"$f":"'Calc-MEAV'!L6","v":0.31576527136969507},{"$f":"'Calc-MEAV'!L7","v":6.2491322680945351E-2},{"$f":"'Calc-MEAV'!L8","v":0.12319037124487284},{"$f":"'Calc-MEAV'!L9+'Calc-MEAV'!L10","v":0.49855303470448675},"FBPQ capex - see \"Calc MEAV\""]
[null,"MEAV excl services and 50% LV network",{"$f":"'Calc-MEAV'!Q3","v":0},{"$f":"'Calc-MEAV'!Q4","v":0},{"$f":"'Calc-MEAV'!Q5","v":"% of Total"},{"$f":"'Calc-MEAV'!Q6+'Calc-MEAV'!Q7","v":0.26169031503703866},"FBPQ capex - see \"Calc MEAV\""]
[null,"EHV only",0,0,0,1,"Assumption"]
[null,"LV only",1,0,0,0,"Assumption"]
[null,"HV only",0,0,1,0,"Assumption"]

{"sheet":"Calc-MEAV","index":8,"n_rows":164,"n_cols":18,"rows_kept":164,"cut":false,"hidden":false,"merged":[[2,14,2,16],[3,14,3,16],[2,1,2,3],[3,1,3,3],[2,5,2,7],[3,5,3,7],[2,9,2,11],[3,9,3,11]]}
["MEAV by Voltage Level",null,null,null,null,"Index"]
[]
[null,"MEAV  - LV, HV, EHV, 132kV split",null,null,null,"MEAV  - LV, LV/HV, HV, EHV, 132kV split",null,null,null,"MEAV  - LV (excl. services), LV/HV, HV, EHV, 132kV split",null,null,null,null,"MEAV  - LV (excl. services + 50%LV), LV/HV, HV, EHV, 132kV split"]
[null,"Sum of MEAV of asset classified in voltage tier (as calculated below)",null,null,null,"Sum of MEAV of asset classified in voltage tier",null,null,null,"Sum of MEAV of asset classified in voltage tier (as calculated below)",null,null,null,null,"Sum of MEAV of asset classified in voltage tier (as calculated below)"]
[null,null,"£m","% of Total",null,null,"£m","% of Total",null,null,"£m","% of Total",null,null,null,"£m","% of Total"]
[null,"LV",{"$f":"SUM(I20:I39)","v":8538239.7638876997},{"$f":"C6/$C$10","v":0.4682154974447662},null,"LV",{"$f":"SUM(I20:I39)","v":8538239.7638876997},{"$f":"G6/$G$11","v":0.4682154974447662},null,"LV",{"$f":"SUM(I20:I39)-I21-I30","v":4475251.9348172601},{"$f":"K6/$K$11","v":0.31576527136969507},null,null,"LV",{"$f":"(SUM(I20:I39)-I21-I30)*0.5","v":2237625.9674086301},{"$f":"P6/P$11","v":0.18748293572267657}]
[null,"HV",{"$f":"SUM(I42:I79)+SUM(I158:I163)+SUM(I153:I154)","v":2631614.1619917708},{"$f":"C7/$C$10","v":0.1443110720726154},null,"LV/HV",{"$f":"SUM(I62:I63)+SUM(I69:I70)+SUM(I75:I78)","v":620092.25925782206},{"$f":"G7/$G$11","v":3.4004292882242937E-2},null,"LV/HV",{"$f":"SUM(I59:I72)+SUM(I75:I78)","v":885671.85214539291},{"$f":"K7/$K$11","v":6.2491322680945351E-2},null,null,"LV/HV",{"$f":"SUM(I59:I72)+SUM(I75:I78)","v":885671.85214539291},{"$f":"P7/P$11","v":7.4207379314362082E-2}]
[null,"EHV",{"$f":"SUM(I81:I120)+SUM(I149:I150)","v":1708721.0755270889},{"$f":"C8/$C$10","v":9.3701946829376326E-2},null,"HV",{"$f":"SUM(I42:I56)+SUM(I59:I61)+SUM(I64:I68)+SUM(I71:I72)+SUM(I158:I163)+SUM(I153:I154)","v":2011521.902733949},{"$f":"G8/$G$11","v":0.11030677919037249},null,"HV",{"$f":"SUM(I42:I56)+SUM(I158:I163)+SUM(I153:I154)","v":1745942.3098463779},{"$f":"K8/$K$11","v":0.12319037124487284},null,null,"HV",{"$f":"SUM(I42:I56)+SUM(I158:I163)+SUM(I153:I154)","v":1745942.3098463779},{"$f":"P8/P$11","v":0.14628646369862799}]
[null,"132 kV",{"$f":"SUM(I121:I146)","v":5357130.1610329337},{"$f":"C9/$C$10","v":0.29377148365324196},"Check","EHV",{"$f":"SUM(I81:I120)+SUM(I149:I150)","v":1708721.0755270889},{"$f":"G9/$G$11","v":9.3701946829376326E-2},null,"EHV",{"$f":"SUM(I81:I120)+SUM(I149:I150)","v":1708721.0755270889},{"$f":"K9/$K$11","v":0.12056411168971659},null,null,"EHV",{"$f":"SUM(I81:I120)+SUM(I149:I150)","v":1708721.0755270889},{"$f":"P9/P$11","v":0.14316782529210134}]
[null,"Total",{"$f":"SUM(C6:C9)","v":18235705.162439495},{"$f":"SUM(D6:D9)","v":0.99999999999999978},{"$f":"IF(C10=$I$164,\"OK\", \"error\")","v":"OK"},"132 kV",{"$f":"SUM(I121:I146)","v":5357130.1610329337},{"$f":"G10/$G$11","v":0.29377148365324196},"Check","132 kV",{"$f":"SUM(I121:I146)","v":5357130.1610329337},{"$f":"K10/$K$11","v":0.37798892301477016},"Check",null,"132 kV",{"$f":"SUM(I121:I146)","v":5357130.1610329337},{"$f":"P10/P$11","v":0.44885539597223206},"Check"]
[null,null,null,null,null,"Total",{"$f":"SUM(G6:G10)","v":18235705.162439495},{"$f":"SUM(H6:H10)","v":0.99999999999999978},{"$f":"IF(G11=$I$164,\"OK\", \"error\")","v":"OK"},"Total",{"$f":"SUM(K6:K10)","v":14172717.333369054},{"$f":"SUM(L6:L10)","v":1},{"$f":"IF(K11=($I$164-I21-I30),\"OK\", \"error\")","v":"OK"},null,"Total",{"$f":"SUM(P6:P10)","v":11935091.365960423},{"$f":"SUM(Q6:Q10)","v":1},{"$f":"IF(P11=($I$164-I21-I30-(SUM(I20:I39)-I21-I30)*0.5),\"OK\", \"error\")","v":"OK"}]
[]
[]
["MEAV Calculation = Replacement unit cost*FBPQ closing asset balance"]
[]
[null,null,"Asset categories","Units","DNO reported Unit Cost (£)",null,"Unit cost used in MEAV calculation (£)","Closing DCPR asset Balance (units)","MEAV (£)"]
[null,null,null,null,"Sum of direct and indriect replacement unit cost from FBPQ C2","PB power numbers, if available","Is DNO Unit cost if avaliable, otherwise PB power unit cost","Closing asset balannce from FBPQ V4","Unit cost used in MEAV calculation*Closing DCPR asset Balance (units)","Classification"]
["LV Network",null,null,null,null,null,null,null,null,null,null,"LV",{"$f":"SUMIF(J:J,L18,I:I)","v":8538239.7638876997},{"$f":"M18/M$25","v":0.4682154974447662}]
[null,"Overhead lines",null,null,null,null,null,null,null,"LV",null,"HV/LV",{"$f":"SUMIF(J:J,L19,I:I)","v":760542.34925782215},{"$f":"M19/M$25","v":4.1706220981480267E-2}]
[null,null,"LV Main (OHL)","km",{"$f":"IF(ISNUMBER('FBPQ C2'!J12),'FBPQ C2'!J12,IF(ISNUMBER('FBPQ C2'!I12),'FBPQ C2'!I12,\"\"))","v":39.50991010706953},"DATA",{"$f":"IF(ISNUMBER(E20),E20,IF(H20>0,F20,\" \"))","v":39.50991010706953},{"$f":"IF(ISBLANK('FBPQ T4'!E12),\" \",'FBPQ T4'!AE12)","v":5011.7},{"$f":"IF(ISERROR(G20*H20),\" \",G20*H20)","v":198011.81648360036},"LV",null,"HV",1624509.0141403514,8.9083970138231355E-2]
[null,null,"LV Service (OHL)","Each",{"$f":"IF(ISNUMBER('FBPQ C2'!J13),'FBPQ C2'!J13,IF(ISNUMBER('FBPQ C2'!I13),'FBPQ C2'!I13,\"\"))","v":0.48182817203743339},"DATA",0.48182817203743339,{"$f":"IF(ISBLANK('FBPQ T4'!E13),\" \",'FBPQ T4'!AE13)","v":124564},{"$f":"IF(ISERROR(G21*H21),\" \",G21*H21)","v":60018.444421670851},"LV",null,"EHV/HV",1031189.4535040611,5.6547824409226899E-2]
[null,null,null,null,{"$f":"IF(ISNUMBER('FBPQ C2'!J14),'FBPQ C2'!J14,IF(ISNUMBER('FBPQ C2'!I14),'FBPQ C2'!I14,\"\"))","v":""},null,0,{"$f":"IF(ISBLANK('FBPQ T4'!E14),\" \",'FBPQ T4'!AE14)","v":" "}," ","LV",null,"EHV",720647.17279849679,3.9518470296549348E-2]
[null,"Overhead lines - Support",null,null,{"$f":"IF(ISNUMBER('FBPQ C2'!J15),'FBPQ C2'!J15,IF(ISNUMBER('FBPQ C2'!I15),'FBPQ C2'!I15,\"\"))","v":""},null,0,{"$f":"IF(ISBLANK('FBPQ T4'!E15),\" \",'FBPQ T4'!AE15)","v":" "}," ","LV",null,"132kV/EHV",611697.00564528489,3.3543918384094706E-2]
[null,null,"LV Support","Each",{"$f":"IF(ISNUMBER('[8]FBPQ C2'!K16),'[8]FBPQ C2'!K16,IF(ISNUMBER('[8]FBPQ C2'!I16),'[8]FBPQ C2'!I16,\"\"))","v":0},"DATA",0,{"$f":"IF(ISBLANK('FBPQ T4'!E16),\" \",'FBPQ T4'!AE16)","v":121993},0,"LV",null,"132kV",4948880.4032057784,0.27138409834565114]
[null,null,null,null,{"$f":"IF(ISNUMBER('FBPQ C2'!J17),'FBPQ C2'!J17,IF(ISNUMBER('FBPQ C2'!I17),'FBPQ C2'!I17,\"\"))","v":""},null,0,{"$f":"IF(ISBLANK('FBPQ T4'!E17),\" \",'FBPQ T4'!AE17)","v":" "}," ","LV",null,"All",{"$f":"SUM(M18:M24)","v":18235705.162439495},1]
[null,"Underground cables",null,null,{"$f":"IF(ISNUMBER('FBPQ C2'!J18),'FBPQ C2'!J18,IF(ISNUMBER('FBPQ C2'!I18),'FBPQ C2'!I18,\"\"))","v":""},null,0,{"$f":"IF(ISBLANK('FBPQ T4'!E18),\" \",'FBPQ T4'!AE18)","v":" "}," ","LV"]
[null,null,"LV Main (UG Consac)","km",{"$f":"IF(ISNUMBER('FBPQ C2'!J19),'FBPQ C2'!J19,IF(ISNUMBER('FBPQ C2'!I19),'FBPQ C2'!I19,\"\"))","v":120.45704300935833},"DATA",120.45704300935833,{"$f":"IF(ISBLANK('FBPQ T4'!E19),\" \",'FBPQ T4'!AE19)","v":11},1325.0274731029417,"LV"]
[null,null,"LV Main (UG Plastic)","km",{"$f":"IF(ISNUMBER('FBPQ C2'!J20),'FBPQ C2'!J20,IF(ISNUMBER('FBPQ C2'!I20),'FBPQ C2'!I20,\"\"))","v":120.45704300935833},"DATA",120.45704300935833,{"$f":"IF(ISBLANK('FBPQ T4'!E20),\" \",'FBPQ T4'!AE20)","v":15211.5},1832332.3097368542,"LV",null,"EHV/HV",{"$f":"M21","v":1031189.4535040611},{"$f":"M28/M$32","v":0.14101901896510946}]
[null,null,"LV Main (UG Paper)","km",{"$f":"IF(ISNUMBER('FBPQ C2'!J21),'FBPQ C2'!J21,IF(ISNUMBER('FBPQ C2'!I21),'FBPQ C2'!I21,\"\"))","v":120.45704300935833},"DATA",120.45704300935833,{"$f":"IF(ISBLANK('FBPQ T4'!E21),\" \",'FBPQ T4'!AE21)","v":18317},2206411.6568024163,"LV",null,"EHV",{"$f":"M22","v":720647.17279849679},{"$f":"M29/M$32","v":9.8551199280301302E-2}]
[null,null,"LV Service (UG)","Each",{"$f":"IF(ISNUMBER('FBPQ C2'!J22),'FBPQ C2'!J22,IF(ISNUMBER('FBPQ C2'!I22),'FBPQ C2'!I22,\"\"))","v":1.6107756705297416},"DATA",1.6107756705297416,{"$f":"IF(ISBLANK('FBPQ T4'!E22),\" \",'FBPQ T4'!AE22)","v":2485119.1},4002969.3846487682,"LV",null,"132kV/EHV",{"$f":"M23","v":611697.00564528489},{"$f":"M30/M$32","v":8.3651855967758273E-2}]
[null,null,null,null,{"$f":"IF(ISNUMBER('FBPQ C2'!J23),'FBPQ C2'!J23,IF(ISNUMBER('FBPQ C2'!I23),'FBPQ C2'!I23,\"\"))","v":""},null,0,{"$f":"IF(ISBLANK('FBPQ T4'!E23),\" \",'FBPQ T4'!AE23)","v":" "}," ","LV",null,"132kV",{"$f":"M24","v":4948880.4032057784},{"$f":"M31/M$32","v":0.67677792578683094}]
[null,"Switchgear ",null,null,{"$f":"IF(ISNUMBER('FBPQ C2'!J24),'FBPQ C2'!J24,IF(ISNUMBER('FBPQ C2'!I24),'FBPQ C2'!I24,\"\"))","v":""},null,0,{"$f":"IF(ISBLANK('FBPQ T4'!E24),\" \",'FBPQ T4'!AE24)","v":" "}," ","LV",null,"All EHV",{"$f":"SUM(M28:M31)","v":7312414.0351536218},{"$f":"M32/M$32","v":1}]
[null,null,"LV Pillar (ID)","Each",{"$f":"IF(ISNUMBER('FBPQ C2'!J25),'FBPQ C2'!J25,IF(ISNUMBER('FBPQ C2'!I25),'FBPQ C2'!I25,\"\"))","v":5.4205669354211254},"DATA",5.4205669354211254,{"$f":"IF(ISBLANK('FBPQ T4'!E25),\" \",'FBPQ T4'!AE25)","v":9596},52015.760312301121,"LV"]
[null,null,"LV Pillar (OD)","Each",{"$f":"IF(ISNUMBER('FBPQ C2'!J26),'FBPQ C2'!J26,IF(ISNUMBER('FBPQ C2'!I26),'FBPQ C2'!I26,\"\"))","v":5.4205669354211254},"DATA",5.4205669354211254,{"$f":"IF(ISBLANK('FBPQ T4'!E26),\" \",'FBPQ T4'!AE26)","v":7772},42128.64622209299,"LV"]
[null,null,"LV Board (WM)","Each",{"$f":"IF(ISNUMBER('FBPQ C2'!J27),'FBPQ C2'!J27,IF(ISNUMBER('FBPQ C2'!I27),'FBPQ C2'!I27,\"\"))","v":5.4205669354211254},"DATA",5.4205669354211254,{"$f":"IF(ISBLANK('FBPQ T4'!E27),\" \",'FBPQ T4'!AE27)","v":2299},12461.883384533168,"LV"]
[null,null,"LV UGB","Each",{"$f":"IF(ISNUMBER('FBPQ C2'!J28),'FBPQ C2'!J28,IF(ISNUMBER('FBPQ C2'!I28),'FBPQ C2'!I28,\"\"))","v":4.5773676343556167},"DATA",4.5773676343556167,{"$f":"IF(ISBLANK('FBPQ T4'!E28),\" \",'FBPQ T4'!AE28)","v":28524},130564.83440235961,"LV"]
[null,null,"LV Fuses (PM)","Each",0,"DATA",0,{"$f":"IF(ISBLANK('FBPQ T4'!E29),\" \",'FBPQ T4'!AE29)","v":22692},0,"LV"]
[null,null,"LV Fuses (TM)","Each",{"$f":"IF(ISNUMBER('FBPQ C2'!J30),'FBPQ C2'!J30,IF(ISNUMBER('FBPQ C2'!I30),'FBPQ C2'!I30,\"\"))","v":""},"DATA"," ",{"$f":"IF(ISBLANK('FBPQ T4'!E30),\" \",'FBPQ T4'!AE30)","v":0}," ","LV"]
[null,null,null,null,{"$f":"IF(ISNUMBER('FBPQ C2'!J31),'FBPQ C2'!J31,IF(ISNUMBER('FBPQ C2'!I31),'FBPQ C2'!I31,\"\"))","v":""},null,0,{"$f":"IF(ISBLANK('FBPQ T4'!E31),\" \",'FBPQ T4'!AE31)","v":" "}," ","LV"]
["HV network",null,null,null,{"$f":"IF(ISNUMBER('FBPQ C2'!J32),'FBPQ C2'!J32,IF(ISNUMBER('FBPQ C2'!I32),'FBPQ C2'!I32,\"\"))","v":""},null,0,{"$f":"IF(ISBLANK('FBPQ T4'!E32),\" \",'FBPQ T4'!AE32)","v":" "}," "]
[null,"Overhead lines",null,null,{"$f":"IF(ISNUMBER('FBPQ C2'!J33),'FBPQ C2'!J33,IF(ISNUMBER('FBPQ C2'!I33),'FBPQ C2'!I33,\"\"))","v":""},null,0,{"$f":"IF(ISBLANK('FBPQ T4'!E33),\" \",'FBPQ T4'!AE33)","v":" "}," ","HV"]
[null,null,"6.6/11 kV OHL (Open)","km",{"$f":"IF(ISNUMBER('FBPQ C2'!J34),'FBPQ C2'!J34,IF(ISNUMBER('FBPQ C2'!I34),'FBPQ C2'!I34,\"\"))","v":40.834937580172472},"DATA",40.834937580172472,{"$f":"IF(ISBLANK('FBPQ T4'!E34),\" \",'FBPQ T4'!AE34)","v":12473.2},509342.3434250073,"HV"]
[null,null,"6.6/11 kV OHL (Covered)","km",{"$f":"IF(ISNUMBER('FBPQ C2'!J35),'FBPQ C2'!J35,IF(ISNUMBER('FBPQ C2'!I35),'FBPQ C2'!I35,\"\"))","v":40.834937580172472},"DATA",40.834937580172472,{"$f":"IF(ISBLANK('FBPQ T4'!E35),\" \",'FBPQ T4'!AE35)","v":20},816.69875160344941,"HV"]
[null,null,"20 kV OHL (Open)","km",{"$f":"IF(ISNUMBER('FBPQ C2'!J36),'FBPQ C2'!J36,IF(ISNUMBER('FBPQ C2'!I36),'FBPQ C2'!I36,\"\"))","v":0},"DATA",0,{"$f":"IF(ISBLANK('FBPQ T4'!E36),\" \",'FBPQ T4'!AE36)","v":0},0,"HV"]
[null,null,"20 kV OHL (Covered)","km",{"$f":"IF(ISNUMBER('FBPQ C2'!J37),'FBPQ C2'!J37,IF(ISNUMBER('FBPQ C2'!I37),'FBPQ C2'!I37,\"\"))","v":0},"DATA",0,{"$f":"IF(ISBLANK('FBPQ T4'!E37),\" \",'FBPQ T4'!AE37)","v":0},0,"HV"]
[null,null,null,null,{"$f":"IF(ISNUMBER('FBPQ C2'!J38),'FBPQ C2'!J38,IF(ISNUMBER('FBPQ C2'!I38),'FBPQ C2'!I38,\"\"))","v":""},null,0,{"$f":"IF(ISBLANK('FBPQ T4'!E38),\" \",'FBPQ T4'!AE38)","v":" "}," ","HV"]
[null,"Overhead lines - Support",null,null,{"$f":"IF(ISNUMBER('FBPQ C2'!J39),'FBPQ C2'!J39,IF(ISNUMBER('FBPQ C2'!I39),'FBPQ C2'!I39,\"\"))","v":""},null,0,{"$f":"IF(ISBLANK('FBPQ T4'!E39),\" \",'FBPQ T4'!AE39)","v":" "}," ","HV"]
[null,null,"6.6/11 kV Support","Each",{"$f":"IF(ISNUMBER('[8]FBPQ C2'!K40),'[8]FBPQ C2'!K40,IF(ISNUMBER('[8]FBPQ C2'!I40),'[8]FBPQ C2'!I40,\"\"))","v":0},"DATA",0,{"$f":"IF(ISBLANK('FBPQ T4'!E40),\" \",'FBPQ T4'!AE40)","v":160773},0,"HV"]
[null,null,"20 kV Support","Each",{"$f":"IF(ISNUMBER('FBPQ C2'!J41),'FBPQ C2'!J41,IF(ISNUMBER('FBPQ C2'!I41),'FBPQ C2'!I41,\"\"))","v":0},"DATA",0,{"$f":"IF(ISBLANK('FBPQ T4'!E41),\" \",'FBPQ T4'!AE41)","v":0},0,"HV"]
[null,null,null,null,{"$f":"IF(ISNUMBER('FBPQ C2'!J42),'FBPQ C2'!J42,IF(ISNUMBER('FBPQ C2'!I42),'FBPQ C2'!I42,\"\"))","v":""},"DATA","DATA",{"$f":"IF(ISBLANK('FBPQ T4'!E42),\" \",'FBPQ T4'!AE42)","v":" "}," ","HV"]
[null,"Underground cables (kms)",null,null,{"$f":"IF(ISNUMBER('FBPQ C2'!J43),'FBPQ C2'!J43,IF(ISNUMBER('FBPQ C2'!I43),'FBPQ C2'!I43,\"\"))","v":""},null,0,{"$f":"IF(ISBLANK('FBPQ T4'!E43),\" \",'FBPQ T4'!AE43)","v":" "}," ","HV"]
[null,null,"6.6/11kV UG Cable","km",{"$f":"IF(ISNUMBER('FBPQ C2'!J44),'FBPQ C2'!J44,IF(ISNUMBER('FBPQ C2'!I44),'FBPQ C2'!I44,\"\"))","v":80.103933601223289},"DATA",{"$f":"IF(ISNUMBER(E52),E52,IF(H52>0,F52,\" \"))","v":80.103933601223289},{"$f":"IF(ISBLANK('FBPQ T4'!E44),\" \",'FBPQ T4'!AE44)","v":13673.9},1095333.1776697671,"HV"]
[null,null,"20kV UG Cable","km",{"$f":"IF(ISNUMBER('FBPQ C2'!J45),'FBPQ C2'!J45,IF(ISNUMBER('FBPQ C2'!I45),'FBPQ C2'!I45,\"\"))","v":0},"DATA",0,{"$f":"IF(ISBLANK('FBPQ T4'!E45),\" \",'FBPQ T4'!AE45)","v":0},0,"HV"]
[null,null,null,null,{"$f":"IF(ISNUMBER('FBPQ C2'!J46),'FBPQ C2'!J46,IF(ISNUMBER('FBPQ C2'!I46),'FBPQ C2'!I46,\"\"))","v":""},null,0,{"$f":"IF(ISBLANK('FBPQ T4'!E46),\" \",'FBPQ T4'!AE46)","v":" "}," ","HV"]
[null,"Submarine cables (kms)",null,null,{"$f":"IF(ISNUMBER('FBPQ C2'!J47),'FBPQ C2'!J47,IF(ISNUMBER('FBPQ C2'!I47),'FBPQ C2'!I47,\"\"))","v":""},null,0,{"$f":"IF(ISBLANK('FBPQ T4'!E47),\" \",'FBPQ T4'!AE47)","v":" "}," ","HV"]
[null,null,"HV Sub Cable","km",{"$f":"IF(ISNUMBER('FBPQ C2'!J48),'FBPQ C2'!J48,IF(ISNUMBER('FBPQ C2'!I48),'FBPQ C2'!I48,\"\"))","v":0},"DATA",0,{"$f":"IF(ISBLANK('FBPQ T4'!E48),\" \",'FBPQ T4'!AE48)","v":0},0,"HV"]
[null,null,null,null,{"$f":"IF(ISNUMBER('FBPQ C2'!J49),'FBPQ C2'!J49,IF(ISNUMBER('FBPQ C2'!I49),'FBPQ C2'!I49,\"\"))","v":""},"DATA","DATA",{"$f":"IF(ISBLANK('FBPQ T4'!E49),\" \",'FBPQ T4'!AE49)","v":" "}," ","HV"]
[null,"Switchgear ",null,null,{"$f":"IF(ISNUMBER('FBPQ C2'!J50),'FBPQ C2'!J50,IF(ISNUMBER('FBPQ C2'!I50),'FBPQ C2'!I50,\"\"))","v":""},null,0,{"$f":"IF(ISBLANK('FBPQ T4'!E50),\" \",'FBPQ T4'!AE50)","v":" "}," ","HV"]
[null,null,"6.6/11 kV CB (PM)","Each",{"$f":"IF(ISNUMBER('FBPQ C2'!J51),'FBPQ C2'!J51,IF(ISNUMBER('FBPQ C2'!I51),'FBPQ C2'!I51,\"\"))","v":13.250274731029416},"DATA",13.250274731029416,{"$f":"IF(ISBLANK('FBPQ T4'!E51),\" \",'FBPQ T4'!AE51)","v":1227},16258.087094973092,"EHV/HV"]
[null,null,"6.6/11 kV CB (GM)","Each",{"$f":"IF(ISNUMBER('FBPQ C2'!J52),'FBPQ C2'!J52,IF(ISNUMBER('FBPQ C2'!I52),'FBPQ C2'!I52,\"\"))","v":29.271061451274075},"DATA",29.271061451274075,{"$f":"IF(ISBLANK('FBPQ T4'!E52),\" \",'FBPQ T4'!AE52)","v":7868},230304.71149862441,"EHV/HV"]
[null,null,"6.6/11 kV Switch (PM)","Each",{"$f":"IF(ISNUMBER('FBPQ C2'!J53),'FBPQ C2'!J53,IF(ISNUMBER('FBPQ C2'!I53),'FBPQ C2'!I53,\"\"))","v":1.5659415591216583},"DATA",1.5659415591216583,{"$f":"IF(ISBLANK('FBPQ T4'!E53),\" \",'FBPQ T4'!AE53)","v":387},606.01938338008176,"HV"]
[null,null,"6.6/11 kV Switch (GM)","Each",{"$f":"IF(ISNUMBER('FBPQ C2'!J54),'FBPQ C2'!J54,IF(ISNUMBER('FBPQ C2'!I54),'FBPQ C2'!I54,\"\"))","v":4.9387387633836912},"DATA",4.9387387633836912,{"$f":"IF(ISBLANK('FBPQ T4'!E54),\" \",'FBPQ T4'!AE54)","v":10608},52390.140801974194,"HV/LV"]
[null,null,"6.6/11 kV RMU","Each",{"$f":"IF(ISNUMBER('FBPQ C2'!J55),'FBPQ C2'!J55,IF(ISNUMBER('FBPQ C2'!I55),'FBPQ C2'!I55,\"\"))","v":15.538958548207226},"DATA",15.538958548207226,{"$f":"IF(ISBLANK('FBPQ T4'!E55),\" \",'FBPQ T4'!AE55)","v":17327},269243.5347647866,"HV/LV"]
[null,null,"6.6/11 kV Switchgear - Other (PM)","Each",{"$f":"E61","v":1.5659415591216583},"DATA",1.5659415591216583,{"$f":"IF(ISBLANK('FBPQ T4'!E56),\" \",'FBPQ T4'!AE56)","v":11757},18410.774910593336,"HV"]
[null,null,"6.6/11 kV Switchgear - Other (GM)","Each",{"$f":"IF(ISNUMBER('FBPQ C2'!J57),'FBPQ C2'!J57,IF(ISNUMBER('FBPQ C2'!I57),'FBPQ C2'!I57,\"\"))","v":""},"DATA"," ",{"$f":"IF(ISBLANK('FBPQ T4'!E57),\" \",'FBPQ T4'!AE57)","v":0}," ","HV"]
[null,null,"20 kV CB (PM)","Each",{"$f":"IF(ISNUMBER('FBPQ C2'!J58),'FBPQ C2'!J58,IF(ISNUMBER('FBPQ C2'!I58),'FBPQ C2'!I58,\"\"))","v":0},"DATA",0,{"$f":"IF(ISBLANK('FBPQ T4'!E58),\" \",'FBPQ T4'!AE58)","v":0},0,"EHV/HV"]
[null,null,"20 kV CB (GM)","Each",{"$f":"IF(ISNUMBER('FBPQ C2'!J59),'FBPQ C2'!J59,IF(ISNUMBER('FBPQ C2'!I59),'FBPQ C2'!I59,\"\"))","v":0},"DATA",0,{"$f":"IF(ISBLANK('FBPQ T4'!E59),\" \",'FBPQ T4'!AE59)","v":0},0,"EHV/HV"]
[null,null,"20 kV Switch (PM)","Each",{"$f":"IF(ISNUMBER('FBPQ C2'!J60),'FBPQ C2'!J60,IF(ISNUMBER('FBPQ C2'!I60),'FBPQ C2'!I60,\"\"))","v":0},"DATA",0,{"$f":"IF(ISBLANK('FBPQ T4'!E60),\" \",'FBPQ T4'!AE60)","v":0},0,"HV"]
[null,null,"20 kV Switch (GM)","Each",{"$f":"IF(ISNUMBER('FBPQ C2'!J61),'FBPQ C2'!J61,IF(ISNUMBER('FBPQ C2'!I61),'FBPQ C2'!I61,\"\"))","v":0},"DATA",0,{"$f":"IF(ISBLANK('FBPQ T4'!E61),\" \",'FBPQ T4'!AE61)","v":0},0,"HV/LV"]
[null,null,"20 kV RMU","Each",{"$f":"IF(ISNUMBER('FBPQ C2'!J62),'FBPQ C2'!J62,IF(ISNUMBER('FBPQ C2'!I62),'FBPQ C2'!I62,\"\"))","v":0},"DATA",0,{"$f":"IF(ISBLANK('FBPQ T4'!E62),\" \",'FBPQ T4'!AE62)","v":0},0,"HV/LV"]
[null,null,"20 kV Switchgear - Other (PM)","Each",{"$f":"IF(ISNUMBER('FBPQ C2'!J63),'FBPQ C2'!J63,IF(ISNUMBER('FBPQ C2'!I63),'FBPQ C2'!I63,\"\"))","v":""},"DATA"," ",{"$f":"IF(ISBLANK('FBPQ T4'!E63),\" \",'FBPQ T4'!AE63)","v":0}," ","HV"]
[null,null,"20 kV Switchgear - Other (GM)","Each",{"$f":"IF(ISNUMBER('FBPQ C2'!J64),'FBPQ C2'!J64,IF(ISNUMBER('FBPQ C2'!I64),'FBPQ C2'!I64,\"\"))","v":""},"DATA"," ",{"$f":"IF(ISBLANK('FBPQ T4'!E64),\" \",'FBPQ T4'!AE64)","v":0}," ","HV"]
[null,null,null,null,{"$f":"IF(ISNUMBER('FBPQ C2'!J65),'FBPQ C2'!J65,IF(ISNUMBER('FBPQ C2'!I65),'FBPQ C2'!I65,\"\"))","v":""},null,0,{"$f":"IF(ISBLANK('FBPQ T4'!E65),\" \",'FBPQ T4'!AE65)","v":" "}," "]
[null,"Transformers  ",null,null,{"$f":"IF(ISNUMBER('FBPQ C2'!J66),'FBPQ C2'!J66,IF(ISNUMBER('FBPQ C2'!I66),'FBPQ C2'!I66,\"\"))","v":""},null,0,{"$f":"IF(ISBLANK('FBPQ T4'!E66),\" \",'FBPQ T4'!AE66)","v":" "}," "]
[null,null,"6.6/11 kV Transformer (PM)","Each",{"$f":"IF(ISNUMBER('FBPQ C2'!J67),'FBPQ C2'!J67,IF(ISNUMBER('FBPQ C2'!I67),'FBPQ C2'!I67,\"\"))","v":3.4932542472713912},"DATA",3.4932542472713912,{"$f":"IF(ISBLANK('FBPQ T4'!E67),\" \",'FBPQ T4'!AE67)","v":22854},79834.832567140373,"HV/LV"]
[null,null,"6.6/11 kV Transformer (GM)","Each",{"$f":"IF(ISNUMBER('FBPQ C2'!J68),'FBPQ C2'!J68,IF(ISNUMBER('FBPQ C2'!I68),'FBPQ C2'!I68,\"\"))","v":11.322962042879682},"DATA",11.322962042879682,{"$f":"IF(ISBLANK('FBPQ T4'!E68),\" \",'FBPQ T4'!AE68)","v":19308},218623.7511239209,"HV/LV"]
[null,null,"20 kV Transformer (PM)","Each",{"$f":"IF(ISNUMBER('FBPQ C2'!J69),'FBPQ C2'!J69,IF(ISNUMBER('FBPQ C2'!I69),'FBPQ C2'!I69,\"\"))","v":0},"DATA",0,{"$f":"IF(ISBLANK('FBPQ T4'!E69),\" \",'FBPQ T4'!AE69)","v":0},0,"HV/LV"]
[null,null,"20 kV Transformer (GM)","Each",{"$f":"IF(ISNUMBER('FBPQ C2'!J70),'FBPQ C2'!J70,IF(ISNUMBER('FBPQ C2'!I70),'FBPQ C2'!I70,\"\"))","v":0},"DATA",0,{"$f":"IF(ISBLANK('FBPQ T4'!E70),\" \",'FBPQ T4'!AE70)","v":0},0,"HV/LV"]
[null,null,null,null,{"$f":"IF(ISNUMBER('FBPQ C2'!J71),'FBPQ C2'!J71,IF(ISNUMBER('FBPQ C2'!I71),'FBPQ C2'!I71,\"\"))","v":""},null,0,{"$f":"IF(ISBLANK('FBPQ T4'!E71),\" \",'FBPQ T4'!AE71)","v":" "}," "]
["EHV Network",null,null,null,{"$f":"IF(ISNUMBER('FBPQ C2'!J72),'FBPQ C2'!J72,IF(ISNUMBER('FBPQ C2'!I72),'FBPQ C2'!I72,\"\"))","v":""},null,0,{"$f":"IF(ISBLANK('FBPQ T4'!E72),\" \",'FBPQ T4'!AE72)","v":" "}," "]
[null,"Overhead lines",null,null,{"$f":"IF(ISNUMBER('FBPQ C2'!J73),'FBPQ C2'!J73,IF(ISNUMBER('FBPQ C2'!I73),'FBPQ C2'!I73,\"\"))","v":""},null,0,{"$f":"IF(ISBLANK('FBPQ T4'!E73),\" \",'FBPQ T4'!AE73)","v":" "}," "]
[null,null,"33kV OHL (Pole Line)","km",{"$f":"IF(ISNUMBER('FBPQ C2'!J74),'FBPQ C2'!J74,IF(ISNUMBER('FBPQ C2'!I74),'FBPQ C2'!I74,\"\"))","v":93.233751289243358},"DATA",93.233751289243358,{"$f":"IF(ISBLANK('FBPQ T4'!E74),\" \",'FBPQ T4'!AE74)","v":1753.5},163485.38288568822,"EHV"]
[null,null,"33kV OHL (Tower Line)","km",{"$f":"IF(ISNUMBER('FBPQ C2'!J75),'FBPQ C2'!J75,IF(ISNUMBER('FBPQ C2'!I75),'FBPQ C2'!I75,\"\"))","v":148.5235340305388},"DATA",148.5235340305388,{"$f":"IF(ISBLANK('FBPQ T4'!E75),\" \",'FBPQ T4'!AE75)","v":933},138572.45725049271,"EHV"]
[null,null,"66kV OHL (Pole Line)","km",{"$f":"IF(ISNUMBER('FBPQ C2'!J76),'FBPQ C2'!J76,IF(ISNUMBER('FBPQ C2'!I76),'FBPQ C2'!I76,\"\"))","v":175.86728279366315},"DATA",{"$f":"IF(ISNUMBER(E84),E84,IF(H84>0,F84,\" \"))","v":175.86728279366315},{"$f":"IF(ISBLANK('FBPQ T4'!E76),\" \",'FBPQ T4'!AE76)","v":0},0,"EHV"]
[null,null,"66kV OHL (Tower Line)","km",{"$f":"IF(ISNUMBER('FBPQ C2'!J77),'FBPQ C2'!J77,IF(ISNUMBER('FBPQ C2'!I77),'FBPQ C2'!I77,\"\"))","v":175.86728279366315},"DATA",175.86728279366315,{"$f":"IF(ISBLANK('FBPQ T4'!E77),\" \",'FBPQ T4'!AE77)","v":0},{"$f":"IF(ISERROR(G85*H85),\" \",G85*H85)","v":0},"EHV"]
[null,null,null,null,{"$f":"IF(ISNUMBER('FBPQ C2'!J78),'FBPQ C2'!J78,IF(ISNUMBER('FBPQ C2'!I78),'FBPQ C2'!I78,\"\"))","v":""},null,0,{"$f":"IF(ISBLANK('FBPQ T4'!E78),\" \",'FBPQ T4'!AE78)","v":" "}," "]
[null,"Overhead lines - Support",null,null,{"$f":"IF(ISNUMBER('FBPQ C2'!J79),'FBPQ C2'!J79,IF(ISNUMBER('FBPQ C2'!I79),'FBPQ C2'!I79,\"\"))","v":""},null,0,{"$f":"IF(ISBLANK('FBPQ T4'!E79),\" \",'FBPQ T4'!AE79)","v":" "}," "]
[null,null,"33kV Pole","Each",{"$f":"IF(ISNUMBER('[8]FBPQ C2'!K80),'[8]FBPQ C2'!K80,IF(ISNUMBER('[8]FBPQ C2'!I80),'[8]FBPQ C2'!I80,\"\"))","v":0},"DATA",0,{"$f":"IF(ISBLANK('FBPQ T4'!E80),\" \",'FBPQ T4'!AE80)","v":28125},0,"EHV"]
[null,null,"33kV Tower","Each",{"$f":"IF(ISNUMBER('[8]FBPQ C2'!K81),'[8]FBPQ C2'!K81,IF(ISNUMBER('[8]FBPQ C2'!I81),'[8]FBPQ C2'!I81,\"\"))","v":0},"DATA",0,{"$f":"IF(ISBLANK('FBPQ T4'!E81),\" \",'FBPQ T4'!AE81)","v":1287},0,"EHV"]
[null,null,"66kV Pole","Each",{"$f":"IF(ISNUMBER('FBPQ C2'!J82),'FBPQ C2'!J82,IF(ISNUMBER('FBPQ C2'!I82),'FBPQ C2'!I82,\"\"))","v":0},"DATA",0,{"$f":"IF(ISBLANK('FBPQ T4'!E82),\" \",'FBPQ T4'!AE82)","v":0},0,"EHV"]
[null,null,"66kV Tower","Each",{"$f":"IF(ISNUMBER('FBPQ C2'!J83),'FBPQ C2'!J83,IF(ISNUMBER('FBPQ C2'!I83),'FBPQ C2'!I83,\"\"))","v":0},"DATA",0,{"$f":"IF(ISBLANK('FBPQ T4'!E83),\" \",'FBPQ T4'!AE83)","v":0},0,"EHV"]
[null,null,null,null,{"$f":"IF(ISNUMBER('FBPQ C2'!J84),'FBPQ C2'!J84,IF(ISNUMBER('FBPQ C2'!I84),'FBPQ C2'!I84,\"\"))","v":""},null,0,{"$f":"IF(ISBLANK('FBPQ T4'!E84),\" \",'FBPQ T4'!AE84)","v":" "}," "]
[null,"Underground cables (kms)",null,null,{"$f":"IF(ISNUMBER('FBPQ C2'!J85),'FBPQ C2'!J85,IF(ISNUMBER('FBPQ C2'!I85),'FBPQ C2'!I85,\"\"))","v":""},null,0,{"$f":"IF(ISBLANK('FBPQ T4'!E85),\" \",'FBPQ T4'!AE85)","v":" "}," "]
[null,null,"33kV UG Cable (Non Pressurised)","km",{"$f":"IF(ISNUMBER('FBPQ C2'!J86),'FBPQ C2'!J86,IF(ISNUMBER('FBPQ C2'!I86),'FBPQ C2'!I86,\"\"))","v":243.56414096492253},"DATA",243.56414096492253,{"$f":"IF(ISBLANK('FBPQ T4'!E86),\" \",'FBPQ T4'!AE86)","v":1562.6},380593.32667178795,"EHV"]
[null,null,"33kV UG Cable (Oil)","km",{"$f":"IF(ISNUMBER('FBPQ C2'!J87),'FBPQ C2'!J87,IF(ISNUMBER('FBPQ C2'!I87),'FBPQ C2'!I87,\"\"))","v":243.56414096492253},"DATA",243.56414096492253,{"$f":"IF(ISBLANK('FBPQ T4'!E87),\" \",'FBPQ T4'!AE87)","v":156},37996.005990527912,"EHV"]
[null,null,"33kV UG Cable (Gas)","km",{"$f":"IF(ISNUMBER('FBPQ C2'!J88),'FBPQ C2'!J88,IF(ISNUMBER('FBPQ C2'!I88),'FBPQ C2'!I88,\"\"))","v":0},"DATA",0,{"$f":"IF(ISBLANK('FBPQ T4'!E88),\" \",'FBPQ T4'!AE88)","v":0},0,"EHV"]
[null,null,"66kV UG Cable (Non Pressurised)","km",{"$f":"IF(ISNUMBER('FBPQ C2'!J89),'FBPQ C2'!J89,IF(ISNUMBER('FBPQ C2'!I89),'FBPQ C2'!I89,\"\"))","v":1143.1373381588107},"DATA",1143.1373381588107,{"$f":"IF(ISBLANK('FBPQ T4'!E89),\" \",'FBPQ T4'!AE89)","v":0},0,"EHV"]
[null,null,"66kV UG Cable (Oil)","km",{"$f":"IF(ISNUMBER('FBPQ C2'!J90),'FBPQ C2'!J90,IF(ISNUMBER('FBPQ C2'!I90),'FBPQ C2'!I90,\"\"))","v":1143.1373381588107},"DATA",1143.1373381588107,{"$f":"IF(ISBLANK('FBPQ T4'!E90),\" \",'FBPQ T4'!AE90)","v":0},0,"EHV"]
[null,null,"66kV UG Cable (Gas)","km",{"$f":"IF(ISNUMBER('FBPQ C2'!J91),'FBPQ C2'!J91,IF(ISNUMBER('FBPQ C2'!I91),'FBPQ C2'!I91,\"\"))","v":0},"DATA",0,{"$f":"IF(ISBLANK('FBPQ T4'!E91),\" \",'FBPQ T4'!AE91)","v":0},0,"EHV"]
[null,null,null,null,{"$f":"IF(ISNUMBER('FBPQ C2'!J92),'FBPQ C2'!J92,IF(ISNUMBER('FBPQ C2'!I92),'FBPQ C2'!I92,\"\"))","v":""},null,0,{"$f":"IF(ISBLANK('FBPQ T4'!E92),\" \",'FBPQ T4'!AE92)","v":" "}," "]
[null,"Submarine cables (kms)",null,null,{"$f":"IF(ISNUMBER('FBPQ C2'!J93),'FBPQ C2'!J93,IF(ISNUMBER('FBPQ C2'!I93),'FBPQ C2'!I93,\"\"))","v":""},null,0,{"$f":"IF(ISBLANK('FBPQ T4'!E93),\" \",'FBPQ T4'!AE93)","v":" "}," "]
[null,null,"EHV Sub Cable","km",{"$f":"IF(ISNUMBER('FBPQ C2'!J94),'FBPQ C2'!J94,IF(ISNUMBER('FBPQ C2'!I94),'FBPQ C2'!I94,\"\"))","v":0},"DATA",0,{"$f":"IF(ISBLANK('FBPQ T4'!E94),\" \",'FBPQ T4'!AE94)","v":0},0,"EHV"]
[null,null,null,null,{"$f":"IF(ISNUMBER('FBPQ C2'!J95),'FBPQ C2'!J95,IF(ISNUMBER('FBPQ C2'!I95),'FBPQ C2'!I95,\"\"))","v":""},null,0,{"$f":"IF(ISBLANK('FBPQ T4'!E95),\" \",'FBPQ T4'!AE95)","v":" "}," "]
[null,"Switchgear ",null,null,{"$f":"IF(ISNUMBER('FBPQ C2'!J96),'FBPQ C2'!J96,IF(ISNUMBER('FBPQ C2'!I96),'FBPQ C2'!I96,\"\"))","v":""},null,0,{"$f":"IF(ISBLANK('FBPQ T4'!E96),\" \",'FBPQ T4'!AE96)","v":" "}," "]
[null,null,"33 KV CB (ID)","Each",{"$f":"IF(ISNUMBER('FBPQ C2'!J97),'FBPQ C2'!J97,IF(ISNUMBER('FBPQ C2'!I97),'FBPQ C2'!I97,\"\"))","v":175.26499757861637},"DATA",175.26499757861637,{"$f":"IF(ISBLANK('FBPQ T4'!E97),\" \",'FBPQ T4'!AE97)","v":414},72559.708997547175,"132kV/EHV"]
[null,null,"33 kV CB (OD)","Each",{"$f":"IF(ISNUMBER('FBPQ C2'!J98),'FBPQ C2'!J98,IF(ISNUMBER('FBPQ C2'!I98),'FBPQ C2'!I98,\"\"))","v":175.26499757861637},"DATA",175.26499757861637,{"$f":"IF(ISBLANK('FBPQ T4'!E98),\" \",'FBPQ T4'!AE98)","v":575},100777.37360770442,"132kV/EHV"]
[null,null,"33 kV Switch (GM)","Each",{"$f":"IF(ISNUMBER('FBPQ C2'!J99),'FBPQ C2'!J99,IF(ISNUMBER('FBPQ C2'!I99),'FBPQ C2'!I99,\"\"))","v":0},"DATA",0,{"$f":"IF(ISBLANK('FBPQ T4'!E99),\" \",'FBPQ T4'!AE99)","v":0},0,"132kV/EHV"]
[null,null,"33 kV Switch (PM)","Each",{"$f":"IF(ISNUMBER('FBPQ C2'!J100),'FBPQ C2'!J100,IF(ISNUMBER('FBPQ C2'!I100),'FBPQ C2'!I100,\"\"))","v":0},"DATA",0,{"$f":"IF(ISBLANK('FBPQ T4'!E100),\" \",'FBPQ T4'!AE100)","v":0},0,"132kV/EHV"]
[null,null,"33 kV RMU","Each",{"$f":"IF(ISNUMBER('FBPQ C2'!J101),'FBPQ C2'!J101,IF(ISNUMBER('FBPQ C2'!I101),'FBPQ C2'!I101,\"\"))","v":557.59565209031973},"DATA",557.59565209031973,{"$f":"IF(ISBLANK('FBPQ T4'!E101),\" \",'FBPQ T4'!AE101)","v":54},30110.165212877266,"132kV/EHV"]
[null,null,"33 kV Switchgear - Other","Each",{"$f":"E106","v":175.26499757861637},"DATA",175.26499757861637,{"$f":"IF(ISBLANK('FBPQ T4'!E102),\" \",'FBPQ T4'!AE102)","v":2044},358241.65505069186,"EHV/HV"]
[null,null,"66 KV CB (ID & OD)","Each",{"$f":"IF(ISNUMBER('FBPQ C2'!J103),'FBPQ C2'!J103,IF(ISNUMBER('FBPQ C2'!I103),'FBPQ C2'!I103,\"\"))","v":661.18870907836788},"DATA",661.18870907836788,{"$f":"IF(ISBLANK('FBPQ T4'!E103),\" \",'FBPQ T4'!AE103)","v":0},0,"132kV/EHV"]
[null,null,"66 KV Switchgear - Other","Each",{"$f":"IF(ISNUMBER('FBPQ C2'!J104),'FBPQ C2'!J104,IF(ISNUMBER('FBPQ C2'!I104),'FBPQ C2'!I104,\"\"))","v":""},"DATA"," ",{"$f":"IF(ISBLANK('FBPQ T4'!E104),\" \",'FBPQ T4'!AE104)","v":0}," ","EHV/HV"]
[null,null,null,null,{"$f":"IF(ISNUMBER('FBPQ C2'!J105),'FBPQ C2'!J105,IF(ISNUMBER('FBPQ C2'!I105),'FBPQ C2'!I105,\"\"))","v":""},null,0,{"$f":"IF(ISBLANK('FBPQ T4'!E105),\" \",'FBPQ T4'!AE105)","v":" "}," "]
[null,"Transformers  ",null,null,{"$f":"IF(ISNUMBER('FBPQ C2'!J106),'FBPQ C2'!J106,IF(ISNUMBER('FBPQ C2'!I106),'FBPQ C2'!I106,\"\"))","v":""},null,0,{"$f":"IF(ISBLANK('FBPQ T4'!E106),\" \",'FBPQ T4'!AE106)","v":" "}," "]
[null,null,"33 kV Transformer (PM)","Each",{"$f":"IF(ISNUMBER('FBPQ C2'!J107),'FBPQ C2'!J107,IF(ISNUMBER('FBPQ C2'!I107),'FBPQ C2'!I107,\"\"))","v":504.59455316620199},"DATA",504.59455316620199,{"$f":"IF(ISBLANK('FBPQ T4'!E107),\" \",'FBPQ T4'!AE107)","v":0},0,"EHV/HV"]
[null,null,"33 kV Transformer (GM)","Each",{"$f":"IF(ISNUMBER('FBPQ C2'!J108),'FBPQ C2'!J108,IF(ISNUMBER('FBPQ C2'!I108),'FBPQ C2'!I108,\"\"))","v":541.93623649910307},"DATA",{"$f":"IF(ISNUMBER(E116),E116,IF(H116>0,F116,\" \"))","v":541.93623649910307},{"$f":"IF(ISBLANK('FBPQ T4'!E108),\" \",'FBPQ T4'!AE108)","v":717},388568.28156985692,"EHV/HV"]
[null,null,"33 kV AuxiliaryTransfomer","Each",11.322962042879682,"DATA",11.322962042879682,{"$f":"IF(ISBLANK('FBPQ T4'!E109),\" \",'FBPQ T4'!AE109)","v":651},7371.2482899146735,"EHV/HV"]
[null,null,"66 kV Transformer","Each",{"$f":"IF(ISNUMBER('FBPQ C2'!J110),'FBPQ C2'!J110,IF(ISNUMBER('FBPQ C2'!I110),'FBPQ C2'!I110,\"\"))","v":2117.5143590615103},"DATA",2117.5143590615103,{"$f":"IF(ISBLANK('FBPQ T4'!E110),\" \",'FBPQ T4'!AE110)","v":0},0,"EHV/HV"]
[null,null,"66 kV AuxiliaryTransfomer","Each",{"$f":"IF(ISNUMBER('FBPQ C2'!J111),'FBPQ C2'!J111,IF(ISNUMBER('FBPQ C2'!I111),'FBPQ C2'!I111,\"\"))","v":""},"DATA"," ",{"$f":"IF(ISBLANK('FBPQ T4'!E111),\" \",'FBPQ T4'!AE111)","v":0}," ","EHV/HV"]
[null,null,null,null,{"$f":"IF(ISNUMBER('FBPQ C2'!J112),'FBPQ C2'!J112,IF(ISNUMBER('FBPQ C2'!I112),'FBPQ C2'!I112,\"\"))","v":""},null,0,{"$f":"IF(ISBLANK('FBPQ T4'!E112),\" \",'FBPQ T4'!AE112)","v":" "}," "]
["132kV Network",null,null,null,{"$f":"IF(ISNUMBER('FBPQ C2'!J113),'FBPQ C2'!J113,IF(ISNUMBER('FBPQ C2'!I113),'FBPQ C2'!I113,\"\"))","v":""},null,0,{"$f":"IF(ISBLANK('FBPQ T4'!E113),\" \",'FBPQ T4'!AE113)","v":" "}," "]
[null,"Overhead lines",null,null,{"$f":"IF(ISNUMBER('FBPQ C2'!J114),'FBPQ C2'!J114,IF(ISNUMBER('FBPQ C2'!I114),'FBPQ C2'!I114,\"\"))","v":""},null,0,{"$f":"IF(ISBLANK('FBPQ T4'!E114),\" \",'FBPQ T4'!AE114)","v":" "}," "]
[null,null,"132kV OHL Conductor (Pole Line)","km",{"$f":"IF(ISNUMBER('FBPQ C2'!J115),'FBPQ C2'!J115,IF(ISNUMBER('FBPQ C2'!I115),'FBPQ C2'!I115,\"\"))","v":677.32995284162189},"DATA",677.32995284162189,{"$f":"IF(ISBLANK('FBPQ T4'!E115),\" \",'FBPQ T4'!AE115)","v":138},93471.533492143819,"132kV"]
[null,null,"132kV OHL Conductor (Tower Line)","km",{"$f":"IF(ISNUMBER('FBPQ C2'!J116),'FBPQ C2'!J116,IF(ISNUMBER('FBPQ C2'!I116),'FBPQ C2'!I116,\"\"))","v":1163.9764065994295},"DATA",1163.9764065994295,{"$f":"IF(ISBLANK('FBPQ T4'!E116),\" \",'FBPQ T4'!AE116)","v":2246},2614291.0092223189,"132kV"]
[null,null,null,null,{"$f":"IF(ISNUMBER('FBPQ C2'!J117),'FBPQ C2'!J117,IF(ISNUMBER('FBPQ C2'!I117),'FBPQ C2'!I117,\"\"))","v":""},null,0,{"$f":"IF(ISBLANK('FBPQ T4'!E117),\" \",'FBPQ T4'!AE117)","v":" "}," "]
[null,"Overhead lines - Support",null,null,{"$f":"IF(ISNUMBER('FBPQ C2'!J118),'FBPQ C2'!J118,IF(ISNUMBER('FBPQ C2'!I118),'FBPQ C2'!I118,\"\"))","v":""},null,0,{"$f":"IF(ISBLANK('FBPQ T4'!E118),\" \",'FBPQ T4'!AE118)","v":" "}," "]
[null,null,"132kV Pole","Each",{"$f":"IF(ISNUMBER('[8]FBPQ C2'!K119),'[8]FBPQ C2'!K119,IF(ISNUMBER('[8]FBPQ C2'!I119),'[8]FBPQ C2'!I119,\"\"))","v":0},"DATA",0,{"$f":"IF(ISBLANK('FBPQ T4'!E119),\" \",'FBPQ T4'!AE119)","v":56},0,"132kV"]
[null,null,"132kV Tower","Each",{"$f":"IF(ISNUMBER('[8]FBPQ C2'!K120),'[8]FBPQ C2'!K120,IF(ISNUMBER('[8]FBPQ C2'!I120),'[8]FBPQ C2'!I120,\"\"))","v":0},"DATA",0,{"$f":"IF(ISBLANK('FBPQ T4'!E120),\" \",'FBPQ T4'!AE120)","v":4562},0,"132kV"]
[null,null,"132kV Fittings (Tower Line)","Each",{"$f":"IF(ISNUMBER('[8]FBPQ C2'!K121),'[8]FBPQ C2'!K121,IF(ISNUMBER('[8]FBPQ C2'!I121),'[8]FBPQ C2'!I121,\"\"))","v":0},"DATA",0,{"$f":"IF(ISBLANK('FBPQ T4'!E121),\" \",'FBPQ T4'!AE121)","v":9124},0,"132kV"]
[null,null,null,null,{"$f":"IF(ISNUMBER('FBPQ C2'!J122),'FBPQ C2'!J122,IF(ISNUMBER('FBPQ C2'!I122),'FBPQ C2'!I122,\"\"))","v":""},null,0,{"$f":"IF(ISBLANK('FBPQ T4'!E122),\" \",'FBPQ T4'!AE122)","v":" "}," "]
[null,"Underground cables (kms)",null,null,{"$f":"IF(ISNUMBER('FBPQ C2'!J123),'FBPQ C2'!J123,IF(ISNUMBER('FBPQ C2'!I123),'FBPQ C2'!I123,\"\"))","v":""},null,0,{"$f":"IF(ISBLANK('FBPQ T4'!E123),\" \",'FBPQ T4'!AE123)","v":" "}," "]
[null,null,"132kV UG Cable (Non Pressurised)","km",{"$f":"IF(ISNUMBER('FBPQ C2'!J124),'FBPQ C2'!J124,IF(ISNUMBER('FBPQ C2'!I124),'FBPQ C2'!I124,\"\"))","v":1174.4561693412438},"DATA",1174.4561693412438,{"$f":"IF(ISBLANK('FBPQ T4'!E124),\" \",'FBPQ T4'!AE124)","v":42},49327.159112332243,"132kV"]
[null,null,"132kV UG Cable (Oil)","km",{"$f":"IF(ISNUMBER('FBPQ C2'!J125),'FBPQ C2'!J125,IF(ISNUMBER('FBPQ C2'!I125),'FBPQ C2'!I125,\"\"))","v":1174.4561693412438},"DATA",1174.4561693412438,{"$f":"IF(ISBLANK('FBPQ T4'!E125),\" \",'FBPQ T4'!AE125)","v":164},192610.81177196398,"132kV"]
[null,null,"132kV UG Cable (Gas)","km",{"$f":"IF(ISNUMBER('FBPQ C2'!J126),'FBPQ C2'!J126,IF(ISNUMBER('FBPQ C2'!I126),'FBPQ C2'!I126,\"\"))","v":0},"DATA",0,{"$f":"IF(ISBLANK('FBPQ T4'!E126),\" \",'FBPQ T4'!AE126)","v":0},0,"132kV"]
[null,null,null,null,{"$f":"IF(ISNUMBER('FBPQ C2'!J127),'FBPQ C2'!J127,IF(ISNUMBER('FBPQ C2'!I127),'FBPQ C2'!I127,\"\"))","v":""},null,0,{"$f":"IF(ISBLANK('FBPQ T4'!E127),\" \",'FBPQ T4'!AE127)","v":" "}," "]
[null,"Submarine cables (kms)",null,null,{"$f":"IF(ISNUMBER('FBPQ C2'!J128),'FBPQ C2'!J128,IF(ISNUMBER('FBPQ C2'!I128),'FBPQ C2'!I128,\"\"))","v":""},null,0,{"$f":"IF(ISBLANK('FBPQ T4'!E128),\" \",'FBPQ T4'!AE128)","v":" "}," "]
[null,null,"132 kV Sub Cable","km",{"$f":"IF(ISNUMBER('FBPQ C2'!J129),'FBPQ C2'!J129,IF(ISNUMBER('FBPQ C2'!I129),'FBPQ C2'!I129,\"\"))","v":0},"DATA",0,{"$f":"IF(ISBLANK('FBPQ T4'!E129),\" \",'FBPQ T4'!AE129)","v":0},0,"132kV"]
[null,null,null,null,{"$f":"IF(ISNUMBER('FBPQ C2'!J130),'FBPQ C2'!J130,IF(ISNUMBER('FBPQ C2'!I130),'FBPQ C2'!I130,\"\"))","v":""},null,0,{"$f":"IF(ISBLANK('FBPQ T4'!E130),\" \",'FBPQ T4'!AE130)","v":" "}," "]
[null,"Switchgear ",null,null,{"$f":"IF(ISNUMBER('FBPQ C2'!J131),'FBPQ C2'!J131,IF(ISNUMBER('FBPQ C2'!I131),'FBPQ C2'!I131,\"\"))","v":""},null,0,{"$f":"IF(ISBLANK('FBPQ T4'!E131),\" \",'FBPQ T4'!AE131)","v":" "}," "]
[null,null,"132 kV CB (ID & OD)","Each",{"$f":"IF(ISNUMBER('FBPQ C2'!J132),'FBPQ C2'!J132,IF(ISNUMBER('FBPQ C2'!I132),'FBPQ C2'!I132,\"\"))","v":1048.3376453104456},"DATA",1048.3376453104456,{"$f":"IF(ISBLANK('FBPQ T4'!E132),\" \",'FBPQ T4'!AE132)","v":245},256842.72310105918,"132kV"]
[null,null,"132 kV Switchgear (other)","Each",{"$f":"E140","v":1048.3376453104456},"DATA",1048.3376453104456,{"$f":"IF(ISBLANK('FBPQ T4'!E133),\" \",'FBPQ T4'!AE133)","v":1662},1742337.1665059605,"132kV"]
[null,null,null,null,{"$f":"IF(ISNUMBER('FBPQ C2'!J134),'FBPQ C2'!J134,IF(ISNUMBER('FBPQ C2'!I134),'FBPQ C2'!I134,\"\"))","v":""},null,0,{"$f":"IF(ISBLANK('FBPQ T4'!E134),\" \",'FBPQ T4'!AE134)","v":" "}," "]
[null,"Transformers  ",null,null,{"$f":"IF(ISNUMBER('FBPQ C2'!J135),'FBPQ C2'!J135,IF(ISNUMBER('FBPQ C2'!I135),'FBPQ C2'!I135,\"\"))","v":""},null,0,{"$f":"IF(ISBLANK('FBPQ T4'!E135),\" \",'FBPQ T4'!AE135)","v":" "}," "]
[null,null,"132 kV Transformer","Each",{"$f":"IF(ISNUMBER('FBPQ C2'!J136),'FBPQ C2'!J136,IF(ISNUMBER('FBPQ C2'!I136),'FBPQ C2'!I136,\"\"))","v":2117.5143590615103},"DATA",2117.5143590615103,{"$f":"IF(ISBLANK('FBPQ T4'!E136),\" \",'FBPQ T4'!AE136)","v":191},404445.24258074845,"132kV/EHV"]
[null,null,"132 kV AuxiliaryTransfomer","Each",{"$f":"E76","v":11.322962042879682},"DATA",11.322962042879682,{"$f":"IF(ISBLANK('FBPQ T4'!E137),\" \",'FBPQ T4'!AE137)","v":336},3804.5152464075732,"132kV/EHV"]
[null,null,null,null,{"$f":"IF(ISNUMBER('FBPQ C2'!J138),'FBPQ C2'!J138,IF(ISNUMBER('FBPQ C2'!I138),'FBPQ C2'!I138,\"\"))","v":""},null,0,{"$f":"IF(ISBLANK('FBPQ T4'!E138),\" \",'FBPQ T4'!AE138)","v":" "}," "]
["Tele-control / SCADA",null,null,null,{"$f":"IF(ISNUMBER('FBPQ C2'!J139),'FBPQ C2'!J139,IF(ISNUMBER('FBPQ C2'!I139),'FBPQ C2'!I139,\"\"))","v":""},null,0,{"$f":"IF(ISBLANK('FBPQ T4'!E139),\" \",'FBPQ T4'!AE139)","v":" "}," "]
[null,"Primary substation",null,null,{"$f":"IF(ISNUMBER('FBPQ C2'!J140),'FBPQ C2'!J140,IF(ISNUMBER('FBPQ C2'!I140),'FBPQ C2'!I140,\"\"))","v":""},null,{"$f":"IF(ISNUMBER(E148),E148,IF(H148>0,F148,\" \"))","v":0},{"$f":"IF(ISBLANK('FBPQ T4'!E140),\" \",'FBPQ T4'!AE140)","v":" "}," "]
[null,null,"132 kV/EHV RTU (PM)","Each",62.645000000000003,"DATA",62.645000000000003,{"$f":"IF(ISBLANK('FBPQ T4'!E141),\" \",'FBPQ T4'!AE141)","v":2},{"$f":"IF(ISERROR(G149*H149),\" \",G149*H149)","v":125.29},"EHV/HV"]
[null,null,"132 kV/EHV RTU (GM)","Each",62.645000000000003,"DATA",62.645000000000003,{"$f":"IF(ISBLANK('FBPQ T4'!E142),\" \",'FBPQ T4'!AE142)","v":484},30320.18,"EHV/HV"]
[null,null,null,null,{"$f":"IF(ISNUMBER('FBPQ C2'!J143),'FBPQ C2'!J143,IF(ISNUMBER('FBPQ C2'!I143),'FBPQ C2'!I143,\"\"))","v":""},null,0,{"$f":"IF(ISBLANK('FBPQ T4'!E143),\" \",'FBPQ T4'!AE143)","v":" "}," "]
[null,"Secondary substation",null,null,{"$f":"IF(ISNUMBER('FBPQ C2'!J144),'FBPQ C2'!J144,IF(ISNUMBER('FBPQ C2'!I144),'FBPQ C2'!I144,\"\"))","v":""},null,0,{"$f":"IF(ISBLANK('FBPQ T4'!E144),\" \",'FBPQ T4'!AE144)","v":" "}," "]
[null,null,"HV RTU (PM)","Each",62.645000000000003,"DATA",62.645000000000003,{"$f":"IF(ISBLANK('FBPQ T4'!E145),\" \",'FBPQ T4'!AE145)","v":1491},{"$f":"IF(ISERROR(G153*H153),\" \",G153*H153)","v":93403.695000000007},"HV/LV"]
[null,null,"HV RTU (GM)","Each",62.645000000000003,"DATA",62.645000000000003,{"$f":"IF(ISBLANK('FBPQ T4'!E146),\" \",'FBPQ T4'!AE146)","v":751},47046.395000000004,"HV/LV"]
[null,null,null,null,{"$f":"IF(ISNUMBER('FBPQ C2'!J147),'FBPQ C2'!J147,IF(ISNUMBER('FBPQ C2'!I147),'FBPQ C2'!I147,\"\"))","v":""},null,0,{"$f":"IF(ISBLANK('FBPQ T4'!E147),\" \",'FBPQ T4'!AE147)","v":" "}," "]
[null,null,null,null,{"$f":"IF(ISNUMBER('FBPQ C2'!J148),'FBPQ C2'!J148,IF(ISNUMBER('FBPQ C2'!I148),'FBPQ C2'!I148,\"\"))","v":""},null,0,{"$f":"IF(ISBLANK('FBPQ T4'!E148),\" \",'FBPQ T4'!AE148)","v":" "}," "]
["HV network switchgear",null,null,null,{"$f":"IF(ISNUMBER('FBPQ C2'!J149),'FBPQ C2'!J149,IF(ISNUMBER('FBPQ C2'!I149),'FBPQ C2'!I149,\"\"))","v":""},null,0,{"$f":"IF(ISBLANK('FBPQ T4'!E149),\" \",'FBPQ T4'!AE149)","v":" "}," "]
[null,null,"6.6/11 kV CB (GM)",null,{"$f":"IF(ISNUMBER('FBPQ C2'!J150),'FBPQ C2'!J150,IF(ISNUMBER('FBPQ C2'!I150),'FBPQ C2'!I150,\"\"))","v":""},null,0,{"$f":"IF(ISBLANK('FBPQ T4'!E150),\" \",'FBPQ T4'!AE150)","v":" "}," "]
[null,null,"Primary","Each",{"$f":"IF(ISNUMBER('FBPQ C2'!J151),'FBPQ C2'!J151,IF(ISNUMBER('FBPQ C2'!I151),'FBPQ C2'!I151,\"\"))","v":29.271061451274075},"DATA",29.271061451274075,{"$f":"IF(ISBLANK('FBPQ T4'!E151),\" \",'FBPQ T4'!AE151)","v":" "}," "]
[null,null,"Distribution","Each",{"$f":"IF(ISNUMBER('FBPQ C2'!J152),'FBPQ C2'!J152,IF(ISNUMBER('FBPQ C2'!I152),'FBPQ C2'!I152,\"\"))","v":7.4683366665802167},"DATA",7.4683366665802167,{"$f":"IF(ISBLANK('FBPQ T4'!E152),\" \",'FBPQ T4'!AE152)","v":" "}," "]
[null,null,"20 kV Switch (GM)",null,{"$f":"IF(ISNUMBER('FBPQ C2'!J153),'FBPQ C2'!J153,IF(ISNUMBER('FBPQ C2'!I153),'FBPQ C2'!I153,\"\"))","v":""},"DATA","DATA",{"$f":"IF(ISBLANK('FBPQ T4'!E153),\" \",'FBPQ T4'!AE153)","v":" "}," "]
[null,null,"Primary","Each",{"$f":"IF(ISNUMBER('FBPQ C2'!J154),'FBPQ C2'!J154,IF(ISNUMBER('FBPQ C2'!I154),'FBPQ C2'!I154,\"\"))","v":0},"DATA",0,{"$f":"IF(ISBLANK('FBPQ T4'!E154),\" \",'FBPQ T4'!AE154)","v":" "}," "]
[null,null,"Distribution","Each",{"$f":"IF(ISNUMBER('FBPQ C2'!J155),'FBPQ C2'!J155,IF(ISNUMBER('FBPQ C2'!I155),'FBPQ C2'!I155,\"\"))","v":0},"DATA",0,{"$f":"IF(ISBLANK('FBPQ T4'!E155),\" \",'FBPQ T4'!AE155)","v":" "}," "]
[null,null,null,null,null,null,null,"Total MEAV",{"$f":"SUM(I18:I163)","v":18235705.162439495}]

{"sheet":"Calc-Net capex","index":9,"n_rows":55,"n_cols":15,"rows_kept":55,"cut":false,"hidden":false,"merged":[[46,7,46,8],[36,7,36,8],[2,9,2,11],[2,13,2,15],[3,9,3,11],[3,13,3,15],[45,7,45,8],[2,5,2,7],[3,5,3,7],[16,7,16,8],[15,7,15,8],[24,4,24,5],[35,7,35,8],[3,1,3,3],[2,1,2,3],[15,4,15,5],[15,1,15,2],[16,1,16,2],[24,1,24,2],[16,4,16,5],[45,1,45,2],[46,1,46,2],[25,1,25,2],[36,4,36,5],[46,4,46,5],[35,1,35,2],[35,4,35,5],[36,1,36,2],[25,4,25,5],[45,4,45,5]]}
["Total Net Capex",null,null,null,null,"Index"]
[]
[null,"Total Net Capex 2005/06 -2014/15 LV, HV, EHV, 132kV split",null,null,null,"Total Net Capex 2005/06 -2014/15 LV, LV/HV, HV, EHV, 132kV split",null,null,null,"IP Appendix 6 Table 5 Reductions to EHV",null,null,null,"IP Appendix 7 Reductions to EHV"]
[null,"Sum connecions/reinforcement/replacement capex -see below",null,null,null,"Sum connecions/reinforcement/replacement capex -see below",null,null,null,"Appendix 6 Table 5 EHV & 132",null,null,null,"Appendix 7 Table 18"]
[null,null,"£m","% of Total",null,null,"£m","% of Total",null,"EHV",null,{"$f":"K5*(F21/(F21+F22))","v":0},null,null,"£m"]
[null,"LV",{"$f":"C19+F19+I19+C28+F28-O6","v":128.03944818043911},{"$f":"C6/SUM($C$6:$C$9)","v":0.13596332621236557},null,"LV",{"$f":"+C39+F39+I39+C49+F49-O6","v":128.03944818043911},{"$f":"G6/SUM($G$6:$G$10)","v":0.13596332621236557},null,"132kV",null,{"$f":"K5*(F22/(F21+F22))","v":0},null,"LV"]
[null,"HV",{"$f":"C20+F20+I20+C29+F29-O7-O8","v":312.43495500464473},{"$f":"C7/SUM($C$6:$C$9)","v":0.3317703747643298},null,"LV/HV",{"$f":"+C40+F40+I40+C50+F50-O7","v":56.267333977708013},{"$f":"G7/SUM($G$6:$G$10)","v":5.9749506838939877E-2},null,null,null,null,null,"LV/HV"]
[null,"EHV",{"$f":"C21+F21+I21+C30+F30-L5-O9","v":201.11315333604219},{"$f":"C8/SUM($C$6:$C$9)","v":0.21355928708854907},null,"HV",{"$f":"+C41+F41+I41+C51+F51-O8","v":256.16762102693673},{"$f":"G8/SUM($G$6:$G$10)","v":0.27202086792538993},null,null,null,null,null,"HV"]
[null,"132 kV",{"$f":"C22+F22+I22+C31+F31-L6-O10","v":300.13291875211144},{"$f":"C9/SUM($C$6:$C$9)","v":0.31870701193475565},null,"EHV",{"$f":"+C42+F42+I42+C52+F52-L5-O9","v":201.11315333604219},{"$f":"G9/SUM($G$6:$G$10)","v":0.21355928708854907},null,null,null,null,null,"EHV"]
[null,null,null,null,null,"132 kV",{"$f":"+C43+F43+I43+C53+F53-L6-O10","v":300.13291875211144},{"$f":"G10/SUM($G$6:$G$10)","v":0.31870701193475565},null,null,null,null,null,"132 kV"]
[]
[]
["Connection/Reinforcement/Replacement Capex LV, HV, EHV, 132kV split"]
[]
[]
[null,"Connections Capex 2005/06 -2014/15 (£m)",null,null,"General reinforcement Capex 2005/06 -2014/15 (£m)",null,null,"Fault reinforcement Capex 2005/06 -2014/15 (£m)"]
[null,"Connections spend minus customer contributions (from FBPQ LR1)",null,null,"(from FBPQ LR4)",null,null,"(from FBPQ LR6)"]
[]
["c32","LV",41.132566013145379,null,"LV",{"$f":"SUM('FBPQ LR4'!D11:M11)","v":10.2948140695399},null,"LV",{"$f":"SUM('FBPQ LR6'!C28:L28)","v":0}]
["c33","HV",100.38915569099296,null,"HV",{"$f":"SUM('FBPQ LR4'!D12:M12)","v":41.569892705940312},null,"HV",{"$f":"SUM('FBPQ LR6'!C29:L29)","v":2.04974931253745}]
["c34","EHV",0.3967625126607135,null,"EHV",{"$f":"SUM('FBPQ LR4'!D13:M13)","v":95.089517911596914},null,"EHV",{"$f":"SUM('FBPQ LR6'!C30:L30)","v":10.928432918880622}]
["c35","132 kV",0,null,"132 kV",{"$f":"SUM('FBPQ LR4'!D14:M14)","v":157.49344707378151},null,"132 kV",{"$f":"SUM('FBPQ LR6'!C31:L31)","v":10.137299167357355}]
[]
[]
[null,"Replacement Capex 2005/06 -2014/15 (£m)",null,null,"ESQCR 2005/06 -2014/15 (£m)"]
[null," (from FBPQ NL1)",null,null,"(from FBPQ NL9)"]
[]
[null,"LV",{"$f":"SUM('FBPQ NL1 0309'!D10:M16)","v":76.612068097753834},null,"LV",{"$f":"SUM('NL9 - Legal & Safety'!D33:M33,'NL9 - Legal & Safety'!D42:M42)","v":0}]
[null,"HV",{"$f":"SUM('FBPQ NL1 0309'!D17:M22)","v":168.42615729517399},null,"HV",{"$f":"SUM('NL9 - Legal & Safety'!D34:M34,'NL9 - Legal & Safety'!D43:M43)","v":0}]
[null,"EHV",{"$f":"SUM('FBPQ NL1 0309'!D23:M28)","v":94.698439992903943},null,"EHV",{"$f":"SUM('NL9 - Legal & Safety'!D35:M35,'NL9 - Legal & Safety'!D44:M44)","v":0}]
[null,"132 kV",{"$f":"SUM('FBPQ NL1 0309'!D29:M34)","v":132.50217251097257},null,"132 kV",{"$f":"SUM('NL9 - Legal & Safety'!D36:M36,'NL9 - Legal & Safety'!D45:M45)","v":0}]
[]
["Connection/Reinforcement/Replacement Capex LV, LV/HV, HV, EHV, 132kV split"]
[]
[]
[null,"Connections Capex 2005/06 -2014/15 (£m)",null,null,"General reinforcement Capex 2005/06 -2014/15 (£m)",null,null,"Fault reinforcement Capex 2005/06 -2014/15 (£m)"]
[null,"Connections spend minus customer contributions (from FBPQ LR1)",null,null,"(from FBPQ LR4)",null,null,"(from FBPQ LR6)"]
[]
["c20","LV",41.132566013145379,null,"LV",{"$f":"SUM('FBPQ LR4'!D11:M11)","v":10.2948140695399},null,"LV",{"$f":"SUM('FBPQ LR6'!C28:L28)","v":0}]
["c21","LV/HV",19.84513086747566,"allocated in proportion to repex","LV/HV",{"$f":"SUM('FBPQ LR4'!D12:M12)*(C55)","v":8.2176202720103539},"allocated in proportion to repex","LV/HV",{"$f":"SUM('FBPQ LR6'!C29:L29)*(C55)","v":0.40519858019359356},"allocated in proportion to repex"]
["c22","HV",80.544024823517304,null,"HV",{"$f":"SUM('FBPQ LR4'!D12:M12)*(1-C55)","v":33.352272433929961},null,"HV",{"$f":"SUM('FBPQ LR6'!C29:L29)*(1-C55)","v":1.6445507323438564}]
["c23","EHV",0.3967625126607135,null,"EHV",{"$f":"SUM('FBPQ LR4'!D13:M13)","v":95.089517911596914},null,"EHV",{"$f":"SUM('FBPQ LR6'!C30:L30)","v":10.928432918880622}]
["c24","132 kV",0,null,"132 kV",{"$f":"SUM('FBPQ LR4'!D14:M14)","v":157.49344707378151},null,"132 kV",{"$f":"SUM('FBPQ LR6'!C31:L31)","v":10.137299167357355}]
[]
[]
[null,"Replacement Capex 2005/06 -2014/15 (£m)",null,null,"ESQCR 2005/06 -2014/15 (£m)",null,null,"ESQCR 2005/06 -2014/15 (£m)"]
[null," (from FBPQ NL1)",null,null,"(from FBPQ NL9)",null,null,"NL1 + NL9"]
[]
[null,"LV",{"$f":"SUM('FBPQ NL1 0309'!D10:M16)","v":76.612068097753834},null,"LV",{"$f":"SUM('NL9 - Legal & Safety'!D33:M33,'NL9 - Legal & Safety'!D42:M42)","v":0},null,"LV",{"$f":"F49+C49","v":76.612068097753834}]
[null,"LV/HV",{"$f":"SUM('FBPQ NL1 0309'!D21:M22)","v":27.799384258028404},"HV/LV sub/trans costs","LV/HV",{"$f":"SUM('NL9 - Legal & Safety'!D34:M34,'NL9 - Legal & Safety'!D43:M43)*C55","v":0},null,"LV/HV",{"$f":"F50+C50","v":27.799384258028404}]
[null,"HV",{"$f":"SUM('FBPQ NL1 0309'!D17:M20)","v":140.62677303714563},null,"HV",{"$f":"SUM('NL9 - Legal & Safety'!D34:M34,'NL9 - Legal & Safety'!D43:M43)*(1-C55)","v":0},null,"HV",{"$f":"F51+C51","v":140.62677303714563}]
[null,"EHV",{"$f":"SUM('FBPQ NL1 0309'!D23:M28)","v":94.698439992903943},null,"EHV",{"$f":"SUM('NL9 - Legal & Safety'!D35:M35,'NL9 - Legal & Safety'!D44:M44)","v":0},null,"EHV",{"$f":"F52+C52","v":94.698439992903943}]
[null,"132 kV",{"$f":"SUM('FBPQ NL1 0309'!D29:M34)","v":132.50217251097257},null,"132 kV",{"$f":"SUM('NL9 - Legal & Safety'!D36:M36,'NL9 - Legal & Safety'!D45:M45)","v":0},null,"132 kV",{"$f":"F53+C53","v":132.50217251097257}]
[]
[null,"LV/HV/(LV/HV+HV) %",{"$f":"C50/C51","v":0.19768201785221498}]

{"sheet":"Summary of revenue","index":10,"n_rows":49,"n_cols":12,"rows_kept":49,"cut":false,"hidden":false,"merged":[[29,1,29,4],[10,1,10,4],[11,1,11,4],[12,1,12,4],[13,1,13,4],[15,1,15,4],[17,1,17,4],[18,1,18,4],[20,1,20,4],[25,1,25,4],[26,1,26,4],[27,1,27,4],[46,1,46,4],[31,1,31,4],[33,1,33,4],[37,1,37,4],[38,1,38,4],[44,1,44,4],[45,1,45,4]]}
[null,null,"Summary of Revenue",null,null,null,null,null,null,"Index"]
[]
[]
[]
[]
[]
[]
["Allowed Demand Revenue (ADt)",null,null,null,null,null,null,"2005/06","2006/07","2007/08","2008/09","2009/10"]
[null,null,null,null,null,null,null,16,17,18,19,20]
[]
[null,"Base Demand Revenue  (BRt)",null,null,null,"£m",null,257.60172699999998,263.83625999999998,276.42685499999999]
[null,"Pass through Items (PTt)",null,null,null,"£m",null,2.1202839999999998,-2.1209500000000001,-4.5983270000000003]
[null,"Incentive Revenue (Ipt)",null,null,null,"£m",null,9.429665,8.5679599999999994,26.407907999999999]
[null,"Correction Factor (KDt)",null,null,null,"£m",null,8.5620899999999995,-5.3793519999999999,-1.480097]
[]
[null,"Allowed Demand Revenue (Adt)",null,null,null,"£m",null,260.589586,275.662622,299.71653300000003]
[]
[null,"Regulated Demand Revenue (RDt)",null,null,null,"£m",null,255.53,274.27999999999997,287.86]
[null,"Net Movement on Revenue Provisions",null,null,null,"£m",null,1.83,-0.72,-3.93]
[]
[null,"Over/Under Recovery",null,null,null,"£m",null,-5.0595860000000004,-1.382622,-11.856533000000001]
[]
[]
["Allowed Network Generation Revenue (AGt)"]
[]
[null,"Incentivised Generation (IGt)",null,null,null,"£m",null,0,1.2822999999999999E-2,4.2557999999999999E-2]
[null,"Registered Power Zones (RPZt)",null,null,null,"£m",null,0,0,0]
[null,"Correction Factor (KGt)",null,null,null,"£m",null,0,0,-3.0219999999999999E-3]
[]
[null,"Allowed Network Generation Revenue (AGt)",null,null,null,"£m",null,0,1.2822999999999999E-2,4.5580000000000002E-2]
[]
[null,"Network Generation Revenue (RGt)",null,null,null,"£m",null,0,0.01,0.08]
[]
[null,"Over/Under Recovery",null,null,null,"£m",null,0,-2.823E-3,3.4419999999999999E-2]
[]
[]
["Metering Revenue"]
[null,"Legacy Basic Meter Asset Provision Revenue",null,null,null,"£m",null,9.06,8.98,9.85]
[null,"Basic Meter Operation Revenue",null,null,null,"£m",null,6.7381739999999999,4.3875710000000003,0]
[]
[null,null,null,null,null,null,null,15.798173999999999,13.367571,9.85]
[]
[]
["Excluded Services and Revenue Outside of Price Control"]
[null,"Excluded Services",null,null,null,"£m",null,63.79,67.66,104.02]
[null,"Revenue Outside of Price Control",null,null,null,"£m",null,4.87,4.63,4.45]
[null,"De-Minimis Revenue",null,null,null,"£m",null,2.89,2.57,2.2200000000000002]
[]
[null,null,null,null,null,null,null,71.55,74.86,110.69]

{"sheet":"Allowed revenue -DPCR4","index":11,"n_rows":33,"n_cols":10,"rows_kept":33,"cut":false,"hidden":false,"merged":[]}
[null,null,"2004/05","2005/6","2006/7","2007/8","2008/9","2009/10",null,"Index"]
[null,null,"(£M)","(£M)","(£M)","(£M)","(£M)","(£M)"]
[1,"Opening asset value",null,947.9,989.2,1030.2,1064.8,1093.2," "]
[2,"Total capex",null,117.8,117.5,117,116.6,116.4," "]
[3,"Depreciation",null,-76.5,-76.5,-82.4,-88.2,-94.1," "]
[4,"Closing asset value",null,989.2,1030.2,1064.8,1093.2,1115.5999999999999," "]
[5,"Present value of opening / closing RAV",null,947.9,null,null,null,851.7]
[6,"5 Year movement in closing RAV",null,null,null,null,null,96.2]
["ALLOWED ITEMS"]
[7,"Operating costs (excluding pensions)",null,75.2,77.7,78.2,76.900000000000006,76.2," "]
[8,"Capital expenditure (excluding pensions)",null,110.3,109.9,109.4,109,108.8," "]
[9,"Pensions allowance",null,13,13.1,13.1,13.1,13.1," "]
[10,"Tax allowance",null,27.2,26.3,26.4,26.8,26.8," "]
[11,"Capex incentive scheme",null,-0.8,0.6,-0.6,-0.6,-0.2," "]
[12,"Sliding scale additional income",null,1.4,1.4,1.5,1.5,1.6," "]
[13,"Opex incentive / Other adjustments",null,"-","-","-","-","-"," "]
[14,"Quality award",null,"-","-","-","-","-"," "]
[15,"DPCR3 costs",null,1.5,"-","-","-","-"," "]
[16,"Total allowed items",null,227.7,229,228.1,226.8,226.3," "]
[17,"Present value of allowed items",null,221.6,211.2,199.3,187.7,177.5," "]
[18,"5 year movement in closing RAV",null,null,null,null,null,96.2]
[19,"TOTAL PRESENT VALUE OVER 5 YEARS",null,null,null,null,null,1093.5]
["REVENUE"]
[20,"Revenue index",null,1,1.0089999999999999,1.02,1.0329999999999999,1.044," "]
[21,"Discounted revenue index",null,0.97299999999999998,0.93100000000000005,0.89100000000000001,0.85499999999999998,0.81899999999999995," "]
[22,"Price control revenue",256.2,241.2,243.4,246.1,249.1,251.8," "]
[23,"Excluded service revenue",null,3.5,3.5,3.5,3.5,3.5," "]
[24,"Total revenue",null,244.7,246.9,249.6,252.6,255.3," "]
[25,"Present value of total revenue",null,238.2,227.7,218.1,209.2,200.3," "]
[26,"TOTAL PRESENT VALUE OVER 5 YEARS",null,null,null,null,null,1093.5]
[]
["Take these data from the February 2005 Ofgem document (link below), not the November 2004 final proposals."]
["http://www.ofgem.gov.uk/Markets/RetMkts/Metrng/Metering/Documents1/9745-5405.pdf"]

{"sheet":"FBPQ T4","index":12,"n_rows":146,"n_cols":31,"rows_kept":146,"cut":false,"hidden":false,"merged":[[6,1,8,4],[6,5,8,5],[7,28,7,29],[6,26,6,30],[7,6,7,7],[7,8,7,9],[7,11,7,12],[7,13,7,14],[7,16,7,17],[7,18,7,19],[7,21,7,22],[7,23,7,24],[7,26,7,27],[6,6,6,10],[6,11,6,15],[6,16,6,20],[6,21,6,25]]}
["Main Forecast Business Plan DPCR5",null,null,null,null," ","Index",null," ",null," "," ",null," ",null," "," ",null," ",null," "," ",null," ",null," "," ",null," ",null," "]
[]
["T4 - Volume Summary"]
[]
[null,"Total Asset Register Movement"]
[]
[null,"Asset categories",null,null,null,"Opening Balance DCPR4","2005/06",null,null,null,null,"2006/07",null,null,null,null,"2007/08",null,null,null,null,"2008/09",null,null,null,null,"2009/10"]
[null,null,null,null,null,null,"Assets removed ",null,"Assets Installed",null,"Closing Balance","Assets removed ",null,"Assets Installed",null,"Closing Balance","Assets removed ",null,"Assets Installed",null,"Closing Balance","Assets removed ",null,"Assets Installed",null,"Closing Balance","Assets removed ",null,"Assets Installed",null,"Closing Balance DPCR4"]
[null,null,null,null,null,null,"LRE","NLRE","LRE","NLRE","2005/06","LRE","NLRE","LRE","NLRE","2006/07","LRE","NLRE","LRE","NLRE","2007/08","LRE","NLRE","LRE","NLRE","2008/09","LRE","NLRE","LRE","NLRE","2009/10"]
[null,null,"LV Network"]
[null,null,null,"Overhead lines - Conductor"]
[null,null,null,null,"LV Main (OHL)",4914,22,8,214,4,5102,62,20,9,10,5039,0,21,35,18,5071,0,45.699999999999996,27.6,17.3,5070.2,0,148.29999999999998,25.5,64.300000000000011,5011.7]
[null,null,null,null,"LV Service (OHL)",135999,911,1556,48,1633,135213,97,1478,77,565,134280,2469,1419,437,732,131561,1942,2476,358,637,128138,1785,3377,371,1217,124564]
[]
[null,null,null,"Overhead lines - Support"]
[null,null,null,null,"LV Support",123846,134,0,61,0,123773,228,0,335,0,123880,1316,910,1127,910,123691,1035,570,902,142,123130,951,1458,872,400,121993]
[]
[null,null,null,"Underground cables"]
[null,null,null,null,"LV Main (UG Consac)",11,0,0,0,0,11,0,0,0,0,11,0,0,0,0,11,0,0,0,0,11,0,0,0,0,11]
[null,null,null,null,"LV Main (UG Plastic)",13223,0,0,655,39,13917,0,2,310,75,14300,0,0,305,50,14655,0,1.4,210.3,74.599999999999994,14938.5,0,1,196,78,15211.5]
[null,null,null,null,"LV Main (UG Paper)",18395,0,7,0,0,18388,0,31,0,0,18357,0,33,0,0,18324,0,4,0,0,18320,0,3,0,0,18317]
[null,null,null,null,"LV Service (UG)",2361332,77,1230,27978,1230,2389233,0,1153,23378,2066,2413524,0,1684,27485,2371,2441696,0,108,20668.5,1787,2464043.5,0,262,18931.599999999999,2406,2485119.1]
[]
[null,null,null,"Switchgear "]
[null,null,null,null,"LV Pillar (ID)",8541,12,49,210,49,8739,43,105,392,105,9088,0,94,259,103,9356,0,283,204,143,9420,0,116,188,104,9596]
[null,null,null,null,"LV Pillar (OD)",7893,0,0,80,0,7973,3,36,0,36,7970,181,0,136,0,7925,142,0,63,0,7846,131,0,57,0,7772]
[null,null,null,null,"LV Board (WM)",2425,0,0,0,0,2425,43,0,0,0,2382,33,0,0,0,2349,26,0,0,0,2323,24,0,0,0,2299]
[null,null,null,null,"LV UGB",27050,0,1,63,9,27121,0,159,127,136,27225,0,330,484,155,27534,0,340,392,457,28043,0,33,391,123,28524]
[null,null,null,null,"LV Fuses (PM)",22689,0,0,31,0,22720,109,0,88,0,22699,485,0,484,0,22698,382,0,380,0,22696,351,0,347,0,22692]
[null,null,null,null,"LV Fuses (TM)",0,0,0,0,0,0,0,0,0,0,0,0,0,0,0,0,0,0,0,0,0,0,0,0,0,0]
[]
[null,null,"HV network"]
[null,null,null,"Overhead lines - Conductor"]
[null,null,null,null,"6.6/11 kV OHL (Open)",12571,23,22,13,22,12561,17,43,46,43,12590,78,57,60,57,12572,34.299999999999997,250.1,26.8,219.4,12533.800000000001,49.4,167.5,26,130.30000000000001,12473.2]
[null,null,null,null,"6.6/11 kV OHL (Covered)",22,0,0,0,0,22,0,0,0,0,22,1,0,0,0,21,0.4,0,0,0,20.6,0.6,0,0,0,20]
[null,null,null,null,"20 kV OHL (Open)",0,0,0,0,0,0,0,0,0,0,0,0,0,0,0,0,0,0,0,0,0,0,0,0,0,0]
[null,null,null,null,"20 kV OHL (Covered)",0,0,0,0,0,0,0,0,0,0,0,0,0,0,0,0,0,0,0,0,0,0,0,0,0,0]
[]
[null,null,null,"Overhead lines - Support"]
[null,null,null,null,"6.6/11 kV Support",163477,229,225,145,225,163393,0,233,697,506,164363,2217,1136,647,1136,162793,974,1765,525,1460,162039,1403,1533,509,1161,160773]
[null,null,null,null,"20 kV Support",0,0,0,0,0,0,0,0,0,0,0,0,0,0,0,0,0,0,0,0,0,0,0,0,0,0]
[]
[null,null,null,"Underground cables (kms)"]
[null,null,null,null,"6.6/11kV UG Cable",12768,0,10,122,30,12910,1,55,184,55,13093,0,10,167,38,13288,0,10.8,133,77.3,13487.5,0,14.700000000000001,124.7,76.400000000000006,13673.9]
[null,null,null,null,"20kV UG Cable",0,0,0,0,0,0,0,0,0,0,0,0,0,0,0,0,0,0,0,0,0,0,0,0,0,0]
[]
[null,null,null,"Submarine cables (kms)"]
[null,null,null,null,"HV Sub Cable",0,0,0,0,0,0,0,0,0,0,0,0,0,0,0,0,"",0,"",0,0,"",0,"",0,0]
[]
[null,null,null,"Switchgear "]
[null,null,null,null,"6.6/11 kV CB (PM)",1148,0,63,0,23,1108,0,25,0,24,1107,0,66,0,56,1097,0,0,0,27,1124,0,0,0,103,1227]
[null,null,null,null,"6.6/11 kV CB (GM)",7882,0,18,73,15,7952,0,321,35,37,7703,0,344,169,32,7560,0,8,135,36,7723,0,23,128,40,7868]
[null,null,null,null,"6.6/11 kV Switch (PM)",195,0,0,0,41,236,0,6,0,28,258,0,0,0,36,294,0,387,0,418,325,0,72,0,134,387]
[null,null,null,null,"6.6/11 kV Switch (GM)",11859,0,162,47,53,11797,0,355,4,1,11447,0,410,32,0,11069,0,236,25,1,10859,0,276,23,2,10608]
[null,null,null,null,"6.6/11 kV RMU",14442,0,13,297,47,14773,0,94,518,269,15466,4,243,552,243,16014,2,65,445,274,16666,3,94,428,330,17327]
[null,null,null,null,"6.6/11 kV Switchgear - Other (PM)",10690,0,1352,3,1405,10746,0,134,12,388,11012,0,150,192,352,11406,0,0,168,0,11574,0,0,183,0,11757]
[null,null,null,null,"6.6/11 kV Switchgear - Other (GM)",0,0,0,0,0,0,0,0,0,0,0,0,0,0,0,0,0,0,0,0,0,0,0,0,0,0]
[null,null,null,null,"20 kV CB (PM)",0,0,0,0,0,0,0,0,0,0,0,0,0,0,0,0,0,0,0,0,0,0,0,0,0,0]
[null,null,null,null,"20 kV CB (GM)",0,0,0,0,0,0,0,0,0,0,0,0,0,0,0,0,0,0,0,0,0,0,0,0,0,0]
[null,null,null,null,"20 kV Switch (PM)",0,0,0,0,0,0,0,0,0,0,0,0,0,0,0,0,0,0,0,0,0,0,0,0,0,0]
[null,null,null,null,"20 kV Switch (GM)",0,0,0,0,0,0,0,0,0,0,0,0,0,0,0,0,0,0,0,0,0,0,0,0,0,0]
[null,null,null,null,"20 kV RMU",0,0,0,0,0,0,0,0,0,0,0,0,0,0,0,0,0,0,0,0,0,0,0,0,0,0]
[null,null,null,null,"20 kV Switchgear - Other (PM)",0,0,0,0,0,0,0,0,0,0,0,0,0,0,0,0,0,0,0,0,0,0,0,0,0,0]
[null,null,null,null,"20 kV Switchgear - Other (GM)",0,0,0,0,0,0,0,0,0,0,0,0,0,0,0,0,0,0,0,0,0,0,0,0,0,0]
[]
[null,null,null,"Transformers  "]
[null,null,null,null,"6.6/11 kV Transformer (PM)",22676,279,54,323,54,22720,284,149,263,149,22699,356,129,352,129,22695,156,136,280,139,22822,225,237,262,232,22854]
[null,null,null,null,"6.6/11 kV Transformer (GM)",17685,0,73,392,74,18078,0,123,357,143,18455,50,199,357,199,18762,22,75,285,92,19042,32,102,269,131,19308]
[null,null,null,null,"20 kV Transformer (PM)",0,0,0,0,0,0,0,0,0,0,0,0,0,0,0,0,0,0,0,0,0,0,0,0,0,0]
[null,null,null,null,"20 kV Transformer (GM)",0,0,0,0,0,0,0,0,0,0,0,0,0,0,0,0,0,0,0,0,0,0,0,0,0,0]
[]
[null,null,"EHV Network"]
[null,null,null,"Overhead lines - Conductor"]
[null,null,null,null,"33kV OHL (Pole Line)",1806,1,4,0,4,1805,11,9,0,9,1794,30,18,5,18,1769,5,3.3,4.3,1.8,1766.8,0.6,22,0.7,8.6,1753.5]
[null,null,null,null,"33kV OHL (Tower Line)",947,0,0,0,2,949,0,0,0,0,949,24,0,8,0,933,0,0,0,0,933,0,0,0,0,933]
[null,null,null,null,"66kV OHL (Pole Line)",0,0,0,0,0,0,0,0,0,0,0,0,0,0,0,0,0,0,0,0,0,0,0,0,0,0]
[null,null,null,null,"66kV OHL (Tower Line)",0,0,0,0,0,0,0,0,0,0,0,0,0,0,0,0,0,0,0,0,0,0,0,0,0,0]
[]
[null,null,null,"Overhead lines - Support"]
[null,null,null,null,"33kV Pole",28943,1,36,1,36,28943,276,0,6,0,28673,483,144,83,144,28273,50,32,43,20,28254,6,232,7,102,28125]
[null,null,null,null,"33kV Tower",1326,30,0,0,0,1296,0,0,10,7,1313,63,0,37,0,1287,0,0,0,0,1287,0,0,0,0,1287]
[null,null,null,null,"66kV Pole",0,0,0,0,0,0,0,0,0,0,0,0,0,0,0,0,0,0,0,0,0,0,0,0,0,0]
[null,null,null,null,"66kV Tower",0,0,0,0,0,0,0,0,0,0,0,0,0,0,0,0,0,0,0,0,0,0,0,0,0,0]
[]
[null,null,null,"Underground cables (kms)"]
[null,null,null,null,"33kV UG Cable (Non Pressurised)",1381,0,0,67,25,1473,2,8,55,8,1526,0,0,23,16,1565,1.9,19.2,11.9,4.2,1560,1.1000000000000001,12.4,4.4000000000000004,11.7,1562.6]
[null,null,null,null,"33kV UG Cable (Oil)",157,1,0,0,0,156,0,0,0,0,156,0,0,0,0,156,0,0,0,0,156,0,0,0,0,156]
[null,null,null,null,"33kV UG Cable (Gas)",0,0,0,0,0,0,0,0,0,0,0,0,0,0,0,0,0,0,0,0,0,0,0,0,0,0]
[null,null,null,null,"66kV UG Cable (Non Pressurised)",0,0,0,0,0,0,0,0,0,0,0,0,0,0,0,0,0,0,0,0,0,0,0,0,0,0]
[null,null,null,null,"66kV UG Cable (Oil)",0,0,0,0,0,0,0,0,0,0,0,0,0,0,0,0,0,0,0,0,0,0,0,0,0,0]
[null,null,null,null,"66kV UG Cable (Gas)",0,0,0,0,0,0,0,0,0,0,0,0,0,0,0,0,0,0,0,0,0,0,0,0,0,0]
[]
[null,null,null,"Submarine cables (kms)"]
[null,null,null,null,"EHV Sub Cable",0,0,0,0,0,0,0,0,0,0,0,0,0,0,0,0,"",0,"",0,0,"",0,"",0,0]
[]
[null,null,null,"Switchgear "]
[null,null,null,null,"33 KV CB (ID)",365,0,0,5,0,370,1,0,12,0,381,0,0,15,15,411,0,6,0,6,411,0,7,3,7,414]
[null,null,null,null,"33 kV CB (OD)",569,0,0,17,1,587,0,0,0,0,587,12,12,1,12,576,0,9,0,8,575,0,9,0,9,575]
[null,null,null,null,"33 kV Switch (GM)",0,0,0,0,0,0,0,0,0,0,0,0,0,0,0,0,0,0,0,0,0,0,0,0,0,0]
[null,null,null,null,"33 kV Switch (PM)",0,0,0,0,0,0,0,0,0,0,0,0,0,0,0,0,0,0,0,0,0,0,0,0,0,0]
[null,null,null,null,"33 kV RMU",51,0,0,0,0,51,1,0,5,0,55,2,0,1,0,54,0,0,0,0,54,0,0,0,0,54]
[null,null,null,null,"33 kV Switchgear - Other",2013,0,0,2,0,2015,0,0,2,0,2017,0,17,2,42,2044,0,0,0,0,2044,0,0,0,0,2044]
[null,null,null,null,"66 KV CB (ID & OD)",0,0,0,0,0,0,0,0,0,0,0,0,0,0,0,0,0,0,0,0,0,0,0,0,0,0]
[null,null,null,null,"66 KV Switchgear - Other",0,0,0,0,0,0,0,0,0,0,0,0,0,0,0,0,0,0,0,0,0,0,0,0,0,0]
[]
[null,null,null,"Transformers  "]
[null,null,null,null,"33 kV Transformer (PM)",0,0,0,0,0,0,0,0,0,0,0,0,0,0,0,0,0,0,0,0,0,0,0,0,0,0]
[null,null,null,null,"33 kV Transformer (GM)",702,0,0,11,0,713,3,3,6,3,716,0,0,0,1,717,0,5,0,5,717,2,0,2,0,717]
[null,null,null,null,"33 kV AuxiliaryTransfomer",645,0,0,5,0,650,2,0,0,0,648,0,13,0,16,651,0,0,0,0,651,0,0,0,0,651]
[null,null,null,null,"66 kV Transformer",0,0,0,0,0,0,0,0,0,0,0,0,0,0,0,0,0,0,0,0,0,0,0,0,0,0]
[null,null,null,null,"66 kV AuxiliaryTransfomer",0,0,0,0,0,0,0,0,0,0,0,0,0,0,0,0,0,0,0,0,0,0,0,0,0,0]
[]
[null,null,"132kV Network"]
[null,null,null,"Overhead lines - Conductor"]
[null,null,null,null,"132kV OHL Conductor (Pole Line)",143,0,1,0,1,143,5,0,0,0,138,0,0,0,0,138,0,0,0,0,138,0,0,0,0,138]
[null,null,null,null,"132kV OHL Conductor (Tower Line)",2233,0,0,0,0,2233,0,0,13,0,2246,4,8,4,8,2246,0,130,0,130,2246,0,130,0,130,2246]
[]
[null,null,null,"Overhead lines - Support"]
[null,null,null,null,"132kV Pole",56,0,0,0,0,56,0,0,0,0,56,0,0,0,0,56,0,0,0,0,56,0,0,0,0,56]
[null,null,null,null,"132kV Tower",4569,0,7,0,7,4569,7,0,0,0,4562,0,0,0,0,4562,0,5,0,5,4562,0,4,0,4,4562]
[null,null,null,null,"132kV Fittings (Tower Line)",9138,0,0,0,0,9138,14,0,0,0,9124,0,0,0,0,9124,0,49,0,49,9124,0,45,0,45,9124]
[]
[null,null,null,"Underground cables (kms)"]
[null,null,null,null,"132kV UG Cable (Non Pressurised)",34,0,0,0,0,34,0,0,1,0,35,0,0,0,0,35,0,0,7,0,42,0,0,0,0,42]
[null,null,null,null,"132kV UG Cable (Oil)",164,0,0,0,0,164,0,0,0,0,164,0,0,0,0,164,0,0,0,0,164,0,0,0,0,164]
[null,null,null,null,"132kV UG Cable (Gas)",0,0,0,0,0,0,0,0,0,0,0,0,0,0,0,0,0,0,0,0,0,0,0,0,0,0]
[]
[null,null,null,"Submarine cables (kms)"]
[null,null,null,null,"132 kV Sub Cable",0,0,0,0,0,0,0,0,0,0,0,0,0,0,0,0,0,0,0,0,0,0,0,0,0,0]
[]
[null,null,null,"Switchgear "]
[null,null,null,null,"132 kV CB (ID & OD)",264,44,0,4,0,224,0,0,12,0,236,0,3,0,12,245,0,0,0,0,245,0,10,0,10,245]
[null,null,null,null,"132 kV Switchgear (other)",1618,0,0,0,0,1618,0,0,0,0,1618,0,36,0,80,1662,0,0,0,0,1662,0,0,0,0,1662]
[]
[null,null,null,"Transformers  "]
[null,null,null,null,"132 kV Transformer",189,0,0,2,0,191,1,0,0,0,190,9,0,7,0,188,4,0,7,0,191,0,2,0,2,191]
[null,null,null,null,"132 kV AuxiliaryTransfomer",327,0,0,0,0,327,0,0,0,0,327,0,8,0,17,336,2,0,2,0,336,0,0,0,0,336]
[]
[null,null,"Tele-control / SCADA"]
[null,null,null,"Primary substation"]
[null,null,null,null,"132 kV/EHV RTU (PM)",0,0,0,0,0,0,0,0,0,0,0,0,0,0,2,2,0,0,0,0,2,0,0,0,0,2]
[null,null,null,null,"132 kV/EHV RTU (GM)",462,0,0,0,0,462,0,0,0,5,467,0,0,0,17,484,0,0,0,0,484,0,0,0,0,484]
[]
[null,null,null,"Secondary substation"]
[null,null,null,null,"HV RTU (PM)",829,0,0,0,0,829,0,0,0,335,1164,0,0,0,327,1491,0,0,0,0,1491,0,0,0,0,1491]
[null,null,null,null,"HV RTU (GM)",224,0,0,0,0,224,0,0,0,32,256,0,0,0,495,751,0,0,0,0,751,0,0,0,0,751]

{"sheet":"FBPQ LR1","index":13,"n_rows":136,"n_cols":20,"rows_kept":136,"cut":false,"hidden":false,"merged":[[104,1,105,1],[104,2,105,2],[130,1,131,1],[130,2,131,2],[7,1,8,1],[7,2,8,2],[17,2,18,2],[50,2,51,2],[75,1,76,1],[75,2,76,2],[50,1,51,1],[17,1,18,1]]}
["Main Forecast Business Plan DPCR5",null,null,null,null,"Index"]
[]
["LR1 - Demand"]
[]
[]
[null,"Demand Totals"]
[]
[null,null,"Units","DPCR4",null,null,null,null,"DPCR5",null,null,null,null,null,"DPCR4",null,null,null,"DPCR5"]
[null,null,null,"2005/06","2006/07","2007/08","2008/09","2009/10","2010/11","2011/12","2012/13","2013/14","2014/15",null,"Actuals","Forecast","Total",null,"Forecast","% change"]
[null,"Gross direct costs","£m",54.23058330661577,38.837901397590365,91.674549507870751,60.626197243589743,65.682752663900402,67.834798536622969,68.956879235521228,73.553938336271187,77.272654105263157,81.348229883553415,null,184.74303421207688,126.30894990749015,311.05198411956701,null,368.96650009723197,0.18618918680616059]
[null,"Customer contributions directs","£m",47.9,34.199999999999996,74.400000000000006,47.7,49.6,50.599999999999994,53,56.9,60.2,63.6,null,156.5,97.300000000000011,253.79999999999998,null,284.3,0.12017336485421604]
[null,"Net (gross directs - customer contributions directs)","£m",6.3305833066157717,4.6379013975903689,17.274549507870745,12.926197243589741,16.082752663900401,17.234798536622975,15.956879235521228,16.653938336271189,17.072654105263155,17.748229883553414,null,28.243034212076886,29.008949907490141,57.251984119567027,null,84.66650009723196,0.47883957908622887]
[null,"Customer contributions indirects","£m",12.7,16.3,7.4,2.6,4.5,5.7,5.9,6.3,6.7,7,null,36.4,7.1,43.5,null,31.6,-0.27356321839080455]
[null,"Net (gross directs - customer contributions directs and indirects)","£m",-6.3694166933842276,-11.662098602409632,9.8745495078707446,10.326197243589741,11.582752663900401,11.534798536622976,10.056879235521228,10.353938336271188,10.372654105263155,10.748229883553414,null,-8.1569657879231148,21.90894990749014,13.751984119567027,null,53.066500097231959,2.8588249983306939]
[]
[null,"Demand trends"]
[]
[null,null,"Units","DPCR4",null,null,null,null,"DPCR5"]
[null,null,null,"2005/06","2006/07","2007/08","2008/09","2009/10","2010/11","2011/12","2012/13","2013/14","2014/15"]
[]
[null,"Estimated system maximum demand","MW",5142,5071.9969813739526,5165.0399372894481,5268.9998729061226,5307.952969828777,5347.0146139487642,5386.0263758444116,5424.9980447425833,5464.0472450535744,5503.044901736067]
[null,"Increase/Reduction in max demand","MW",29.88360892237084,-70.003018626047691,93.042955915494986,103.95993561667426,38.953096922654105,39.061644119987612,39.011761895647439,38.971668898171487,39.049200310991523,38.997656682492938]
[null,"Incremental increase in max demand due to new connections","MW",61.223229983654413,86.57903988436783,67.934097110053727,50.460195454410112,45.683369752276747,47.180403308129122,51.4786451649748,56.838552167498847,63.016083580318885,70.064539951820294]
[null,"Incremental reduction in max demand due to disconnections","MW",-31.339621061283573,-35.582058510415521,-23.691141194558739,-32.600259837735848,-34.230272829622642,-32.518759188141509,-29.266883269327359,-29.266883269327359,-29.266883269327359,-29.266883269327359]
[null,"Net change in max demand (not due to connections/disconnections)","MW",0,-121,48.8,86.1,27.5,24.4,16.8,11.4,5.3,-1.8]
[]
[null,"Estimated units distributed","GWh",30104.9,29508.87294690101,29665.403522061137,29133.779123498996,27786.10373262026,27637.566456374068,28143.049712027703,28347.761310734062,28504.659507964814,28539.062081679618]
[null,"Increase/Reduction in units distributed","GWh",0,-596.02705309899238,156.53057516012572,-531.62439856214178,-1347.6753908787359,-148.53727624619205,505.48325565363473,204.71159870635893,156.89819723075198,34.402573714804021]
[null,"Increase in units distributed due to generic background demand growth","GWh",0,-383.7,204.4,603.29999999999995,-364.49012888832817,-76.965111835070687,595.75834551226376,321.99765507629519,311.59367679810094,227.41184967661448]
[null,"Reduction in units distributed due to energy efficiency ","GWh",0,-60.209720749855599,-59.017893965620345,-59.33072492490443,-58.267515192878832,-55.572164411121364,-55.275089858628981,-56.286056369936247,-56.695479567348968,-57.009275961810467]
[null,"Units distributed offset by DG","GWh",0,0,0,0,-1,-16,-35,-61,-98,-136]
[null,"Units distributed offset by DSM","GWh",0,0,0,0,0,0,0,0,0,0]
[null,"Price impact on units distributed ","GWh",0,-152.11733234913683,11.14846912574607,-176.78738964835989,0,0,0,0,0,0]
[null,"Economic downturn effect on units distributed ","GWh",0,0,0,-898.80628398887745,-923.91774679752893,0,0,0,0,0]
[]
[null,"Estimated units distributed"]
[null,"LV","GWh",19523.266459129649,19016.929435043203,19286.227944554696,19229.074695564028,18354.625369378955,18249.277296070482,18625.949514491527,18839.156840147247,18968.934447947027,19043.032656457795]
[null,"HV","GWh",9858.5454833604635,9824.4309793401699,9669.4932603255311,9284.365647030776,8814.1175596317244,8770.9283566940048,8899.7393939265985,8891.2436669772342,8918.3642564082056,8878.6686216122453]
[null,"EHV (inc. 132kV)","GWh",723.04843243768596,667.58656842679875,709.64125757199179,620.31725384461356,617.33927655000002,617.33927655000002,617.33927655000002,617.33927655000002,617.33927655000002,617.33927655000002]
[null,"Total units distributed","GWh",30104.860374927797,29508.946982810172,29665.362462452216,29133.757596439416,27786.08220556068,27637.544929314488,28143.028184968123,28347.739783674482,28504.637980905234,28539.040554620038]
[]
[null,"Incremental increase in units distributed attributable to new connections"]
[null,"LV","MWh",203209.96209810363,253590.32384568275,247138.81248500801,162407.16110561299,149722.57225309103,153294.52527383162,166488.8696913333,183276.66213915555,202079.72137829248,223108.77229215583]
[null,"HV","MWh",196300.37897250504,316771.32806155022,192019.68535005167,167619.73170206739,148778.564486669,155157.10374795471,170132.01575159584,188455.3599958031,210209.41272066924,235525.00613990793]
[null,"EHV (inc. 132kV)","MWh",0,0,0,0,0,0,0,0,0,0]
[null,"Total increase in units distributed due to new connections","MWh",399510.3410706087,570361.65190723294,439158.49783505965,330026.89280768041,298501.13673976006,308451.62902178633,336620.88544292911,371732.02213495865,412289.13409896172,458633.77843206376]
[]
[]
[null,"Connections/disconnections volume"]
[]
[null,null,"Units","DPCR4",null,null,null,null,"DPCR5"]
[null,null,null,"2005/06","2006/07","2007/08","2008/09","2009/10","2010/11","2011/12","2012/13","2013/14","2014/15"]
[null,"Connections/Disconnections"]
[null,"Estimated number demand connections/disconnections at LV"]
[null,"IDNO connections","#",2,2,4,3.6,3.2,3.4,3.7,4.2,4.7,5.3]
[null,"Connections (excluding IDNOs)","#",34184,34314.800000000003,33331,27899.8,28372.2,30153.7,31706.1,34216.199999999997,36957.800000000003,39945.800000000003]
[null,"Disconnections","#",9236.7000000000007,10487.1,6982.5,9608.2000000000007,10088.700000000001,9584.2000000000007,8625.7999999999993,8625.7999999999993,8625.7999999999993,8625.7999999999993]
[null,"Estimated number demand connections/disconnections at HV"]
[null,"IDNO connections","#",0,6,10,9,8.1,8.5,9.4,10.4,11.6,13.1]
[null,"Connections (excluding IDNOs)","#",81,396,196,174.7,156.6,164,180.3,200,223.7,252.1]
[null,"Disconnections","#",93.3,105.9,70.5,97.1,101.9,96.8,87.1,87.1,87.1,87.1]
[null,"Estimated number demand connections/disconnections at EHV"]
[null,"IDNO connections","#",0,0,0,0,0,0,0,0,0,0]
[null,"Connections (excluding IDNOs)","#",0,0,0,0,0,0,0,0,0,0]
[null,"Disconnections","#",0,0,0,0,0,0,0,0,0,0]
[null,"Estimated number demand connections/disconnections at 132kV"]
[null,"IDNO connections","#",0,0,0,0,0,0,0,0,0,0]
[null,"Connections (excluding IDNOs)","#",0,0,0,0,0,0,0,0,0,0]
[null,"Disconnections","#",0,0,0,0,0,0,0,0,0,0]
[null,"Total number of demand connections","#",34267,34718.800000000003,33541,28087.1,28540.1,30329.600000000002,31899.5,34430.799999999996,37197.799999999996,40216.300000000003]
[null,"Total number of demand disconnections","#",9330,10593,7053,9705.3000000000011,10190.6,9681,8712.9,8712.9,8712.9,8712.9]
[]
[]
[null,"Customer specific demand investment"]
[]
[null,null,"Units","DPCR4",null,null,null,null,"DPCR5",null,null,null,null,null,"DPCR4",null,null,null,"DPCR5"]
[null,null,null,"2005/06","2006/07","2007/08","2008/09","2009/10","2010/11","2011/12","2012/13","2013/14","2014/15",null,"Actuals","Forecast","Total",null,"Forecast","% change"]
[null,"New connections & customer specific reinforcement:"]
[null,"Connections provided at LV"]
[null,"Sole use","£m",0,0,0,27.973664081196581,25.438403452282159,25.226996820354664,26.987440506563704,29.540530490847459,31.602534178947366,33.746650109843941,null,0,53.412067533478741,53.412067533478741,null,147.10415210655714,1.7541370124710507]
[null,"Shared","£m",43.165151786332039,30.970736755514366,58.955014971873361,15.828514551282051,12.222357908713693,12.1169039845798,12.997627596911197,14.274618760677967,15.256395810526316,16.32902424669868,null,133.09090351371978,28.050872459995745,161.14177597371551,null,70.974570399393954,-0.55955201579154179]
[null,"LV total","£m",43.165151786332039,30.970736755514366,58.955014971873361,43.802178632478629,37.660761360995849,37.343900804934464,39.985068103474902,43.815149251525426,46.85892998947368,50.075674356542621,null,133.09090351371978,81.462939993474478,214.55384350719427,null,218.07872250595108,1.6428878369818673E-2]
[null,"Connections provided at HV"]
[null,"Sole use","£m",0,0,0,5.6743731410256411,8.9431887136929458,9.7332507417116432,9.624197533590733,9.9129296949152543,10.104885536842104,10.391197247899159,null,0,14.617561854718588,14.617561854718588,null,49.766460754958892,2.4045664557180682]
[null,"Shared","£m",10.766365803519308,7.6679959169601482,32.121006465216958,11.149645470085469,19.078802589211616,20.75764698997687,19.347613598455599,19.825859389830509,20.30883857894737,20.881358279111645,null,50.555368185696416,30.228448059297087,80.783816244993503,null,101.12131683632199,0.25175216443911053]
[null,"HV total","£m",10.766365803519308,7.6679959169601482,32.121006465216958,16.824018611111111,28.02199130290456,30.490897731688513,28.971811132046334,29.738789084745761,30.413724115789474,31.272555527010802,null,50.555368185696416,44.846009914015667,95.401378099712076,null,150.88777759128089,0.58161004166601526]
[null,"Connections provided at EHV"]
[null,"Sole use","£m",0,0,0,0,0,0,0,0,0,0,null,0,0,0,null,0,"0"]
[null,"Shared","£m",0.29906571676442523,0.19916872511584802,0.59852807078044012,0,0,0,0,0,0,0,null,1.0967625126607135,0,1.0967625126607135,null,0,-1]
[null,"EHV total","£m",0.29906571676442523,0.19916872511584802,0.59852807078044012,0,0,0,0,0,0,0,null,1.0967625126607135,0,1.0967625126607135,null,0,-1]
[null,"Connections provided at 132kV"]
[null,"Sole use","£m",0,0,0,0,0,0,0,0,0,0,null,0,0,0,null,0,"0"]
[null,"Shared","£m",0,0,0,0,0,0,0,0,0,0,null,0,0,0,null,0,"0"]
[null,"132kV total","£m",0,0,0,0,0,0,0,0,0,0,null,0,0,0,null,0,"0"]
[]
[null,"Expenditure on DSM to avoid customer spec investment","£m",null,null,null,0,0,0,0,0,0,0,null,0,0,0,null,0,"0"]
[null,"Total inc. expenditure on DSM to avoid customer spec investment","£m",54.23058330661577,38.837901397590365,91.674549507870751,60.626197243589743,65.682752663900402,67.834798536622969,68.956879235521228,73.553938336271187,77.272654105263157,81.348229883553415,null,184.74303421207688,126.30894990749015,311.05198411956701,null,368.96650009723197,0.18618918680616059]
[]
[null,"Expenditure avoided due to DG","£m",null,null,null,0,0,0,0,0,0,0,null,0,0,0,null,0,"0"]
[null,"Expenditure avoided due to DSM","£m",null,null,null,0,0,0,0,0,0,0,null,0,0,0,null,0,"0"]
[]
[]
[null,"Customer contributions - customer specific demand investment"]
[]
[null,null,"Units","DPCR4",null,null,null,null,"DPCR5",null,null,null,null,null,"DPCR4",null,null,null,"DPCR5"]
[null,null,null,"2005/06","2006/07","2007/08","2008/09","2009/10","2010/11","2011/12","2012/13","2013/14","2014/15",null,"Actuals","Forecast","Total",null,"Forecast","% change"]
[null,"Customer contributions (directs) for connections at LV"]
[null,"Sole use","£m",0,0,0,28.1,25.6,25.4,27.2,29.8,31.9,34.1,null,0,53.7,53.7,null,148.39999999999998,1.763500931098696]
[null,"Shared ","£m",38.1,27.4,49.1,10.4,9.5,9.4,10.1,11,11.8,12.6,null,114.6,19.899999999999999,134.5,null,54.9,-0.59182156133828989]
[null,"LV total","£m",38.1,27.4,49.1,38.5,35.1,34.799999999999997,37.299999999999997,40.799999999999997,43.7,46.7,null,114.6,73.599999999999994,188.2,null,203.3,8.0233793836344436E-2]
[null,"Customer contributions (directs) for connections at HV"]
[null,"Sole use","£m",0,0,0,5.7,9,9.8000000000000007,9.6999999999999993,10,10.199999999999999,10.5,null,0,14.7,14.7,null,50.2,2.4149659863945581]
[null,"Shared ","£m",9.5,6.8,24.9,3.5,5.5,6,6,6.1,6.3,6.4,null,41.2,9,50.2,null,30.800000000000004,-0.38645418326693221]
[null,"HV total","£m",9.5,6.8,24.9,9.1999999999999993,14.5,15.8,15.7,16.100000000000001,16.5,16.899999999999999,null,41.2,23.7,64.900000000000006,null,81,0.24807395993836662]
[null,"Customer contributions (directs) for connections at EHV"]
[null,"Sole use","£m",0,0,0,0,0,0,0,0,0,0,null,0,0,0,null,0,"0"]
[null,"Shared ","£m",0.3,0,0.4,0,0,0,0,0,0,0,null,0.7,0,0.7,null,0,-1]
[null,"EHV total","£m",0.3,0,0.4,0,0,0,0,0,0,0,null,0.7,0,0.7,null,0,-1]
[null,"Customer contributions (directs) for connections at 132kV"]
[null,"Sole use","£m",0,0,0,0,0,0,0,0,0,0,null,0,0,0,null,0,"0"]
[null,"Shared ","£m",0,0,0,0,0,0,0,0,0,0,null,0,0,0,null,0,"0"]
[null,"132kV total","£m",0,0,0,0,0,0,0,0,0,0,null,0,0,0,null,0,"0"]
[]
[null,"Customer contributions (directs) total","£m",47.9,34.199999999999996,74.400000000000006,47.7,49.6,50.599999999999994,53,56.9,60.2,63.6,null,156.5,97.300000000000011,253.79999999999998,null,284.3,0.12017336485421604]
[null,"Customer contributions (indirects)","£m",12.7,16.3,7.4,2.6,4.5,5.7,5.9,6.3,6.7,7,null,36.4,7.1,43.5,null,31.6,-0.27356321839080455]
[null,"Customer contributions total","£m",60.599999999999994,50.5,81.800000000000011,50.300000000000004,54.1,56.3,58.9,63.199999999999996,66.900000000000006,70.599999999999994,null,192.9,104.4,297.3,null,315.89999999999998,6.2563067608476172E-2]
[]
[null,"Total inc. exp on DSM to avoid customer spec investment (net of cust cont)","£m",-6.369416693384224,-11.662098602409635,9.8745495078707393,10.326197243589739,11.582752663900401,11.534798536622972,10.05687923552123,10.353938336271192,10.372654105263152,10.748229883553421,null,-8.1569657879231201,21.90894990749014,13.75198411956702,null,53.066500097231966,2.8588249983306961]
[]
[]
[null,null,"Units","DPCR4",null,null,null,null,"DPCR5",null,null,null,null,null,"DPCR4",null,null,null,"DPCR5"]
[null,null,null,"2005/06","2006/07","2007/08","2008/09","2009/10","2010/11","2011/12","2012/13","2013/14","2014/15",null,"Actuals","Forecast","Total",null,"Forecast","% change"]
[null,"Unapportioned part of shared LV","£m",5.0651517863320379,3.5707367555143676,9.8550149718733593,5.428514551282051,2.7223579087136933,2.7169039845797993,2.8976275969111978,3.2746187606779671,3.4563958105263151,3.72902424669868,null,18.490903513719765,8.1508724599957443,26.641775973715507,null,16.074570399393959,-0.3966404336087444]
[null,"Unapportioned part of shared HV","£m",1.2663658035193084,0.86799591696014833,7.2210064652169592,7.6496454700854688,13.578802589211616,14.75764698997687,13.347613598455599,13.725859389830509,14.008838578947369,14.481358279111644,null,9.3553681856964168,21.228448059297087,30.583816244993503,null,70.321316836321984,1.2992983044695547]
[null,"Unapportioned part of shared EHV","£m",-9.3428323557476212E-4,0.19916872511584802,0.1985280707804401,0,0,0,0,0,0,0,null,0.39676251266071338,0,0.39676251266071338,null,0,-1]
[null,"Unapportioned part of shared 132kV","£m",0,0,0,0,0,0,0,0,0,0,null,0,0,0,null,0,"0"]

{"sheet":"FBPQ LR1 - V5 opt3","index":14,"n_rows":266,"n_cols":20,"rows_kept":266,"cut":false,"hidden":false,"merged":[[78,1,79,1],[78,2,79,2],[109,1,110,1],[109,2,110,2],[142,1,143,1],[142,2,143,2],[7,1,8,1],[7,2,8,2],[25,2,26,2],[25,1,26,1],[47,1,48,1],[47,2,48,2]]}
["Main Forecast Business Plan DPCR5"]
[]
["LR1a - Demand - metered connections"]
[]
[]
[null,"Demand Totals - Table 1"]
[]
[null,null,"Units","DPCR4",null,null,null,null,"DPCR5",null,null,null,null,null,"DPCR4",null,null,null,"DPCR5"]
[null,null,null,"2005/06","2006/07","2007/08","2008/09","2009/10","2010/11","2011/12","2012/13","2013/14","2014/15",null,"Actuals","Forecast","Total",null,"Forecast","% change"]
[null,"Gross all connections costs","£m",{"$f":"SUM(D178,D217,D240)","v":0},0,0,0,0,0,0,0,0,0,null,{"$f":"SUM(D10:G10)","v":0},{"$f":"SUM(H10)","v":0},{"$f":"SUM(D10:H10)","v":0},null,{"$f":"SUM(I10:M10)","v":0},{"$f":"IF(Q10<>0,(S10-Q10)/Q10,\"0\")","v":"0"}]
[null,"Gross direct connections costs subject to apportionment rule","£m",{"$f":"D240","v":0},0,0,0,0,0,0,0,0,0,null,0,0,0,null,0,"0"]
[null,"Customer contributions excluding margins","£m",{"$f":"D263","v":0},0,0,0,0,0,0,0,0,0,null,0,0,0,null,0,"0"]
[null,"Net (gross directs subject to apportionment rule - customer contributions directs)","£m",{"$f":"D11-D12","v":0},0,0,0,0,0,0,0,0,0,null,0,0,0,null,0,"0"]
[null,"DUOS funded related party margin","£m",null,null,null,null,null,null,null,null,null,0.3,null,0,0,0,null,0.3,"0"]
[null,"Net (gross directs subject to apportionment rule - customer contributions directs + DUOS funded related party margin)","£m",{"$f":"D13+D14","v":0},0,0,0,0,0,0,0,0,0.3,null,0,0,0,null,0.3,"0"]
[null,"Check",null,{"$f":"IF(D13-SUM(D31,D35,D39,D43)=0,\"OK\",\"ERROR\")","v":"OK"},"OK","OK","OK","OK","OK","OK","OK","OK","OK"]
[]
[null,null,null,"DPCR4",null,null,null,null,"DPCR5",null,null,null,null,null,"DPCR4",null,null,null,"DPCR5"]
[null,null,"Units","2005/06","2006/07","2007/08","2008/09","2009/10","2010/11","2011/12","2012/13","2013/14","2014/15",null,"Actuals","Forecast","Total",null,"Forecast","% change"]
[null,"Pensions with total gross direct connections costs","£m",null,null,null,null,null,null,null,null,null,null,null,{"$f":"SUM(D20:G20)","v":0},{"$f":"SUM(H20)","v":0},{"$f":"SUM(D20:H20)","v":0},null,{"$f":"SUM(I20:M20)","v":0},{"$f":"IF(Q20<>0,(S20-Q20)/Q20,\"0\")","v":"0"}]
[null,"Pensions with direct connections costs subject to apportionment rule","£m",null,null,null,null,null,null,null,null,null,null,null,{"$f":"SUM(D21:G21)","v":0},{"$f":"SUM(H21)","v":0},{"$f":"SUM(D21:H21)","v":0},null,{"$f":"SUM(I21:M21)","v":0},{"$f":"IF(Q21<>0,(S21-Q21)/Q21,\"0\")","v":"0"}]
[null,"Total","£m",{"$f":"D20+D21","v":0},0,0,0,0,0,0,0,0,0,null,{"$f":"SUM(D22:G22)","v":0},{"$f":"SUM(H22)","v":0},{"$f":"SUM(D22:H22)","v":0},null,{"$f":"SUM(I22:M22)","v":0},{"$f":"IF(Q22<>0,(S22-Q22)/Q22,\"0\")","v":"0"}]
[]
[null,"Connections expenditure recovered via DUoS - Table 2"]
[]
[null,null,"Units","DPCR4",null,null,null,null,"DPCR5",null,null,null,null,null,"DPCR4",null,null,null,"DPCR5"]
[null,null,null,"2005/06","2006/07","2007/08","2008/09","2009/10","2010/11","2011/12","2012/13","2013/14","2014/15",null,"Actuals","Forecast","Total",null,"Forecast","% change"]
[null,"Customer contributions (directs) for connections at LV"]
[null,"Small scale LV domestic and one-off commercial","£m",null,null,null,null,null,{"$f":"I225-I248","v":0},0,0,0,0]
[null,"All other LV (with only LV work)","£m",null,null,null,null,null,0,0,0,0,0]
[null,"LV total","£m",{"$f":"D227-D250","v":0},{"$f":"E227-E250","v":0},{"$f":"F227-F250","v":0},{"$f":"G227-G250","v":0},{"$f":"H227-H250","v":0},{"$f":"SUM(I29:I30)","v":0},{"$f":"SUM(J29:J30)","v":0},{"$f":"SUM(K29:K30)","v":0},{"$f":"SUM(L29:L30)","v":0},{"$f":"SUM(M29:M30)","v":0},null,{"$f":"SUM(D31:G31)","v":0},{"$f":"SUM(H31)","v":0},{"$f":"SUM(D31:H31)","v":0},null,{"$f":"SUM(I31:M31)","v":0},{"$f":"IF(Q31<>0,(S31-Q31)/Q31,\"0\")","v":"0"}]
[null,"Customer contributions (directs) for connections at HV"]
[null,"LV end connections involving HV work","£m",null,null,null,null,null,{"$f":"I229-I252","v":0},0,0,0,0]
[null,"HV end connections involving only HV work","£m",null,null,null,null,null,0,0,0,0,0]
[null,"HV total","£m",{"$f":"D231-D254","v":0},{"$f":"E231-E254","v":0},{"$f":"F231-F254","v":0},{"$f":"G231-G254","v":0},{"$f":"H231-H254","v":0},{"$f":"SUM(I33:I34)","v":0},{"$f":"SUM(J33:J34)","v":0},{"$f":"SUM(K33:K34)","v":0},{"$f":"SUM(L33:L34)","v":0},{"$f":"SUM(M33:M34)","v":0},null,{"$f":"SUM(D35:G35)","v":0},{"$f":"SUM(H35)","v":0},{"$f":"SUM(D35:H35)","v":0},null,{"$f":"SUM(I35:M35)","v":0},{"$f":"IF(Q35<>0,(S35-Q35)/Q35,\"0\")","v":"0"}]
[null,"Customer contributions (directs) for connections at EHV"]
[null,"HV end connections involving EHV work","£m",null,null,null,null,null,{"$f":"I233-I256","v":0},0,0,0,0]
[null,"EHV end connections involving only EHV work","£m",null,null,null,null,null,0,0,0,0,0]
[null,"EHV total","£m",{"$f":"D235-D258","v":0},{"$f":"E235-E258","v":0},{"$f":"F235-F258","v":0},{"$f":"G235-G258","v":0},{"$f":"H235-H258","v":0},{"$f":"SUM(I37:I38)","v":0},{"$f":"SUM(J37:J38)","v":0},{"$f":"SUM(K37:K38)","v":0},{"$f":"SUM(L37:L38)","v":0},{"$f":"SUM(M37:M38)","v":0},null,{"$f":"SUM(D39:G39)","v":0},{"$f":"SUM(H39)","v":0},{"$f":"SUM(D39:H39)","v":0},null,{"$f":"SUM(I39:M39)","v":0},{"$f":"IF(Q39<>0,(S39-Q39)/Q39,\"0\")","v":"0"}]
[null,"Customer contributions (directs) for connections at 132kV"]
[null," HV or EHV connections involving 132kV work","£m",null,null,null,null,null,{"$f":"I237-I260","v":0},0,0,0,0]
[null,"132kV end connections involving only 132kV work","£m",null,null,null,null,null,0,0,0,0,0]
[null,"132kV total","£m",{"$f":"D239-D262","v":0},{"$f":"E239-E262","v":0},{"$f":"F239-F262","v":0},{"$f":"G239-G262","v":0},{"$f":"H239-H262","v":0},{"$f":"SUM(I41:I42)","v":0},{"$f":"SUM(J41:J42)","v":0},{"$f":"SUM(K41:K42)","v":0},{"$f":"SUM(L41:L42)","v":0},{"$f":"SUM(M41:M42)","v":0},null,{"$f":"SUM(D43:G43)","v":0},{"$f":"SUM(H43)","v":0},{"$f":"SUM(D43:H43)","v":0},null,{"$f":"SUM(I43:M43)","v":0},{"$f":"IF(Q43<>0,(S43-Q43)/Q43,\"0\")","v":"0"}]
[]
[]
[null,"Metered connections volume - Table 3"]
[]
[null,null,"Units","DPCR4",null,null,null,null,"DPCR5"]
[null,null,null,"2005/06","2006/07","2007/08","2008/09","2009/10","2010/11","2011/12","2012/13","2013/14","2014/15"]
[null,"Metered connections"]
[null,"Estimated number demand connections at LV"]
[null,"IDNO connections","#",{"$f":"D83+D114","v":0},0,0,0,0,0,0,0,0,0]
[null,"Adopted connections",null,{"$f":"D84+D115","v":0},0,0,0,0,0,0,0,0,0]
[null,"Small scale LV domestic and one-off commercial connections",null,null,null,null,null,null,{"$f":"I85+I116","v":0},0,0,0,0]
[null,"All other LV connections (with only LV work)","#",null,null,null,null,null,0,0,0,0,0]
[null,"DNO total LV",null,{"$f":"D87+D118","v":0},{"$f":"E87+E118","v":0},{"$f":"F87+F118","v":0},{"$f":"G87+G118","v":0},{"$f":"H87+H118","v":0},0,0,0,0,0]
[null,"Estimated number demand connections at HV"]
[null,"IDNO connections","#",{"$f":"D89+D120","v":0},0,0,0,0,0,0,0,0,0]
[null,"Adopted connections",null,{"$f":"D90+D121","v":0},0,0,0,0,0,0,0,0,0]
[null,"LV end connections involving HV work",null,null,null,null,null,null,{"$f":"I91+I122","v":0},0,0,0,0]
[null,"HV end connections involving only HV work","#",null,null,null,null,null,0,0,0,0,0]
[null,"DNO total HV",null,{"$f":"D93+D124","v":0},{"$f":"E93+E124","v":0},{"$f":"F93+F124","v":0},{"$f":"G93+G124","v":0},{"$f":"H93+H124","v":0},0,0,0,0,0]
[null,"Estimated number demand connections at EHV"]
[null,"IDNO connections","#",{"$f":"D95+D126","v":0},0,0,0,0,0,0,0,0,0]
[null,"Adopted connections",null,{"$f":"D96+D127","v":0},0,0,0,0,0,0,0,0,0]
[null,"HV end connections involving EHV work",null,null,null,null,null,null,{"$f":"I97+I128","v":0},0,0,0,0]
[null,"EHV end connections involving only EHV work","#",null,null,null,null,null,0,0,0,0,0]
[null,"DNO total EHV",null,{"$f":"D99+D130","v":0},{"$f":"E99+E130","v":0},{"$f":"F99+F130","v":0},{"$f":"G99+G130","v":0},{"$f":"H99+H130","v":0},0,0,0,0,0]
[null,"Estimated number demand connections at 132kV"]
[null,"IDNO connections","#",{"$f":"D101+D132","v":0},0,0,0,0,0,0,0,0,0]
[null,"Adopted connections",null,{"$f":"D102+D133","v":0},0,0,0,0,0,0,0,0,0]
[null," HV or EHV connections involving 132kV work",null,null,null,null,null,null,{"$f":"I103+I134","v":0},0,0,0,0]
[null,"132kV end connections involving only 132kV work","#",null,null,null,null,null,0,0,0,0,0]
[null,"DNO total 132kV",null,{"$f":"D105+D136","v":0},{"$f":"E105+E136","v":0},{"$f":"F105+F136","v":0},{"$f":"G105+G136","v":0},{"$f":"H105+H136","v":0},0,0,0,0,0]
[null,"Total number of demand connections","#",{"$f":"SUM(D52:D55,D58:D61,D64:D67,D70:D73)","v":0},0,0,0,0,0,0,0,0,0]
[]
[null,"Metered connections volume - Sole use connections where there is no associated expenditure subject to the apportionment rule - Table 4"]
[]
[null,null,"Units","DPCR4",null,null,null,null,"DPCR5"]
[null,null,null,"2005/06","2006/07","2007/08","2008/09","2009/10","2010/11","2011/12","2012/13","2013/14","2014/15"]
[null,"Metered connections"]
[null,"Estimated number demand connections at LV"]
[null,"IDNO connections","#"]
[null,"Adopted connections"]
[null,"Small scale LV domestic and one-off commercial connections"]
[null,"All other LV connections (with only LV work)","#"]
[null,"DNO total LV",null,null,null,null,null,null,{"$f":"SUM(I85:I86)","v":0},{"$f":"SUM(J85:J86)","v":0},{"$f":"SUM(K85:K86)","v":0},{"$f":"SUM(L85:L86)","v":0},{"$f":"SUM(M85:M86)","v":0}]
[null,"Estimated number demand connections with HV work"]
[null,"IDNO connections","#"]
[null,"Adopted connections"]
[null,"LV end connections involving HV work"]
[null,"HV end connections involving only HV work","#"]
[null,"DNO total HV",null,null,null,null,null,null,{"$f":"SUM(I91:I92)","v":0},{"$f":"SUM(J91:J92)","v":0},{"$f":"SUM(K91:K92)","v":0},{"$f":"SUM(L91:L92)","v":0},{"$f":"SUM(M91:M92)","v":0}]
[null,"Estimated number demand connections with EHV work"]
[null,"IDNO connections","#"]
[null,"Adopted connections"]
[null,"HV end connections involving EHV work"]
[null,"EHV end connections involving only EHV work","#"]
[null,"DNO total EHV",null,null,null,null,null,null,{"$f":"SUM(I97:I98)","v":0},{"$f":"SUM(J97:J98)","v":0},{"$f":"SUM(K97:K98)","v":0},{"$f":"SUM(L97:L98)","v":0},{"$f":"SUM(M97:M98)","v":0}]
[null,"Estimated number demand connections with 132kV work"]
[null,"IDNO connections","#"]
[null,"Adopted connections"]
[null," HV or EHV connections involving 132kV work"]
[null,"132kV end connections involving only 132kV work","#"]
[null,"DNO total 132kV",null,null,null,null,null,null,{"$f":"SUM(I103:I104)","v":0},{"$f":"SUM(J103:J104)","v":0},{"$f":"SUM(K103:K104)","v":0},{"$f":"SUM(L103:L104)","v":0},{"$f":"SUM(M103:M104)","v":0}]
[null,"Total number of demand connections","#",{"$f":"SUM(D83:D84,D87,D89:D90,D93,D95:D96,D99,D101:D102,D105)","v":0},0,0,0,0,0,0,0,0,0]
[]
[null,"Metered connections volume - Connections where there is associated expenditure subject to the apportionment rule - Table 5"]
[]
[null,null,"Units","DPCR4",null,null,null,null,"DPCR5"]
[null,null,null,"2005/06","2006/07","2007/08","2008/09","2009/10","2010/11","2011/12","2012/13","2013/14","2014/15"]
[null,"Metered connections"]
[null,"Estimated number demand connections at LV"]
[null,"IDNO connections","#"]
[null,"Adopted connections"]
[null,"Small scale LV domestic and one-off commercial connections"]
[null,"All other LV connections (with only LV work)","#"]
[null,"DNO total LV",null,null,null,null,null,null,{"$f":"SUM(I116:I117)","v":0},{"$f":"SUM(J116:J117)","v":0},{"$f":"SUM(K116:K117)","v":0},{"$f":"SUM(L116:L117)","v":0},{"$f":"SUM(M116:M117)","v":0}]
[null,"Estimated number demand connections with HV work"]
[null,"IDNO connections","#"]
[null,"Adopted connections"]
[null,"LV end connections involving HV work"]
[null,"HV end connections involving only HV work","#"]
[null,"DNO total HV",null,null,null,null,null,null,{"$f":"SUM(I122:I123)","v":0},{"$f":"SUM(J122:J123)","v":0},{"$f":"SUM(K122:K123)","v":0},{"$f":"SUM(L122:L123)","v":0},{"$f":"SUM(M122:M123)","v":0}]
[null,"Estimated number demand connections with EHV work"]
[null,"IDNO connections","#"]
[null,"Adopted connections"]
[null,"HV end connections involving EHV work"]
[null,"EHV end connections involving only EHV work","#"]
[null,"DNO total EHV",null,null,null,null,null,null,{"$f":"SUM(I128:I129)","v":0},{"$f":"SUM(J128:J129)","v":0},{"$f":"SUM(K128:K129)","v":0},{"$f":"SUM(L128:L129)","v":0},{"$f":"SUM(M128:M129)","v":0}]
[null,"Estimated number demand connections with 132kV work"]
[null,"IDNO connections","#"]
[null,"Adopted connections"]
[null," HV or EHV connections involving 132kV work"]
[null,"132kV end connections involving only 132kV work","#"]
[null,"DNO total 132kV",null,null,null,null,null,null,{"$f":"SUM(I134:I135)","v":0},{"$f":"SUM(J134:J135)","v":0},{"$f":"SUM(K134:K135)","v":0},{"$f":"SUM(L134:L135)","v":0},{"$f":"SUM(M134:M135)","v":0}]
[null,"Total number of demand connections","#",{"$f":"SUM(D114:D115,D118,D120:D121,D124,D126:D127,D130,D132:D133,D136)","v":0},0,0,0,0,0,0,0,0,0]
[]
[]
[]
[null,"Customer specific demand investment - Sole use expenditure where there is no associated expenditure subject to the apportionment rule - Table 6"]
[]
[null,null,"Units","DPCR4",null,null,null,null,"DPCR5",null,null,null,null,null,"DPCR4",null,null,null,"DPCR5"]
[null,null,null,"2005/06","2006/07","2007/08","2008/09","2009/10","2010/11","2011/12","2012/13","2013/14","2014/15",null,"Actuals","Forecast","Total",null,"Forecast","% change"]
[null,"New connections & customer specific reinforcement:"]
[null,"Connections provided at LV"]
[null,"Small scale LV domestic and one-off commercial","£m"]
[null,"Ratio - small scale LV domestic and one-off commercial - non-contestable","%"]
[null,"Ratio - small scale LV domestic and one-off commercial - contestable","%",null,null,null,null,null,{"$f":"1-I148","v":1},{"$f":"1-J148","v":1},{"$f":"1-K148","v":1},{"$f":"1-L148","v":1},{"$f":"1-M148","v":1}]
[null,"All other LV (with only LV work)","£m"]
[null,"Ratio - all other LV (with only LV work) - non-contestable","%"]
[null,"Ratio - all other LV (with only LV work) - contestable","%",null,null,null,null,null,{"$f":"1-I151","v":1},{"$f":"1-J151","v":1},{"$f":"1-K151","v":1},{"$f":"1-L151","v":1},{"$f":"1-M151","v":1}]
[null,"LV total","£m",null,null,null,null,null,{"$f":"SUM(I147,I150)","v":0},{"$f":"SUM(J147,J150)","v":0},{"$f":"SUM(K147,K150)","v":0},{"$f":"SUM(L147,L150)","v":0},{"$f":"SUM(M147,M150)","v":0},null,{"$f":"SUM(D153:G153)","v":0},{"$f":"SUM(H153)","v":0},{"$f":"SUM(D153:H153)","v":0},null,{"$f":"SUM(I153:M153)","v":0},{"$f":"IF(Q153<>0,(S153-Q153)/Q153,\"0\")","v":"0"}]
[null,"Connections with HV work"]
[null,"LV end connections involving HV work","£m"]
[null,"Ratio - LV end connections involving HV work - non-contestable","%"]
[null,"Ratio - LV end connections involving HV work - contestable","%",null,null,null,null,null,{"$f":"1-I156","v":1},{"$f":"1-J156","v":1},{"$f":"1-K156","v":1},{"$f":"1-L156","v":1},{"$f":"1-M156","v":1}]
[null,"HV end connections involving only HV work","£m"]
[null,"Ratio - HV end connections involving only HV work - non-contestable","%"]
[null,"Ratio - HV end connections involving only HV work - contestable","%",null,null,null,null,null,{"$f":"1-I159","v":1},{"$f":"1-J159","v":1},{"$f":"1-K159","v":1},{"$f":"1-L159","v":1},{"$f":"1-M159","v":1}]
[null,"HV total","£m",null,null,null,null,null,{"$f":"SUM(I155,I158)","v":0},{"$f":"SUM(J155,J158)","v":0},{"$f":"SUM(K155,K158)","v":0},{"$f":"SUM(L155,L158)","v":0},{"$f":"SUM(M155,M158)","v":0},null,{"$f":"SUM(D161:G161)","v":0},{"$f":"SUM(H161)","v":0},{"$f":"SUM(D161:H161)","v":0},null,{"$f":"SUM(I161:M161)","v":0},{"$f":"IF(Q161<>0,(S161-Q161)/Q161,\"0\")","v":"0"}]
[null,"Connections with EHV work"]
[null,"HV end connections involving EHV work","£m"]
[null,"Ratio - HV end connections involving EHV work - non-contestable","%"]
[null,"Ratio - HV end connections involving EHV work - contestable","%",null,null,null,null,null,{"$f":"1-I164","v":1},{"$f":"1-J164","v":1},{"$f":"1-K164","v":1},{"$f":"1-L164","v":1},{"$f":"1-M164","v":1}]
[null,"EHV end connections involving only EHV work","£m"]
[null,"Ratio - EHV end connections involving only EHV work - non-contestable","%"]
[null,"Ratio - EHV end connections involving only EHV work - contestable","%",null,null,null,null,null,{"$f":"1-I167","v":1},{"$f":"1-J167","v":1},{"$f":"1-K167","v":1},{"$f":"1-L167","v":1},{"$f":"1-M167","v":1}]
[null,"EHV total","£m",null,null,null,null,null,{"$f":"SUM(I163,I166)","v":0},{"$f":"SUM(J163,J166)","v":0},{"$f":"SUM(K163,K166)","v":0},{"$f":"SUM(L163,L166)","v":0},{"$f":"SUM(M163,M166)","v":0},null,{"$f":"SUM(D169:G169)","v":0},{"$f":"SUM(H169)","v":0},{"$f":"SUM(D169:H169)","v":0},null,{"$f":"SUM(I169:M169)","v":0},{"$f":"IF(Q169<>0,(S169-Q169)/Q169,\"0\")","v":"0"}]
[null,"Connections with 132kV work"]
[null," HV or EHV connections involving 132kV work","£m"]
[null,"Ratio - HV or EHV connections involving 132kV work - non-contestable","%"]
[null,"Ratio - HV or EHV connections involving 132kV work - contestable","%",null,null,null,null,null,{"$f":"1-I172","v":1},{"$f":"1-J172","v":1},{"$f":"1-K172","v":1},{"$f":"1-L172","v":1},{"$f":"1-M172","v":1}]
[null,"132kV end connections involving only 132kV work","£m"]
[null,"Ratio - 132kV end connections involving only 132kV work - non-contestable","%"]
[null,"Ratio - 132kV end connections involving only 132kV work - contestable","%",null,null,null,null,null,{"$f":"1-I175","v":1},{"$f":"1-J175","v":1},{"$f":"1-K175","v":1},{"$f":"1-L175","v":1},{"$f":"1-M175","v":1}]
[null,"132kV total","£m",null,null,null,null,null,{"$f":"SUM(I171,I174)","v":0},{"$f":"SUM(J171,J174)","v":0},{"$f":"SUM(K171,K174)","v":0},{"$f":"SUM(L171,L174)","v":0},{"$f":"SUM(M171,M174)","v":0},null,{"$f":"SUM(D177:G177)","v":0},{"$f":"SUM(H177)","v":0},{"$f":"SUM(D177:H177)","v":0},null,{"$f":"SUM(I177:M177)","v":0},{"$f":"IF(Q177<>0,(S177-Q177)/Q177,\"0\")","v":"0"}]
[null,"Total sole use expenditure where there is no expenditure subject to the apportionment rule",null,{"$f":"SUM(D153,D161,D169,D177)","v":0},0,0,0,0,0,0,0,0,0,null,{"$f":"SUM(O153,O161,O169,O177)","v":0},{"$f":"SUM(P153,P161,P169,P177)","v":0},{"$f":"SUM(Q153,Q161,Q169,Q177)","v":0},null,{"$f":"SUM(S153,S161,S169,S177)","v":0},{"$f":"IF(Q178<>0,(S178-Q178)/Q178,\"0\")","v":"0"}]
[]
[null,"Customer specific demand investment - sole use expenditure where there is also associated expenditure subject to the apportionment rule - Table 7"]
[]
[null,null,null,"DPCR4",null,null,null,null,"DPCR5",null,null,null,null,null,"DPCR4",null,null,null,"DPCR5"]
[null,"Customer specific demand investment","Units","2005/06","2006/07","2007/08","2008/09","2009/10","2010/11","2011/12","2012/13","2013/14","2014/15",null,"Actuals","Forecast","Total",null,"Forecast","% change"]
[null,"New connections & customer specific reinforcement:"]
[null,"Connections provided at LV"]
[null,"Small scale LV domestic and one-off commercial","£m"]
[null,"Ratio - small scale LV domestic and one-off commercial - non-contestable","%"]
[null,"Ratio - small scale LV domestic and one-off commercial - contestable","%",null,null,null,null,null,{"$f":"1-I187","v":1},{"$f":"1-J187","v":1},{"$f":"1-K187","v":1},{"$f":"1-L187","v":1},{"$f":"1-M187","v":1}]
[null,"All other LV (with only LV work)","£m"]
[null,"Ratio - all other LV (with only LV work) - non-contestable","%"]
[null,"Ratio - all other LV (with only LV work) - contestable","%",null,null,null,null,null,{"$f":"1-I190","v":1},{"$f":"1-J190","v":1},{"$f":"1-K190","v":1},{"$f":"1-L190","v":1},{"$f":"1-M190","v":1}]
[null,"LV total","£m",null,null,null,null,null,{"$f":"SUM(I186,I189)","v":0},{"$f":"SUM(J186,J189)","v":0},{"$f":"SUM(K186,K189)","v":0},{"$f":"SUM(L186,L189)","v":0},{"$f":"SUM(M186,M189)","v":0},null,{"$f":"SUM(D192:G192)","v":0},{"$f":"SUM(H192)","v":0},{"$f":"SUM(D192:H192)","v":0},null,{"$f":"SUM(I192:M192)","v":0},{"$f":"IF(Q192<>0,(S192-Q192)/Q192,\"0\")","v":"0"}]
[null,"Connections with HV work"]
[null,"LV end connections involving HV work","£m"]
[null,"Ratio - LV end connections involving HV work - non-contestable","%"]
[null,"Ratio - LV end connections involving HV work - contestable","%",null,null,null,null,null,{"$f":"1-I195","v":1},{"$f":"1-J195","v":1},{"$f":"1-K195","v":1},{"$f":"1-L195","v":1},{"$f":"1-M195","v":1}]
[null,"HV end connections involving only HV work","£m"]
[null,"Ratio - HV end connections involving only HV work - non-contestable","%"]
[null,"Ratio - HV end connections involving only HV work - contestable","%",null,null,null,null,null,{"$f":"1-I198","v":1},{"$f":"1-J198","v":1},{"$f":"1-K198","v":1},{"$f":"1-L198","v":1},{"$f":"1-M198","v":1}]
[null,"HV total","£m",null,null,null,null,null,{"$f":"SUM(I194,I197)","v":0},{"$f":"SUM(J194,J197)","v":0},{"$f":"SUM(K194,K197)","v":0},{"$f":"SUM(L194,L197)","v":0},{"$f":"SUM(M194,M197)","v":0},null,{"$f":"SUM(D200:G200)","v":0},{"$f":"SUM(H200)","v":0},{"$f":"SUM(D200:H200)","v":0},null,{"$f":"SUM(I200:M200)","v":0},{"$f":"IF(Q200<>0,(S200-Q200)/Q200,\"0\")","v":"0"}]
[null,"Connections with EHV work"]
[null,"HV end connections involving EHV work","£m"]
[null,"Ratio - HV end connections involving EHV work - non-contestable","%"]
[null,"Ratio - HV end connections involving EHV work - contestable","%",null,null,null,null,null,{"$f":"1-I203","v":1},{"$f":"1-J203","v":1},{"$f":"1-K203","v":1},{"$f":"1-L203","v":1},{"$f":"1-M203","v":1}]
[null,"EHV end connections involving only EHV work","£m"]
[null,"Ratio - EHV end connections involving only EHV work - non-contestable","%"]
[null,"Ratio - EHV end connections involving only EHV work - contestable","%",null,null,null,null,null,{"$f":"1-I206","v":1},{"$f":"1-J206","v":1},{"$f":"1-K206","v":1},{"$f":"1-L206","v":1},{"$f":"1-M206","v":1}]
[null,"EHV total","£m",null,null,null,null,null,{"$f":"SUM(I202,I205)","v":0},{"$f":"SUM(J202,J205)","v":0},{"$f":"SUM(K202,K205)","v":0},{"$f":"SUM(L202,L205)","v":0},{"$f":"SUM(M202,M205)","v":0},null,{"$f":"SUM(D208:G208)","v":0},{"$f":"SUM(H208)","v":0},{"$f":"SUM(D208:H208)","v":0},null,{"$f":"SUM(I208:M208)","v":0},{"$f":"IF(Q208<>0,(S208-Q208)/Q208,\"0\")","v":"0"}]
[null,"Connections with 132kV work"]
[null," HV or EHV connections involving 132kV work","£m"]
[null,"Ratio - HV or EHV connections involving 132kV work - non-contestable","%"]
[null,"Ratio - HV or EHV connections involving 132kV work - contestable","%",null,null,null,null,null,{"$f":"1-I211","v":1},{"$f":"1-J211","v":1},{"$f":"1-K211","v":1},{"$f":"1-L211","v":1},{"$f":"1-M211","v":1}]
[null,"132kV end connections involving only 132kV work","£m"]
[null,"Ratio - 132kV end connections involving only 132kV work - non-contestable","%"]
[null,"Ratio - 132kV end connections involving only 132kV work - contestable","%",null,null,null,null,null,{"$f":"1-I214","v":1},{"$f":"1-J214","v":1},{"$f":"1-K214","v":1},{"$f":"1-L214","v":1},{"$f":"1-M214","v":1}]
[null,"132kV total","£m",null,null,null,null,null,{"$f":"SUM(I210,I213)","v":0},{"$f":"SUM(J210,J213)","v":0},{"$f":"SUM(K210,K213)","v":0},{"$f":"SUM(L210,L213)","v":0},{"$f":"SUM(M210,M213)","v":0},null,{"$f":"SUM(D216:G216)","v":0},{"$f":"SUM(H216)","v":0},{"$f":"SUM(D216:H216)","v":0},null,{"$f":"SUM(I216:M216)","v":0},{"$f":"IF(Q216<>0,(S216-Q216)/Q216,\"0\")","v":"0"}]
[null,"Total sole use expenditure where there is also expenditure subject to the apportionment rule",null,{"$f":"SUM(D192,D200,D208,D216)","v":0},0,0,0,0,0,0,0,0,0,null,{"$f":"SUM(O192,O200,O208,O216)","v":0},{"$f":"SUM(P192,P200,P208,P216)","v":0},{"$f":"SUM(Q192,Q200,Q208,Q216)","v":0},null,{"$f":"SUM(S192,S200,S208,S216)","v":0},{"$f":"IF(Q217<>0,(S217-Q217)/Q217,\"0\")","v":"0"}]
[]
[null,"Customer specific demand investment - all expenditure subject to the apportionment rule - Table 8"]
[]
[null,null,null,"DPCR4",null,null,null,null,"DPCR5",null,null,null,null,null,"DPCR4",null,null,null,"DPCR5"]
[null,"Customer specific demand investment","Units","2005/06","2006/07","2007/08","2008/09","2009/10","2010/11","2011/12","2012/13","2013/14","2014/15",null,"Actuals","Forecast","Total",null,"Forecast","% change"]
[null,"New connections & customer specific reinforcement:"]
[null,"Connections provided at LV"]
[null,"Small scale LV domestic and one-off commercial","£m"]
[null,"All other LV (with only LV work)","£m"]
[null,"LV total","£m",null,null,null,null,null,{"$f":"SUM(I225,I226)","v":0},{"$f":"SUM(J225,J226)","v":0},{"$f":"SUM(K225,K226)","v":0},{"$f":"SUM(L225,L226)","v":0},{"$f":"SUM(M225,M226)","v":0},null,{"$f":"SUM(D227:G227)","v":0},{"$f":"SUM(H227)","v":0},{"$f":"SUM(D227:H227)","v":0},null,{"$f":"SUM(I227:M227)","v":0},{"$f":"IF(Q227<>0,(S227-Q227)/Q227,\"0\")","v":"0"}]
[null,"Connections with HV work"]
[null,"LV end connections involving HV work","£m"]
[null,"HV end connections involving only HV work","£m"]
[null,"HV total","£m",null,null,null,null,null,{"$f":"SUM(I229,I230)","v":0},{"$f":"SUM(J229,J230)","v":0},{"$f":"SUM(K229,K230)","v":0},{"$f":"SUM(L229,L230)","v":0},{"$f":"SUM(M229,M230)","v":0},null,{"$f":"SUM(D231:G231)","v":0},{"$f":"SUM(H231)","v":0},{"$f":"SUM(D231:H231)","v":0},null,{"$f":"SUM(I231:M231)","v":0},{"$f":"IF(Q231<>0,(S231-Q231)/Q231,\"0\")","v":"0"}]
[null,"Connections with EHV work"]
[null,"HV end connections involving EHV work","£m"]
[null,"EHV end connections involving only EHV work","£m"]
[null,"EHV total","£m",null,null,null,null,null,{"$f":"SUM(I233,I234)","v":0},{"$f":"SUM(J233,J234)","v":0},{"$f":"SUM(K233,K234)","v":0},{"$f":"SUM(L233,L234)","v":0},{"$f":"SUM(M233,M234)","v":0},null,{"$f":"SUM(D235:G235)","v":0},{"$f":"SUM(H235)","v":0},{"$f":"SUM(D235:H235)","v":0},null,{"$f":"SUM(I235:M235)","v":0},{"$f":"IF(Q235<>0,(S235-Q235)/Q235,\"0\")","v":"0"}]
[null,"Connections with 132kV work"]
[null," HV or EHV connections involving 132kV work","£m"]
[null,"132kV end connections involving only 132kV work","£m"]
[null,"132kV total","£m",null,null,null,null,null,{"$f":"SUM(I237,I238)","v":0},{"$f":"SUM(J237,J238)","v":0},{"$f":"SUM(K237,K238)","v":0},{"$f":"SUM(L237,L238)","v":0},{"$f":"SUM(M237,M238)","v":0},null,{"$f":"SUM(D239:G239)","v":0},{"$f":"SUM(H239)","v":0},{"$f":"SUM(D239:H239)","v":0},null,{"$f":"SUM(I239:M239)","v":0},{"$f":"IF(Q239<>0,(S239-Q239)/Q239,\"0\")","v":"0"}]
[null,"Total connections expenditure subject to the apportionment rule",null,{"$f":"SUM(D227,D231,D235,D239)","v":0},0,0,0,0,0,0,0,0,0,null,{"$f":"SUM(O227,O231,O235,O239)","v":0},{"$f":"SUM(P227,P231,P235,P239)","v":0},{"$f":"SUM(Q227,Q231,Q235,Q239)","v":0},null,{"$f":"SUM(S227,S231,S235,S239)","v":0},{"$f":"IF(Q240<>0,(S240-Q240)/Q240,\"0\")","v":"0"}]
[]
[]
[null,"Customer contributions - customer specific demand investment - contributions associated with apportionment rule - Table 9"]
[]
[null,null,null,"DPCR4",null,null,null,null,"DPCR5",null,null,null,null,null,"DPCR4",null,null,null,"DPCR5"]
[null,"Customer contributions - customer specific demand investment","Units","2005/06","2006/07","2007/08","2008/09","2009/10","2010/11","2011/12","2012/13","2013/14","2014/15",null,"Actuals","Forecast","Total",null,"Forecast","% change"]
[null,"Customer contributions (directs) for connections at LV"]
[null,"Small scale LV domestic and one-off commercial","£m"]
[null,"All other LV (with only LV work)"]
[null,"LV total","£m",null,null,null,null,null,{"$f":"SUM(I248:I249)","v":0},{"$f":"SUM(J248:J249)","v":0},{"$f":"SUM(K248:K249)","v":0},{"$f":"SUM(L248:L249)","v":0},{"$f":"SUM(M248:M249)","v":0},null,{"$f":"SUM(D250:G250)","v":0},{"$f":"SUM(H250)","v":0},{"$f":"SUM(D250:H250)","v":0},null,{"$f":"SUM(I250:M250)","v":0},{"$f":"IF(Q250<>0,(S250-Q250)/Q250,\"0\")","v":"0"}]
[null,"Customer contributions (directs) for connections with HV work"]
[null,"LV end connections involving HV work","£m"]
[null,"HV end connections involving only HV work","£m"]
[null,"HV total","£m",null,null,null,null,null,{"$f":"SUM(I252:I253)","v":0},{"$f":"SUM(J252:J253)","v":0},{"$f":"SUM(K252:K253)","v":0},{"$f":"SUM(L252:L253)","v":0},{"$f":"SUM(M252:M253)","v":0},null,{"$f":"SUM(D254:G254)","v":0},{"$f":"SUM(H254)","v":0},{"$f":"SUM(D254:H254)","v":0},null,{"$f":"SUM(I254:M254)","v":0},{"$f":"IF(Q254<>0,(S254-Q254)/Q254,\"0\")","v":"0"}]
[null,"Customer contributions (directs) for connections with EHV work"]
[null,"HV end connections involving EHV work","£m"]
[null,"EHV end connections involving only EHV work","£m"]
[null,"EHV total","£m",null,null,null,null,null,{"$f":"SUM(I256:I257)","v":0},{"$f":"SUM(J256:J257)","v":0},{"$f":"SUM(K256:K257)","v":0},{"$f":"SUM(L256:L257)","v":0},{"$f":"SUM(M256:M257)","v":0},null,{"$f":"SUM(D258:G258)","v":0},{"$f":"SUM(H258)","v":0},{"$f":"SUM(D258:H258)","v":0},null,{"$f":"SUM(I258:M258)","v":0},{"$f":"IF(Q258<>0,(S258-Q258)/Q258,\"0\")","v":"0"}]
[null,"Customer contributions (directs) for connections with 132kV work"]
[null," HV or EHV connections involving 132kV work","£m"]
[null,"132kV end connections involving only 132kV work","£m"]
[null,"132kV total","£m",null,null,null,null,null,{"$f":"SUM(I260:I261)","v":0},{"$f":"SUM(J260:J261)","v":0},{"$f":"SUM(K260:K261)","v":0},{"$f":"SUM(L260:L261)","v":0},{"$f":"SUM(M260:M261)","v":0},null,{"$f":"SUM(D262:G262)","v":0},{"$f":"SUM(H262)","v":0},{"$f":"SUM(D262:H262)","v":0},null,{"$f":"SUM(I262:M262)","v":0},{"$f":"IF(Q262<>0,(S262-Q262)/Q262,\"0\")","v":"0"}]
[null,"Total customer contributions associated with apportionment rule",null,{"$f":"SUM(D250,D254,D258,D262)","v":0},0,0,0,0,0,0,0,0,0,null,{"$f":"SUM(O250,O254,O258,O262)","v":0},{"$f":"SUM(P250,P254,P258,P262)","v":0},{"$f":"SUM(Q250,Q254,Q258,Q262)","v":0},null,{"$f":"SUM(S250,S254,S258,S262)","v":0},{"$f":"IF(Q263<>0,(S263-Q263)/Q263,\"0\")","v":"0"}]
[]
[]
[null,null,null,{"$f":"SUM(D240:M240) - SUM(D263:M263)","v":0}]

{"sheet":"FBPQ LR4","index":15,"n_rows":116,"n_cols":41,"rows_kept":116,"cut":false,"hidden":false,"merged":[[42,35,43,35],[43,21,43,30],[6,18,6,19],[42,2,42,10],[42,11,42,15],[42,16,42,20],[42,21,42,34],[31,2,32,2],[23,2,24,2]]}
["June Forecast Business Plan DPCR5"]
["EDFE SPN"]
["LR4 - General reinforcement"]
[]
[null,"General reinforcement expenditure"]
[]
[null,null,null,"DPCR4",null,null,null,null,"DPCR5",null,null,null,null,null,"DPCR4",null,null,null,"DPCR5"]
[null,null,null,"2005/06","2006/07","2007/08","2008/09","2009/10","2010/11","2011/12","2012/13","2013/14","2014/15",null,"Actuals","Forecast","Total",null,"Forecast","% change"]
[null,null,null,"(£m)","(£m)","(£m)","(£m)","(£m)","(£m)","(£m)","(£m)","(£m)","(£m)",null,"(£m)","(£m)","(£m)",null,"(£m)","(£m)"]
[null,null,"General reinforcement:"]
[null,null,"LV System",0.59787787022900762,1.4930413323059681,1.2960606768848384,1.4501552777777778,0.7776191627692487,0.95352027484310475,0.93103337152803067,0.92934109523010278,0.92885146116891715,0.93731354680290524,null,{"$f":"SUM(D11:G11)","v":4.8371351571975918},{"$f":"H11","v":0.7776191627692487},{"$f":"SUM(D11:H11)","v":5.6147543199668402},null,{"$f":"SUM(I11:M11)","v":4.6800597495730605},{"$f":"IF(Q11<>0,(S11-Q11)/Q11,\"0\")","v":-0.16647114319318959}]
[null,null,"HV System",4.1851450916030535,5.2754127074810873,3.8881820306545154,3.2349617735042733,3.6659189101978868,4.3438145853963652,4.2413742480721393,4.2336649893815785,4.2314344342139556,4.269983935435457,null,16.583701603242929,3.6659189101978868,20.249620513440817,null,21.320272192499495,5.2872678692819232E-2]
[null,null,"EHV System",10.861447975826973,6.6689179509666578,3.1903032046396027,0.22310081196581197,3.4437420065495301,18.328778616428572,13.758604268136454,15.07597776706611,11.249423251934662,12.289222058082537,null,20.943769943399044,3.4437420065495301,24.387511949948575,null,70.702005961648325,1.8991069735507566]
[null,null,"132kV System",9.0678143651399488,12.242938924908939,24.026971009942006,14.724653589743589,1.1108845182417841,5.933015043468207,16.241359925544533,22.200926163830228,25.491812323191386,26.453071209770879,null,60.062377889734485,1.1108845182417841,61.173262407976267,null,96.320184665805229,0.57454712850570844,null,null," "]
[null,null,"Expenditure on DSM to avoid general reinforcement",null,null,null,0,0,0,0,0,0,0,null,0,0,{"$f":"SUM(D15:H15)","v":0},null,0,"0"]
[null,null,"Total",24.712285302798982,25.680310915662652,32.401516922120962,19.632871452991452,8.9981645977584499,29.559128520136248,35.17237181328116,42.439910015508019,41.901521470508925,43.949590750091772,null,102.42698459357405,8.9981645977584499,111.42514919133249,null,193.02252256952613,0.73230661094363525]
[]
[null,null,"Expenditure avoided due to DG",null,null,null,0,0,0,0,0,0,0,null,{"$f":"SUM(D18:G18)","v":0},{"$f":"H18","v":0},0,null,{"$f":"SUM(I18:M18)","v":0},{"$f":"IF(Q18<>0,(S18-Q18)/Q18,\"0\")","v":"0"}]
[null,null,"Expenditure avoided due to DSM",null,null,null,0,0,0,0,0,0,0,null,{"$f":"SUM(D19:G19)","v":0},{"$f":"H19","v":0},0,null,{"$f":"SUM(I19:M19)","v":0},{"$f":"IF(Q19<>0,(S19-Q19)/Q19,\"0\")","v":"0"}]
[]
[]
[null,"General reinforcement outputs"]
[]
[null,null,"Changes in general utilisation due to projected expenditure levels","At 31st March 2010",null,null,null,"At 31st March 2015",null,null,null,"At 31st March 2010","At 31st March 2015"]
[null,null,null,"132kV-EHV","132kV - HV","EHV - EHV","EHV - HV","132kV-EHV","132kV - HV","EHV - EHV","EHV - HV","Total","Total"]
[null,null,"Total number substations (operated by DNO)",null,null,null,null,null,null,null,null,{"$f":"SUM(D26:G26)","v":0},{"$f":"SUM(H26:K26)","v":0}]
[null,null,"Σ substation maximum demands",null,null,null,null,null,null,null,null,{"$f":"SUM(D27:G27)","v":0},{"$f":"SUM(H27:K27)","v":0}]
[null,null,"Σ substation firm capacities ",null,null,null,null,null,null,null,null,{"$f":"SUM(D28:G28)","v":0},{"$f":"SUM(H28:K28)","v":0}]
[null,null,"Σ substation maximum demands / Σ substation firm capacities ",{"$f":"IF(D27,D27/D28,\"-\")","v":"-"},{"$f":"IF(E27,E27/E28,\"-\")","v":"-"},"-","-","-","-","-","-","-","-"]
[]
[]
[null,null,"Changes in utilisation of highly loaded substations due to projected expenditure levels","At 31st March 2010",null,null,null,"At 31st March 2015",null,null,null,"At 31st March 2010","At 31st March 2015"]
[null,null,null,"132kV-EHV","132kV - HV","EHV - EHV","EHV - HV","132kV-EHV","132kV - HV","EHV - EHV","EHV - HV","Total","Total"]
[null,null,"Number of substations loaded >=80% of firm capacity",null,null,null,null,null,null,null,null,{"$f":"SUM(D34:G34)","v":0},{"$f":"SUM(H34:K34)","v":0}]
[null,null,"Σ substation maximum demands for substations loaded >=80% of firm capacity",null,null,null,null,null,null,null,null,0,0]
[null,null,"Σ substation firm capacities for substations loaded >=80% of firm capacity",null,null,null,null,null,null,null,null,0,0]
[null,null,"% Loading of substations which are operating at >=80% of firm capacity  = Σ demand /Σ firm capacity ",{"$f":"IF(D35,D35/D36,\"-\")","v":"-"},{"$f":"IF(E35,E35/E36,\"-\")","v":"-"},"-","-","-","-","-","-","-","-"]
[null,null,"Number of substations loaded above 100% of firm capacity",null,null,null,null,null,null,null,null,0,0]
[null,null,"Number of DNO substations requiring reinforcement within 5 yrs",null,null,null,null,null,null,null,null,0,0]
[]
[null,"General reinforcement projects"]
[]
[null,null,"Scheme details",null,null,null,null,null,null,null,null,"DPCR4 Expenditure",null,null,null,null,"DPCR5 Expenditure",null,null,null,null,"Utilisation",null,null,null,null,null,null,null,null,null,null,null,null,null,"(N-2) scheme?","Scheme description"]
[null,null,"Named scheme","Primary Voltage","Secondary Voltage","Limiting \nFactor","Forecast year in which substation demand will reach substation/group firm capacity","Planned reinforce-ment Year","MVA of additional firm capacity to be installed","Total cost of project","Total cost of project in DPCR5 period","2005/06","2006/07","2007/08","2008/09","2009/10","2010/11","2011/12","2012/13","2013/14","2014/15","Historic and forecast max demand (MVA)",null,null,null,null,null,null,null,null,null,"Substation/Group Total\nCapability","Substation/group firm capacity under single circuit outage conditions","Substation/Group Maximum Demand","Season of critical loading condition",null,"Brief description of work involved, substations affected, assets installed/replaced etc."]
[null,null,"(Unique name)","(kV)","(kV)","(a-j)","(Year)","(Year)","(MVA)","(£m)","(£m)","(£m)","(£m)","(£m)","(£m)","(£m)","(£m)","(£m)","(£m)","(£m)","(£m)","2005/06","2006/07","2007/08","2008/09","2009/10","2010/11","2011/12","2012/13","2013/14","2014/15","(MVA)","(MVA)","(MVA)","Season","(Y/N)","(Description)"]
[null,1,"Annesley - Hucknall 33kV","33kV","33kV","b",2011,null,14,2.0670827408423702,2.0670827408423702,0,0,0,0,0,0,1.034481523920034,1.0326012169223362,0,0,null,null,null,null,null,null,null,null,null,null,null,null,null,null,null,"Uprating 33kV double circuit line to 40MVA and interconnection of cables via Linby (approx 10km of cable)"]
[null,2,"Bainton - new GSP","132kV","132kV","a",2013,null,80,4.9811411799437408,4.9811411799437408,0,0,0,0,0,0,0,0,1.9609086402454914,3.0202325396982497,null,null,null,null,null,null,null,null,null,null,null,null,null,null,null,"Reconfiguration of the 132kV circuit between Bourne and Stamford"]
[null,3,"Berkswell - Coventry South / Coventry West 132kV","132kV","132kV","b",2010,null,39,1.034481523920034,1.034481523920034,0,0,0,0,0,0,1.034481523920034,0,0,0,null,null,null,null,null,null,null,null,null,null,null,null,null,null,null,"Installation of a third circuit from Berkswell.  Alternatively for SCO only, re-energisation of Coventry South - Whitley 132kV circuits"]
[null,4,"Billingborough 33/11kV Substation","33kV","33kV","c",2007,null,12,1.5892004580718411,1.5892004580718411,0,0,0,0,0,1.5892004580718411,0,0,0,0,null,null,null,null,null,null,null,null,null,null,null,null,null,null,null,"Installation of new 10km circuit from Great Hale to Billingborough and additional transformer at Billingborough"]
[null,5,"Bourne 33/11kV Transformer Replacement","33kV","33kV","a",2007,null,9.5,0.83008376394881334,0.83008376394881334,0,0,0,0,0,0.10594669720478943,0.72413706674402389,0,0,0,null,null,null,null,null,null,null,null,null,null,null,null,null,null,null,"Uprating of 2 x 10/14.5MVA 33/11kV transformers with 12/24MVA units"]
[null,6,"Brackley - Banbury group P2/6 SCO security","132kV","132kV","c",2013,null,189,0.41293167919978219,0.41293167919978219,0,0,0,0,0,0,0,0.20652024338446728,0.2064114358153149,0,null,null,null,null,null,null,null,null,null,null,null,null,null,null,null,"Installation of a third 132kV circuit. Costs split evenly across East and West. Wayleaves only in DPCR5, construction in DPCR6."]
[null,7,"Brackley Town 33/11kV reinforcement","33kV","33kV","a",2011,null,16,2.580959004460079,2.580959004460079,0,0,0,0,0,0,0,1.5489018253835045,1.0320571790765745,0,null,null,null,null,null,null,null,null,null,null,null,null,null,null,null,"Installation of Brackley local primary or strapping 33kV OHL circuits from Brackley Grid together. Installation of a new 33kV circuit (3km), uprating the existing transformers with 2 x 20/40MVA units and installation of a 2000A switchboard",null,null,null," "]
[null,8,"Bradwell Abbey 132/33kV reinforcement","132kV","132kV","a",2012,null,117,1.5507821323812021,1.5507821323812021,0,0,0,0,0,0,1.034481523920034,0.5163006084611681,0,0,null,null,null,null,null,null,null,null,null,null,null,null,null,null,null,"Installation of a third grid transformer and third section of switchboard"]
[null,9,"Braunstone, Jupiter & Groby Road 33/11kV reinforcement","33kV","33kV","a",2008,null,40,5.0111033592613996,5.0111033592613996,0,0,0,0,0,2.0129872468909991,1.9655148954480646,1.0326012169223362,0,0,null,null,null,null,null,null,null,null,null,null,null,null,null,null,null,"Installation of new 40MVA 33/11kV primary on Hinckley Rd reserve site. Modification of 11kV circuits to enable load transfers."]
[null,10,"Burton 132/33kV transformer change","132kV","132kV","a",2010,null,58.5,2.0646583959989107,2.0646583959989107,0,0,0,0,0,0,0,1.0326012169223362,1.0320571790765745,0,null,null,null,null,null,null,null,null,null,null,null,null,null,null,null,"Uprating the existing 132/33kV transformers with 2 x 90MVA units."]
[null,11,"Cannon Street 33/11kV reinforcement","33kV","33kV","a",2012,null,39,4.9549081314745047,4.9549081314745047,0,0,0,0,0,0,0,1.9619423121524389,2.9929658193220656,0,null,null,null,null,null,null,null,null,null,null,null,null,null,null,null,"Installation of a 132/11kV primary at Wellingborough Grid to transfer demand off Cannon Street.  "]
[null,12,"Caythorpe 33/11kV","33kV","33kV","a",2012,null,13.15,0.20829189928953451,0.20829189928953451,0,0,0,0,0,0,0,0,0,0.20829189928953451,null,null,null,null,null,null,null,null,null,null,null,null,null,null,null,"Uprating transformer T1 (10.85MVA) with 24MVA transformer"]
[null,13,"Clifton 33/11kV reinforcement ","33kV","33kV","a",2012,null,24,1.4454240885529659,1.4454240885529659,0,0,0,0,0,0,0,1.0326012169223362,0.41282287163062981,0,null,null,null,null,null,null,null,null,null,null,null,null,null,null,null,"Installation of a third 33kV circuit and a third 33/11kV 24MVA transformer"]
[null,14,"Coalville 33/11kV transformer change","33kV","33kV","a",2008,null,25,1.0594669720478942,1.0594669720478942,0,0,0,0,0,1.0594669720478942,0,0,0,0,null,null,null,null,null,null,null,null,null,null,null,null,null,null,null,"Uprating transformers for larger units."]
[null,15,"Colwick 33/11kV reinforcement","33kV","33kV","a",2010,null,35.200000000000003,2.0670827408423702,2.0670827408423702,0,0,0,0,0,0,1.034481523920034,1.0326012169223362,0,0,null,null,null,null,null,null,null,null,null,null,null,null,null,null,null,"Installation of a third 33kV circuit from Notts East and a third 33/11kV 40MVA transformer. Reconfiguration of Cotgrave 33kV interconnection."]
[null,16,"Copsewood 33/11kv reinforcement","33kV","33kV","a",2012,null,16,4.0434314392494883,4.0434314392494883,0,0,0,0,0,0,0,1.0326012169223362,1.0320571790765745,1.9787730432505775,null,null,null,null,null,null,null,null,null,null,null,null,null,null,null,"Installation of 40MVA 33kV circuits, transformers and switchgear or installation of a 33/11kV 24MVA primary at Binley."]
[null,17,"Coventry - Rugby 132kV cct reinforcement ","132kV","132kV","c",2012,null,35,3.9274572076005034,3.9274572076005034,0,0,0,0,0,0,1.9655148954480646,1.9619423121524389,0,0,null,null,null,null,null,null,null,null,null,null,null,null,null,null,null,"Transfer of Hinckley to Enderby GSP using the disconnected CA line. Refurbishment of CA1&2."]
[null,18,"Coventry South 33/11kV Reinforcement","33kV","33kV","a",2010,null,16,1.5507821323812021,1.5507821323812021,0,0,0,0,0,0,1.034481523920034,0.5163006084611681,0,0,null,null,null,null,null,null,null,null,null,null,null,null,null,null,null,"Uprating transformers with 20/40 33/11kV units or 30MVA 132/11kV units."]
[null,19,"Dillotford Avenue 33/11kV Reinforcement","33kV","33kV","a",2013,null,18.600000000000001,2.5942464237480829,2.5942464237480829,0,0,0,0,0,0,0,0,1.0320571790765745,1.5621892446715087,null,null,null,null,null,null,null,null,null,null,null,null,null,null,null,"Uprating 33kV circuits with 40MVA rated cables and uprating transformers"]
[null,20,"Farndon Road 33kV switchgear reconfiguration","33kV","33kV","g",2014,null,24,0,0,0,0,0,0,0,0,0,0,0,0,null,null,null,null,null,null,null,null,null,null,null,null,null,null,null,"Switchgear reconfiguration"]
[null,21,"Field Street T3 overload","33kV","33kV","a",2010,null,15,0.10344815239200342,0.10344815239200342,0,0,0,0,0,0,0.10344815239200342,0,0,0,null,null,null,null,null,null,null,null,null,null,null,null,null,null,null,"Installation of auto opening scheme on the T2-T3 bus section for the loss of T1 or T2, or transfer load to Kettering North at 11kV or Uprate transformer T3."]
[null,22,"Fiskerton 33/11kV reinforcement","33kV","33kV","a",2014,null,13.15,0.52072974822383633,0.52072974822383633,0,0,0,0,0,0,0,0,0,0.52072974822383633,null,null,null,null,null,null,null,null,null,null,null,null,null,null,null,"Uprating existing transformers with 2 x 12/24 MVA units. "]
[null,23,"Gresley - Moira - Ashby - Woodville - Willesley ccts","33kV","33kV","b",2014,null,27,1.0414594964476727,1.0414594964476727,0,0,0,0,0,0,0,0,0,1.0414594964476727,null,null,null,null,null,null,null,null,null,null,null,null,null,null,null,"Installation of additional circuits from Gresley & splitting existing circuits."]
[null,24,"Hatton 33/11kV reinforcement","33kV","33kV","a",2010,null,16,1.5517222858800512,1.5517222858800512,0,0,0,0,0,0,1.5517222858800512,0,0,0,null,null,null,null,null,null,null,null,null,null,null,null,null,null,null,"Uprating the existing 2 x 24MVA transformers with 40MVA units and changing the 11kV switchboard."]
[null,25,"Hawton SCO Reinforcement and BSP reinforcement","132kV","132kV","a",2014,null,90,3.5409622879220861,3.5409622879220861,0,0,0,0,0,0,0,0,0,3.5409622879220861,null,null,null,null,null,null,null,null,null,null,null,null,null,null,null,"Replacement of circuit breakers at Staythorpe, additional transformer capacity and 132kV busbars."]
[null,26,"Heanor 33/11kV  reinforcement","33kV","33kV","a",2008,null,12,1.5642150099439811,1.5642150099439811,0,0,0,0,0,0.5297334860239471,1.034481523920034,0,0,0,null,null,null,null,null,null,null,null,null,null,null,null,null,null,null,"Uprating of existing transformers with 20/40 33/11kV units and replacement of circuits 2 x 85m"]
[null,27,"Heanor BSP reinforcement","132kV","132kV","a",2013,null,39,6.0131983590203149,6.0131983590203149,0,0,0,0,0,0,0,0,2.9929658193220656,3.0202325396982497,null,null,null,null,null,null,null,null,null,null,null,null,null,null,null,"Uprating existing 132/33kV transformer with 120MVA units at Heanor. Looping the 132kV circuit (3km) into Stanton with two new CBs."]
[null,28,"Kenilworth 33/11kV Reinforcement","33kV","33kV","a",2010,null,24,1.0469742479839641,1.0469742479839641,0,0,0,0,0,0.5297334860239471,0.517240761960017,0,0,0,null,null,null,null,null,null,null,null,null,null,null,null,null,null,null,"Installation of a new 33/11kV primary (North Kenilworth) to offload Kenilworth."]
[null,29,"Kibworth 33/11kV transformer replacement","33kV","33kV","a",2008,null,13.1,1.0469742479839641,1.0469742479839641,0,0,0,0,0,0.5297334860239471,0.517240761960017,0,0,0,null,null,null,null,null,null,null,null,null,null,null,null,null,null,null,"Uprating 33/11kV transformers with 24MVA units."]
[null,30,"Leicester East - Salutation - Thurmaston 33kV circuit","33kV","33kV","b",2007,null,40,1.0326012169223362,1.0326012169223362,0,0,0,0,0,0,0,1.0326012169223362,0,0,null,null,null,null,null,null,null,null,null,null,null,null,null,null,null,"Installation of third and fourth circuits to remove tee-off radial circuits."]
[null,31,"Lincoln 132/33kV reinforcement","132kV","132kV","a",2007,null,117,0.74162688043352587,0.74162688043352587,0,0,0,0,0,0.74162688043352587,0,0,0,0,null,null,null,null,null,null,null,null,null,null,null,null,null,null,null,"Installation of new third 132/33kV 90MVA transformer"]
[null,32,"Lincoln BSP","132kV","132kV","c",2014,null,117,2.0735166755242469,2.0735166755242469,0,0,0,0,0,0,0,0,1.0320571790765745,1.0414594964476727,null,null,null,null,null,null,null,null,null,null,null,null,null,null,null,"Creation of 132kV cross bay"]
[null,33,"Mackworth 33/11kV reinforcement","33kV","33kV","a",2012,null,24,1.239012652737651,1.239012652737651,0,0,0,0,0,0,0,1.0326012169223362,0.2064114358153149,0,null,null,null,null,null,null,null,null,null,null,null,null,null,null,null,"Installation of a third 33kV circuit (3.5km) and a third transformer (12/24MVA)."]
[null,34,"Middlefield/Barwell 33kV circuit reinforcement","33kV","33kV","b",2008,null,16,0.5297334860239471,0.5297334860239471,0,0,0,0,0,0.5297334860239471,0,0,0,0,null,null,null,null,null,null,null,null,null,null,null,null,null,null,null,"Overlaying short lower rated sections of 33kV circuits increasing the rating to 40MVA."]
[null,35,"Millclose transformer and switchboard replacement","33kV","33kV","a",2008,null,7.5,0.84757357763831542,0.84757357763831542,0,0,0,0,0,0.84757357763831542,0,0,0,0,null,null,null,null,null,null,null,null,null,null,null,null,null,null,null,"Uprating 33/11kV transformer and 11kV switchboard"]
[null,36,"Milton Keynes additional BSP - acquire site and 132kV route","132kV","132kV","a",2015,null,117,0.52072974822383633,0.52072974822383633,0,0,0,0,0,0,0,0,0,0.52072974822383633,null,null,null,null,null,null,null,null,null,null,null,null,null,null,null,"Phase 1 - Acquisition of a reserved BSP site on the north eastern edge of the city and a route to an appropriate GSP."]
[null,37,"Mountsorrel / Syston 33kV ccts","33kV","33kV","b",2011,null,31,0.5163006084611681,0.5163006084611681,0,0,0,0,0,0,0,0.5163006084611681,0,0,null,null,null,null,null,null,null,null,null,null,null,null,null,null,null,"Extension of Syston - Mountsorrel 33kV circuit into mid point at Mountsorrel and Syston, installation of RMU and changeover scheme at each end"]
[null,38,"Normanton 33/11kV reinforcement","33kV","33kV","a",2011,null,16,1.0335413704211851,1.0335413704211851,0,0,0,0,0,0,0.517240761960017,0.5163006084611681,0,0,null,null,null,null,null,null,null,null,null,null,null,null,null,null,null,"Uprating 33/11kV transformers with 40MVA units."]
[null,39,"Northampton 132kV reinforcement","132kV","132kV","c",2014,null,190,15.134092320239922,15.134092320239922,0,0,0,0,0,0,0,4.027144745997111,4.0250229983986401,7.0819245758441722,null,null,null,null,null,null,null,null,null,null,null,null,null,null,null,"Installation of fourth 132kV circuit from Grendon to Northampton. Reconfiguration of 132kV running arrangement."]
[null,40,"Northampton West - Kingsthorpe 33kV circuit reinforcement","33kV","33kV","b",2008,null,10,0.20689630478400683,0.20689630478400683,0,0,0,0,0,0,0.20689630478400683,0,0,0,null,null,null,null,null,null,null,null,null,null,null,null,null,null,null,"Installation of 33kV and 11kV switchgear to accommodate all the potential 33kV circuit outages"]
[null,41,"Nottingham North BSP","132kV","132kV","a",2014,null,40,3.0202325396982497,3.0202325396982497,0,0,0,0,0,0,0,0,0,3.0202325396982497,null,null,null,null,null,null,null,null,null,null,null,null,null,null,null,"Installation of new 33/11kV substation in vicinity of BSP site (5km double circuit 33kV cable assumed)"]
[null,42,"Nott'm East - Colwick 33kV cct","33kV","33kV","b",2010,null,40,1.2497513957372068,1.2497513957372068,0,0,0,0,0,0,0,0,0,1.2497513957372068,null,null,null,null,null,null,null,null,null,null,null,null,null,null,null,"Installation of two new 40MVA cable circuits to tee point to create two direct circuits to Colwick (3km)"]
[null,43,"Olney 33/11kV reinforcement","33kV","33kV","a",2014,null,9.5,1.3538973453819743,1.3538973453819743,0,0,0,0,0,0,0,0,0,1.3538973453819743,null,null,null,null,null,null,null,null,null,null,null,null,null,null,null,"Uprating the existing 33/11kV transformer with 24MVA units and reinforcement of 33kV circuits"]
[null,44,"Raunds 33/11kV reinforcement","33kV","33kV","c",2008,null,16,1.5892004580718411,1.5892004580718411,0,0,0,0,0,1.5892004580718411,0,0,0,0,null,null,null,null,null,null,null,null,null,null,null,null,null,null,null,"Installation of a new 40MVA 33kV circuit from Irthlingborough Grid. Uprate transformer with a 12/24MVA unit and install a 2nd 12/24MVA unit."]
[null,45,"Raynesway 33/11kV Substation","33kV","33kV","a",2007,null,40,2.3308273385053671,2.3308273385053671,0,0,0,0,0,2.3308273385053671,0,0,0,0,null,null,null,null,null,null,null,null,null,null,null,null,null,null,null,"Installation of a new 33/11kV primary substation"]
[null,46,"Ripley 33/11kV reinforcement","33kV","33kV","a",2011,null,21.75,2.4901004741033157,2.4901004741033157,0,0,0,0,0,0,0,0,1.0320571790765745,1.4580432950267415,null,null,null,null,null,null,null,null,null,null,null,null,null,null,null,"Installation of a third 33kV circuit (6.4km) and a third transformer (12/24MVA)."]
[null,47,"Rugby - Harbury 132kV circuit (Warwick & Harbury Security)","132kV","132kV","c",2008,null,190,4.1319211909867866,4.1319211909867866,0,0,0,0,0,4.1319211909867866,0,0,0,0,null,null,null,null,null,null,null,null,null,null,null,null,null,null,null,"Installation of a 132kV interconnector between Harbury and Rugby."]
[null,48,"Rugby 132/33kV reinforcement","132kV","132kV","a",2010,null,117,1.9655148954480646,1.9655148954480646,0,0,0,0,0,0,1.9655148954480646,0,0,0,null,null,null,null,null,null,null,null,null,null,null,null,null,null,null,"Installation of a third 132/33kV transformer or alternatively a 132/11kV double wound transformer at Rugby BSP."]
[null,49,"Rushden 33/11kV reinforcement","33kV","33kV","a",2008,null,16,2.3992958635183665,2.3992958635183665,0,0,0,0,0,0.84757357763831542,1.5517222858800512,0,0,0,null,null,null,null,null,null,null,null,null,null,null,null,null,null,null,"Installation of 2 x 40MVA 33kV circuits from Irthlingborough Grid to Rushden and 2 x 20/40MVA 33/11kV transformers at Rushden OR Installation of a 40MVA 33kV cable circuit from Wellingborough - Little Irchester to pick up existing Little Irchester - Rushden 33kV line and uprating Little Irchester."]
[null,50,"Salutation 33/6.6kV reinforcement","33kV","33kV","a",2013,null,0,0.20829189928953451,0.20829189928953451,0,0,0,0,0,0,0,0,0,0.20829189928953451,null,null,null,null,null,null,null,null,null,null,null,null,null,null,null,"Uprating 6.6kV network to 11kV to reduce demand on Salutation s/s."]
[null,51,"Spondon - Stanton - Heanor - Annesley 132kV reinforcement","132kV","132kV","j",2015,null,99.8,4.3543850186009188,4.3543850186009188,0,0,0,0,0,0,0,0,2.1673200760608062,2.1870649425401121,null,null,null,null,null,null,null,null,null,null,null,null,null,null,null,"Looping 132kV circuit through Heanor, installation of 2 x 132kV circuit breakers at Heanor"]
[null,52,"Spondon 33/11kV reinforcement","33kV","33kV","a",2010,null,24,0.52072974822383633,0.52072974822383633,0,0,0,0,0,0,0,0,0,0.52072974822383633,null,null,null,null,null,null,null,null,null,null,null,null,null,null,null,"Installation of a third transformer (20/40MVA).  Co-ordination with 11kV and 33kV switchgear replacements."]
[null,53,"Stamford 132/33/11kV reinforcement","33kV","33kV","a",2010,null,16,1.0469742479839641,1.0469742479839641,0,0,0,0,0,0.5297334860239471,0.517240761960017,0,0,0,null,null,null,null,null,null,null,null,null,null,null,null,null,null,null,"Uprating 33/11kV transformers with 40MVA units"]
[null,54,"Stoke Bardolph - New GSP ","132kV","132kV","b",2011,null,117,30.657600688092032,30.090100688092029,0,0,0,0,0.5675,1.0594669720478942,10.03447078202433,11.978174116299099,7.0179888177207062,0,null,null,null,null,null,null,null,null,null,null,null,null,null,null,null,"Installation of new GSP to support Ratcliffe picking up Nottingham East on new 132kV cable and new OHL for new BSP to pick up Notts North."]
[null,55,"Stony Stratford - Buckingham - Wicken - Towcester circuit reinforcement","33kV","33kV","b",2013,null,15,0.72244002535360208,0.72244002535360208,0,0,0,0,0,0,0,0,0.72244002535360208,0,null,null,null,null,null,null,null,null,null,null,null,null,null,null,null,"Reinforcement/rebuild/reconfiguration of the network required to increase the thermal rating."]
[null,56,"Stony Stratford - Shenley Wood - Eldergate circuit reinforcement","33kV","33kV","b",2008,null,24,0.63568018322873654,0.63568018322873654,0,0,0,0,0,0.63568018322873654,0,0,0,0,null,null,null,null,null,null,null,null,null,null,null,null,null,null,null,"Installation of a new 40 MVA circuit from Stony Stratford to split the Shenley Wood / Eldergate circuits"]
[null,57,"Syston 33/11kV reinforcement","33kV","33kV","f",2012,null,0,1.239012652737651,1.239012652737651,0,0,0,0,0,0,0,1.0326012169223362,0.2064114358153149,0,null,null,null,null,null,null,null,null,null,null,null,null,null,null,null,"Installation of capacitors"]
[null,58,"Talbot Street 33/11kV reinforcement","33kV","33kV","a",2010,null,24,1.4473339799891987,1.4473339799891987,0,0,0,0,0,0,0.93103337152803067,0.5163006084611681,0,0,null,null,null,null,null,null,null,null,null,null,null,null,null,null,null,"Installation of third 33/11kV 24MVA transformer and new 33kV circuit to Nottingham (4km) BSP"]
[null,59,"Tamworth Grid 132/33kV Tamworth Town 132/33kV reinforcement","132kV","132kV","c",2010,null,40,0.20689630478400683,0.20689630478400683,0,0,0,0,0,0,0.20689630478400683,0,0,0,null,null,null,null,null,null,null,null,null,null,null,null,null,null,null,"Extension of 40MVA interconnector to be selectable to both sections of the 33kV switchboard at Tamworth Grid, connection to spare CB."]
[null,60,"Walton 33/11kV","33kV","33kV","C",2009,null,10,0.5297334860239471,0.5297334860239471,0,0,0,0,0,0.5297334860239471,0,0,0,0,null,null,null,null,null,null,null,null,null,null,null,null,null,null,null,"Installation of additional 33/11kV 10MVA transformer and associated switchgear"]
[null,61,"Warwick - Campion Hills - Tee Princethorpe 33kV circuit Reinforcement","33kV","33kV","b",2014,null,4,0.20829189928953451,0.20829189928953451,0,0,0,0,0,0,0,0,0,0.20829189928953451,null,null,null,null,null,null,null,null,null,null,null,null,null,null,null,"Increasing 11kV interconnection and application of sequence scheme to transfer demand away."]
[null,62,"Watnall / Kimberley New Primary Substation","33kV","33kV","a",2007,null,40,4.207454218938893,3.0724542189388933,0,0,0,0,1.135,3.0724542189388933,0,0,0,0,null,null,null,null,null,null,null,null,null,null,null,null,null,null,null,"Installation of new 33/11kV substation and 33kV circuits"]
[null,63,"Wellesbourne 33/11kV New Primary Substation","33kV","33kV","b",2014,null,24,1.9787730432505775,1.9787730432505775,0,0,0,0,0,0,0,0,0,1.9787730432505775,null,null,null,null,null,null,null,null,null,null,null,null,null,null,null,"Following installation of Warwick West, decommissioning Banbury Rd and extending existing dual 33kV circuits to a reserve site at Wellesbourne."]
[null,64,"West Burton - Lincoln 132kV DC OHL","132kV","132kV","b",2012,null,75,6.0131983590203149,6.0131983590203149,0,0,0,0,0,0,0,0,2.9929658193220656,3.0202325396982497,null,null,null,null,null,null,null,null,null,null,null,null,null,null,null,"Uprating 132kV overhead line"]
[null,65,"West Burton GSP - 3rd SGT ","132kV","132kV","c",2013,null,240,1.0320571790765745,1.0320571790765745,0,0,0,0,0,0,0,0,1.0320571790765745,0,null,null,null,null,null,null,null,null,null,null,null,null,null,null,null,"Installation of a third SGT and a bus-section at West Burton GSP."]
[null,66,"Westville 33/11kV","33kV","33kV","a",2013,null,24,3.6127441646137721,3.6127441646137721,0,0,0,0,0,0,0,1.0326012169223362,2.5801429476914359,0,null,null,null,null,null,null,null,null,null,null,null,null,null,null,null,"Installation of a new 33/11kV substation and 33kV single circuit to Hucknall (3km)"]
[null,67,"Wigston Magna 33/11kV reinforcement","33kV","33kV","a",2008,null,32,1.5767077340079112,1.5767077340079112,0,0,0,0,0,1.0594669720478942,0.517240761960017,0,0,0,null,null,null,null,null,null,null,null,null,null,null,null,null,null,null,"Installation of a third 33kV circuit and third 33/11kV 40MVA transformer."]
[null,68,"Willington - Winster - Uttoxeter 132kV reinforcement","132kV","132kV","c",2010,null,181,3.5103000996901814,3.5103000996901814,0,0,0,0,0,0,0,2.478242920613607,1.0320571790765745,0,null,null,null,null,null,null,null,null,null,null,null,null,null,null,null,"Unstitching tee (by cabling to Willington GSP) and refurbishment of both circuits (23km Uttoxeter & 35km Winster)."]
[null,69,"Winster - Longcliffe","33kV","33kV","b",2011,null,27,0.20652024338446728,0.20652024338446728,0,0,0,0,0,0,0,0.20652024338446728,0,0,null,null,null,null,null,null,null,null,null,null,null,null,null,null,null,"Installation of new single 40MVA, 33kV circuit (4km ohl)"]
[null,70,0,0,0,0,0,null,0,0,0,0,0,0,0,0,0,0,0,0,0,null,null,null,null,null,null,null,null,null,null,null,null,null,null,null,0]
[null,null,"Total",null,null,null,null,null,{"$f":"SUM(I46:I115)","v":3262.75},168.72469062745364,167.0221906274536,0,0,0,0,1.7025000000000001,24.261793659896771,29.999964193680984,37.276903930896339,36.741235575126048,38.742293267853412,{"$f":"SUM(V46:V115)","v":0},{"$f":"SUM(W46:W115)","v":0},0,0,0,0,0,0,0,0,0,0,0]

{"sheet":"FBPQ LR6","index":16,"n_rows":32,"n_cols":19,"rows_kept":32,"cut":false,"hidden":false,"merged":[[23,1,25,1],[9,1,9,2],[10,1,10,2],[11,1,11,2],[7,1,8,2],[15,1,16,2],[17,1,17,2],[18,1,18,2],[19,1,19,2]]}
["Main Forecast Business Plan DPCR5",null,null,null,null,"Index"]
[]
["LR6 - Fault levels"]
[]
[]
[null,"Fault level system measures"]
[]
[null,null,null,"As at 31st March 2010",null,null,"As at 31st March 2015"]
[null,null,null,"132kV","EHV","HV","132kV","EHV","HV"]
[null,"No. of switchboards",null,50,175,411,51,177,420]
[null,"No. of switchboards @ >95% of F.L.",null,5,12,32,5,10,30]
[null,"No. of switchboards having fault level 'operational restrictions'",null,5,12,32,5,10,30]
[]
[null,"Number of fault level schemes"]
[]
[null,"No. of schemes",null,"DPCR4",null,null,"DPCR5"]
[null,null,null,"132kV","EHV","HV","132kV","EHV","HV"]
[null,"Switchboards",null,0,0,0,1,3,3]
[null,"Transformers",null,0,0,0,0,0,0]
[null,"Other",null,0,0,0,0,0,0]
[]
[null,"Fault level reinforcement"]
[]
[null,null,"DPCR4",null,null,null,null,"DPCR5",null,null,null,null,null,"DPCR4",null,null,null,"DPCR5"]
[null,null,"2005/06","2006/07","2007/08","2008/09","2009/10","2010/11","2011/12","2012/13","2013/14","2014/15",null,"Actuals","Forecast","Total",null,"Forecast","% change"]
[null,null,"(£m)","(£m)","(£m)","(£m)","(£m)","(£m)","(£m)","(£m)","(£m)","(£m)",null,"(£m)","(£m)","(£m)",null,"(£m)","(£m)"]
[null,"Fault level reinforcement:"]
[null,"LV ",0,0,0,0,0,0,0,0,0,0,null,0,0,0,null,0,"0"]
[null,"HV",0,0,0.79757580115990068,0,0,0.5297334860239471,0,0,0.72244002535360208,0,null,0.79757580115990068,0,0.79757580115990068,null,1.2521735113775492,0.56997430157301021]
[null,"EHV ",0,0,0.79757580115990068,2.454108931623932,0.66653071094507021,3.6021877049628404,0.72413706674402389,1.0326012169223362,1.6512914865225192,0,null,0.79757580115990068,3.1206396425690022,3.918215443728903,null,7.0102174751517197,0.78913527748239587]
[null,"132kV ",0,0,2.093636478044739,2.7887601495726493,4.2213611693187794,0,0.517240761960017,0.5163006084611681,0,0,null,2.093636478044739,7.0101213188914286,9.1037577969361685,null,1.0335413704211851,-0.8864709064679841]
[null,"Total expenditure",0,0,3.6887880803645405,5.2428690811965808,4.8878918802638491,4.1319211909867875,1.2413778287040409,1.5489018253835043,2.3737315118761213,0,null,3.6887880803645405,10.13076096146043,13.81954904182497,null,9.2959323569504537,-0.32733460919627377]

{"sheet":"FBPQ NL1 0309","index":17,"n_rows":153,"n_cols":20,"rows_kept":153,"cut":false,"hidden":false,"merged":[[6,1,8,2],[39,1,41,2],[72,1,74,2],[105,1,107,2],[141,1,143,2],[67,1,67,2],[34,1,34,2],[100,1,100,2],[22,1,27,1],[28,1,33,1],[42,1,43,1],[44,1,45,1],[9,1,10,1],[11,1,12,1],[13,1,15,1],[16,1,21,1],[75,1,76,1],[77,1,78,1],[79,1,81,1],[82,1,87,1],[46,1,48,1],[49,1,54,1],[55,1,60,1],[61,1,66,1],[120,1,123,1],[124,1,127,1],[129,1,132,1],[133,1,136,1],[88,1,93,1],[94,1,99,1],[108,1,113,1],[114,1,119,1]]}
["June Forecast Business Plan DPCR5",null,null,null,null,null," "]
["EDFE SPN"]
["NL1 - Condition based expenditure"]
[]
[null,"Total condition based replacement"]
[]
[null,"Asset Categories",null,"DPCR 4",null,null,null,null,"DPCR 5",null,null,null,null,null,"DPCR4",null,null,null,"DPCR5"]
[null,null,null,"2005/06","2006/07","2007/08","2008/09","2009/10","2010/11","2011/12","2012/13","2013/14","2014/15",null,"Actuals","Forecast","Total",null,"Forecast","% change"]
[null,null,null,"£m","£m","£m","£m","£m","£m","£m","£m","£m","£m"]
[null,"Metered LV Services","Overhead",0.29920762142543345,0.29907656419407114,1.0976789316002178,4.0210204957240183,2.3369847146460714,1.9103522168597962,1.8661899290299955,1.8629502247538514,1.9658635063471863,1.983307357938886,null,1.6959631172197223,6.3580052103700897,8.0539683275898124,null,9.5886632349297152,0.19055139589792344]
[null,null,"Underground",1.6955098547441227,2.3926125135525695,3.5924037761461669,0.33508504131033484,0.77899490488202372,1.2735681445731974,1.3478038376327743,1.4489612859196621,1.6554640053449992,1.7745381623663716,null,7.680526144442859,1.1140799461923585,8.7946060906352184,null,7.5003354358370045,-0.14716641558015831]
[null,"Un-metered LV Services","Overhead",0,0,0,0,0,0,0,0,0,0,null,0,0,0,null,0,"0"]
[null,null,"Underground",0,0,0,0,0,0,0,0,0,0,null,0,0,0,null,0,"0"]
[null,"LV System","Overhead mains",0.39894349523391126,0.49846094032345195,0.69852295647286589,4.9145806058849111,4.7852544157038608,1.2735681445731974,1.2441266193533302,1.3454640512111147,1.3450645043428118,1.3569997712213433,null,1.595927392030229,9.6998350215887719,11.295762413619002,null,6.5652230907017977,-0.41878884750742618]
[null,null,"Underground mains",1.3963022333186894,2.4923047016172597,3.9915597512735186,0.33508504131033484,0.77899490488202372,0.84904542971546504,0.82941774623555353,1.2419668165025675,1.5519975050109367,1.7745381623663721,null,7.8801666862094679,1.1140799461923585,8.9942466324018273,null,6.2469656598308951,-0.30544870347159886]
[null,null,"Switchgear (incl other plant & equipment)",0.59841524285086689,0.89722969258221341,1.1974679253820557,0.55847506885055809,1.1128498641171767,0.84904542971546504,0.93309496451499774,1.034972347085473,1.1381315036746869,1.2526151734350861,null,2.6931128608151358,1.6713249329677349,4.3644377937828711,null,5.2078594184257083,0.1932486300627973]
[null,"HV","Overhead lines",2.7926044666373793,2.7913812658113311,2.7940918258914631,11.727976445861719,10.238218749878026,6.4739714015804211,5.9096014419283192,5.588850674261554,5.276791517037184,5.2192298893128584,null,8.3780775583401734,21.966195195739743,30.34427275407992,null,28.468444924120334,-6.1818183785847143E-2]
[null,null,"Underground cables",1.4960381071271673,1.9938437612938078,3.0934588072369773,0.55847506885055809,1.0015648777054591,1.0613067871443311,1.1404494010738859,1.2419668165025675,1.2415980040087493,1.4613843690076003,null,6.5833406756579524,1.5600399465560173,8.1433806222139697,null,6.1467053777371339,-0.2451899692653679]
[null,null,"Submarine",0,0,0,0,0,0,0,0,0,0,null,0,0,0,null,0,"0"]
[null,null,"Switchgear (incl other plant & equipment)",3.8896990785306347,6.4799922242048753,6.5860735896013063,4.3561055370343524,6.0093892662327537,6.8984941164381528,7.6721141526788701,8.1762815419752375,9.105052029397493,8.350767822900572,null,16.955764892336816,10.365494803267106,27.321259695603921,null,40.202709663390323,0.47148082157643229]
[null,null,"Transformers ",0,0.89722969258221352,1.1974679253820557,0.67017008262066957,1.7805597825874828,1.1674374658587645,1.2441266193533302,1.3454640512111147,1.6554640053449992,1.878922760152629,null,2.0946976179642691,2.4507298652081522,4.5454274831724213,null,7.2914149019208372,0.60412082888007934]
[null,null,"Substation",0.89762286427630034,2.3926125135525695,2.2951468569822735,1.5637301927815628,2.559554687469507,1.2735681445731974,1.2441266193533302,1.2419668165025675,1.2415980040087495,1.2526151734350859,null,5.5853822348111439,4.1232848802510702,9.7086671150622141,null,6.2538747578729303,-0.35584620589467447]
[null,"EHV","Overhead lines",9.9735873808477815E-2,0.49846094032345195,0.99788993781837976,3.4625454268734597,0.89027989129374141,2.0164828955742293,6.4279875333255392,2.3804363982965873,12.209047039419369,7.4113064428242588,null,1.5960867519503097,4.3528253181672012,5.9489120701175109,null,30.445260309439984,4.1177862356332637]
[null,null,"Underground cables",1.4960381071271673,1.3956906329056653,1.8959908818549214,0,1.1128498641171769,0,0,5.0713645007188175,3.1039950100218734,0,null,4.7877196218877547,1.1128498641171769,5.9005694860049314,null,8.1753595107406909,0.38552041970374967]
[null,null,"Submarine",0,0,0,0,0,0,0,0,0,0,null,0,0,0,null,0,"0"]
[null,null,"Switchgear (incl other plant & equipment)",0.29920762142543345,0.89722969258221352,1.1974679253820557,1.1169501377011162,1.0015648777054591,1.6980908594309299,2.6956076752655487,4.8643700313017222,3.9317270126943726,6.8893834538929726,null,2.3939052393897029,2.1185150154065751,4.5124202547962788,null,20.079179032585547,3.4497582004342937]
[null,null,"Transformers ",0.19947174761695563,0.89722969258221352,0.49894496890918988,0.67017008262066957,0.55642493205858834,0.74291475100103188,1.8661899290299955,2.6909281024222294,2.6901290086856235,0.73069218450380025,null,1.5956464091083589,1.2265950146792579,2.8222414237876166,null,8.7208539756426813,2.0900453455674866]
[null,null,"Substation",0.19947174761695563,1.4953828209703559,0.99788993781837976,2.2339002754022323,2.2256997282343538,0.31839203614329936,0.10367721827944419,0.2069944694170946,0.10346650033406245,0.20876919557251436,null,2.6927445064056914,4.4596000036365862,7.152344510042278,null,0.94129941974641507,-0.86839288593764186]
[null,"132kV","Overhead lines",0.79788699046782252,0.89722969258221352,7.7835415149833613,8.3771260327583708,6.8996691575264961,2.7593976465752608,0,0.72448064295983106,0,4.3841531070228017,null,9.478658198033397,15.276795190284867,24.755453388318266,null,7.8680313965578934,-0.68216977192303407]
[null,null,"Underground cables",2.9920762142543347,0.29907656419407114,0,0,0.55642493205858845,1.2735681445731974,5.7022470053694292,6.8308174907641206,9.8293175317359314,9.9165367896944296,null,3.2911527784484056,0.55642493205858845,3.8475777105069939,null,33.55248696213711,7.7204182700486408]
[null,null,"Submarine cables",0,0,0,0,0,0,0,0,0,0,null,0,0,0,null,0,"0"]
[null,null,"Switchgear (incl other plant & equipment)",2.8923403404458568,1.8941515732291172,0.19957798756367595,0,4.6739694292921428,12.735681445731974,11.92288010213608,6.8308174907641206,3.8282605123603104,3.8622301180915155,null,4.9860699012386496,4.6739694292921428,9.6600393305307932,null,39.179869669083999,3.0558706158943942]
[null,null,"Transformers ",2.0944533499780342,0.79753750451752314,0,0,2.1144147418226358,2.0164828955742293,2.4882532387066605,1.9664474594623982,1.9658635063471863,0,null,2.8919908544955573,2.1144147418226358,5.006405596318193,null,8.4370471000904743,0.68525041324962588]
[null,null,"Substation",0,0,0,0,0,0.19526135742886624,0,0,0,0,null,0,0,0,null,0.19526135742886624,"0"]
[null,"Total non-load replacement (£m)",null,24.535024956885543,30.206732983601189,40.115175500298861,44.901395535584868,51.41366372221357,46.786629313065006,54.637894033267088,56.095501212032637,63.838830706116525,59.7079899337391,null,94.856933440785596,96.315059257798438,191.17199269858406,null,281.06684519822034,0.47023024257204432]
[]
[]
[null,"Proactive condition based replacement (non fault)"]
[]
[null,"Asset Categories",null,"DPCR 4",null,null,null,null,"DPCR 5",null,null,null,null,null,"DPCR4",null,null,null,"DPCR5"]
[null,null,null,"2005/06","2006/07","2007/08","2008/09","2009/10","2010/11","2011/12","2012/13","2013/14","2014/15",null,"Actuals","Forecast","Total",null,"Forecast","% change"]
[null,null,null,"£m","£m","£m","£m","£m","£m","£m","£m","£m","£m"]
[null,"Metered LV Services","Overhead",0.29920762142543345,0.29907656419407114,1.0976789316002178,4.0210204957240183,2.3369847146460714,1.9103522168597962,1.8661899290299955,1.8629502247538514,1.9658635063471863,1.983307357938886,null,1.6959631172197223,6.3580052103700897,8.0539683275898124,null,9.5886632349297152,0.19055139589792344]
[null,null,"Underground",1.6955098547441227,2.2929203254878789,3.492614782364329,0.22339002754022322,0.66770991847030603,1.2735681445731974,1.3478038376327743,1.4489612859196621,1.6554640053449992,1.7745381623663716,null,7.4810449625963304,0.89109994601052922,8.3721449086068596,null,7.5003354358370045,-0.10413215278603268]
[null,"Un-metered LV Services","Overhead",0,0,0,0,0,0,0,0,0,0,null,0,0,0,null,0,"0"]
[null,null,"Underground",0,0,0,0,0,0,0,0,0,0,null,0,0,0,null,0,"0"]
[null,"LV System","Overhead mains",0.39894349523391126,0.49846094032345195,0.69852295647286589,4.9145806058849111,4.7852544157038608,1.2735681445731974,1.2441266193533302,1.3454640512111147,1.3450645043428118,1.3569997712213433,null,1.595927392030229,9.6998350215887719,11.295762413619002,null,6.5652230907017977,-0.41878884750742618]
[null,null,"Underground mains",1.3963022333186894,2.3926125135525691,3.8917707574916807,0.22339002754022322,0.66770991847030603,0.84904542971546504,0.82941774623555353,1.1384695817940202,1.4485310046768742,1.6701535645801149,null,7.6806855043629394,0.89109994601052922,8.5717854503734685,null,5.9356173270020278,-0.30754014302312993]
[null,null,"Switchgear (incl other plant & equipment)",0.19947174761695563,0.29907656419407114,0.3991559751273519,0.11169501377011161,0.66770991847030603,0.42452271485773252,0.51838609139722092,0.62098340825128373,0.72426550233843712,0.83507678229005744,null,0.89770428693837867,0.77940493224041762,1.6771092191787962,null,3.1232344991347318,0.86227257200579766]
[null,"HV","Overhead lines",2.6928685928289013,2.6916890777466405,2.6943028321096252,11.616281432091608,10.126933763466308,6.3678407228659877,5.8059242236488746,5.4853534395530064,5.1733250167031217,5.1148452915266009,null,8.078860502685167,21.743215195557916,29.822075698243083,null,27.94728869429759,-6.2865744923849901E-2]
[null,null,"Underground cables",1.4960381071271673,1.9938437612938078,3.0934588072369773,0.55847506885055809,1.0015648777054591,1.0613067871443311,1.1404494010738859,1.2419668165025675,1.2415980040087493,1.4613843690076003,null,6.5833406756579524,1.5600399465560173,8.1433806222139697,null,6.1467053777371339,-0.2451899692653679]
[null,null,"Submarine",0,0,0,0,0,0,0,0,0,0,null,0,0,0,null,0,"0"]
[null,null,"Switchgear (incl other plant & equipment)",3.2912838356797676,5.4830703435579711,5.5881836517829262,3.4625454268734597,5.1191093749390122,6.1555793654371209,6.946373624722761,7.4518008990154057,8.3807865270590565,7.6200756383967727,null,14.362537831020664,8.5816548018124728,22.944192632833133,null,36.554616054631111,0.59319687729266479]
[null,null,"Transformers ",0,0.39876875225876157,0.49894496890918988,0.33508504131033479,1.4467048233523299,0.84904542971546504,0.93309496451499774,1.0349723470854728,1.2415980040087493,1.4613843690076003,null,0.89771372116795145,1.7817898646626646,2.679503585830616,null,5.5200951143322854,1.0601185770091508]
[null,null,"Substation",0.69815111665934471,1.9938437612938078,1.8959908818549214,1.228645151471228,2.2256997282343538,0.95517610842989809,0.93309496451499774,0.93147511237692571,0.93119850300656215,0.93946138007631452,null,4.587985759808074,3.454344879705582,8.042330639513656,null,4.6904060684046982,-0.41678522325857259]
[null,"EHV","Overhead lines",9.9735873808477815E-2,0.49846094032345195,0.99788993781837976,3.4625454268734597,0.89027989129374141,2.0164828955742293,6.4279875333255392,2.3804363982965873,12.209047039419369,7.4113064428242588,null,1.5960867519503097,4.3528253181672012,5.9489120701175109,null,30.445260309439984,4.1177862356332637]
[null,null,"Underground cables",1.4960381071271673,1.3956906329056653,1.8959908818549214,0,1.1128498641171769,0,0,5.0713645007188175,3.1039950100218734,0,null,4.7877196218877547,1.1128498641171769,5.9005694860049314,null,8.1753595107406909,0.38552041970374967]
[null,null,"Submarine",0,0,0,0,0,0,0,0,0,0,null,0,0,0,null,0,"0"]
[null,null,"Switchgear (incl other plant & equipment)",0.29920762142543345,0.79753750451752314,1.0976789316002178,1.0052551239310046,0.89027989129374141,1.5919601807164967,2.5919304569861046,4.7608727965931745,3.8282605123603104,6.7849988561067152,null,2.1944240575431744,1.8955350152247461,4.08995907276792,null,19.558022802762803,3.7819605171566471]
[null,null,"Transformers ",9.9735873808477815E-2,0.39876875225876157,0.19957798756367595,0.33508504131033479,0.22256997282343535,0.53065339357216557,1.6588354924711071,2.4839336330051349,2.4831960080174986,0.52192298893128586,null,0.69808261363091528,0.55765501413377017,1.2557376277646854,null,7.6785415159971917,5.1147658127164801]
[null,null,"Substation",0.19947174761695563,1.4953828209703559,0.99788993781837976,2.2339002754022323,2.2256997282343538,0.31839203614329936,0.10367721827944419,0.2069944694170946,0.10346650033406245,0.20876919557251436,null,2.6927445064056914,4.4596000036365862,7.152344510042278,null,0.94129941974641507,-0.86839288593764186]
[null,"132kV","Overhead lines",0.79788699046782252,0.89722969258221352,7.7835415149833613,8.3771260327583708,6.8996691575264961,2.7593976465752608,0,0.72448064295983106,0,4.3841531070228017,null,9.478658198033397,15.276795190284867,24.755453388318266,null,7.8680313965578934,-0.68216977192303407]
[null,null,"Underground cables",2.9920762142543347,0.29907656419407114,0,0,0.55642493205858845,1.2735681445731974,5.7022470053694292,6.8308174907641206,9.8293175317359314,9.9165367896944296,null,3.2911527784484056,0.55642493205858845,3.8475777105069939,null,33.55248696213711,7.7204182700486408]
[null,null,"Submarine cables",0,0,0,0,0,0,0,0,0,0,null,0,0,0,null,0,"0"]
[null,null,"Switchgear (incl other plant & equipment)",2.8923403404458568,1.8941515732291172,0.19957798756367595,0,4.6739694292921428,12.735681445731974,11.92288010213608,6.8308174907641206,3.8282605123603104,3.8622301180915155,null,4.9860699012386496,4.6739694292921428,9.6600393305307932,null,39.179869669083999,3.0558706158943942]
[null,null,"Transformers ",2.0944533499780342,0.79753750451752314,0,0,2.1144147418226358,2.0164828955742293,2.4882532387066605,1.9664474594623982,1.9658635063471863,0,null,2.8919908544955573,2.1144147418226358,5.006405596318193,null,8.4370471000904743,0.68525041324962588]
[null,null,"Substation",0,0,0,0,0,0.19526135742886624,0,0,0,0,null,0,0,0,null,0.19526135742886624,"0"]
[null,"Total proactive condition based replacement (£m)",null,23.138722723566854,26.817198589401716,36.522771724152697,42.109020191332078,48.631539061920627,44.557885060061913,52.460672449398757,53.818562048444598,61.459101198433089,57.307144184655186,null,86.478693037121275,90.740559253252712,177.21925229037399,null,269.60336494099352,0.52129839990097704]
[]
[]
[null,"Reactive condition-based replacement (fault)"]
[]
[null,"Asset Categories",null,"DPCR 4",null,null,null,null,"DPCR 5",null,null,null,null,null,"DPCR4",null,null,null,"DPCR5"]
[null,null,null,"2005/06","2006/07","2007/08","2008/09","2009/10","2010/11","2011/12","2012/13","2013/14","2014/15",null,"Actuals","Forecast","Total",null,"Forecast","% change"]
[null,null,null,"£m","£m","£m","£m","£m","£m","£m","£m","£m","£m"]
[null,"Metered LV Services","Overhead",0,0,0,0,0,0,0,0,0,0,null,0,0,0,null,0,"0"]
[null,null,"Underground",0,9.9692188064690393E-2,9.9788993781837976E-2,0.11169501377011161,0.11128498641171768,0,0,0,0,0,null,0.19948118184652835,0.22298000018182929,0.42246118202835764,null,0,-1]
[null,"Un-metered LV Services","Overhead",0,0,0,0,0,0,0,0,0,0,null,0,0,0,null,0,"0"]
[null,null,"Underground",0,0,0,0,0,0,0,0,0,0,null,0,0,0,null,0,"0"]
[null,"LV System","Overhead mains",0,0,0,0,0,0,0,0,0,0,null,0,0,0,null,0,"0"]
[null,null,"Underground mains",0,9.9692188064690393E-2,9.9788993781837976E-2,0.11169501377011161,0.11128498641171768,0,0,0.1034972347085473,0.10346650033406245,0.10438459778625718,null,0.19948118184652835,0.22298000018182929,0.42246118202835764,null,0.31134833282886692,-0.26301315701008543]
[null,null,"Switchgear (incl other plant & equipment)",0.39894349523391126,0.59815312838814227,0.79831195025470381,0.44678005508044644,0.4451399456468707,0.42452271485773252,0.41470887311777677,0.41398893883418919,0.41386600133624979,0.41753839114502872,null,1.7954085738767573,0.89192000072731714,2.6873285746040745,null,2.0846249192909769,-0.22427613095354154]
[null,"HV","Overhead lines",9.9735873808477815E-2,9.9692188064690393E-2,9.9788993781837976E-2,0.11169501377011161,0.11128498641171768,0.10613067871443313,0.10367721827944419,0.1034972347085473,0.10346650033406245,0.10438459778625718,null,0.29921705565500617,0.22298000018182929,0.5221970558368354,null,0.52115622982274423,-1.9931671434325008E-3]
[null,null,"Underground cables",0,0,0,0,0,0,0,0,0,0,null,0,0,0,null,0,"0"]
[null,null,"Submarine",0,0,0,0,0,0,0,0,0,0,null,0,0,0,null,0,"0"]
[null,null,"Switchgear (incl other plant & equipment)",0.59841524285086689,0.9969218806469039,0.99788993781837976,0.89356011016089287,0.89027989129374141,0.74291475100103177,0.72574052795610933,0.72448064295983106,0.72426550233843712,0.73069218450380014,null,2.5932270613161506,1.7838400014546343,4.3770670627707844,null,3.6480936087592091,-0.16654381656883235]
[null,null,"Transformers ",0,0.49846094032345195,0.69852295647286577,0.33508504131033479,0.33385495923515301,0.31839203614329936,0.31103165483833256,0.31049170412564187,0.41386600133624979,0.41753839114502872,null,1.1969838967963178,0.66894000054548775,1.8659238973418055,null,1.7713197875885525,-5.0700947604575962E-2]
[null,null,"Substation",0.19947174761695563,0.39876875225876157,0.3991559751273519,0.33508504131033479,0.33385495923515301,0.31839203614329936,0.31103165483833256,0.31049170412564187,0.31039950100218733,0.31315379335877147,null,0.99739647500306905,0.66894000054548775,1.6663364755485568,null,1.5634686894682326,-6.1732901841724495E-2]
[null,"EHV","Overhead lines",0,0,0,0,0,0,0,0,0,0,null,0,0,0,null,0,"0"]
[null,null,"Underground cables",0,0,0,0,0,0,0,0,0,0,null,0,0,0,null,0,"0"]
[null,null,"Submarine",0,0,0,0,0,0,0,0,0,0,null,0,0,0,null,0,"0"]
[null,null,"Switchgear (incl other plant & equipment)",0,9.9692188064690393E-2,9.9788993781837976E-2,0.11169501377011161,0.11128498641171768,0.10613067871443313,0.10367721827944419,0.1034972347085473,0.10346650033406245,0.10438459778625718,null,0.19948118184652835,0.22298000018182929,0.42246118202835764,null,0.52115622982274423,0.23361921045745146]
[null,null,"Transformers ",9.9735873808477815E-2,0.49846094032345195,0.29936698134551393,0.33508504131033479,0.33385495923515301,0.21226135742886626,0.20735443655888838,0.2069944694170946,0.20693300066812489,0.20876919557251436,null,0.8975637954774438,0.66894000054548775,1.5665037960229315,null,1.0423124596454885,-0.33462500231934938]
[null,null,"Substation",0,0,0,0,0,0,0,0,0,0,null,0,0,0,null,0,"0"]
[null,"132kV","Overhead lines",0,0,0,0,0,0,0,0,0,0,null,0,0,0,null,0,"0"]
[null,null,"Underground cables",0,0,0,0,0,0,0,0,0,0,null,0,0,0,null,0,"0"]
[null,null,"Submarine cables",0,0,0,0,0,0,0,0,0,0,null,0,0,0,null,0,"0"]
[null,null,"Switchgear (incl other plant & equipment)",0,0,0,0,0,0,0,0,0,0,null,0,0,0,null,0,"0"]
[null,null,"Transformers ",0,0,0,0,0,0,0,0,0,0,null,0,0,0,null,0,"0"]
[null,null,"Substation",0,0,0,0,0,0,0,0,0,0,null,0,0,0,null,0,"0"]
[null,"Total reactive condition based replacement (£m)",null,1.3963022333186892,3.3895343941994738,3.5924037761461669,2.7923753442527905,2.7821246602929421,2.2287442530030952,2.1772215838683278,2.2769391635880405,2.3797295076834359,2.4008457490839148,null,8.3782404036643303,5.5745000045457331,13.952740408210063,null,11.463480257226815,-0.1784065408053116]
[]
[]
[null,"Overhead line refurbishment / replacement"]
[]
[null,"Asset Categories",null,"DPCR 4",null,null,null,null,"DPCR 5",null,null,null,null,null,"DPCR4",null,null,null,"DPCR5"]
[null,null,null,"2005/06","2006/07","2007/08","2008/09","2009/10","2010/11","2011/12","2012/13","2013/14","2014/015",null,"Actuals","Forecast","Total",null,"Forecast","% change"]
[null,null,null,"£m","£m","£m","£m","£m","£m","£m","£m","£m","£m"]
[null,"LV Mains","Refurbishment",0,0,0,0.22339002754022322,1.3354198369406121,0,0,0,0,0,null,0,1.5588098644808352,1.5588098644808352,null,0,-1]
[null,null,"Full rebuild",9.9735873808477815E-2,9.9692188064690393E-2,9.9788993781837976E-2,0.89356011016089287,0.55642493205858845,0.74291475100103177,0.72574052795610933,0.82797787766837838,0.82773200267249958,0.83507678229005744,null,0.29921705565500617,1.4499850422194813,1.7492020978744875,null,3.9594419415880768,1.2635703138015462]
[null,null,"Undergrounding",0.29920762142543345,0.39876875225876157,0.59873396269102785,3.7976304681837947,2.8934096467046597,0.53065339357216557,0.51838609139722092,0.51748617354273641,0.51733250167031231,0.52192298893128586]
[null,null,"Covered Conductor",0,0,0,0,0,0,0,0,0,0]
[null,null,"Pole replacement only (i.e. D poles)",0,0,0,0,0,0,0,0,0,0]
[null,null,"Total OHL expenditure (£m)",0.39894349523391126,0.49846094032345195,0.69852295647286589,4.9145806058849111,4.7852544157038608,1.2735681445731974,1.2441266193533302,1.3454640512111147,1.3450645043428118,1.3569997712213433,null,1.595927392030229,9.6998350215887719,11.295762413619002,null,6.5652230907017977,-0.41878884750742618]
[null,"HV","Refurbishment",1.2965663595102117,1.2959984448409752,1.2972569191638936,5.5847506885055802,5.1191093749390122,2.2287442530030956,1.9698671473094393,1.8629502247538514,1.7589305056790614,1.7745381623663716,null,3.8898217235150803,10.703860063444592,14.593681786959671,null,9.5950302931118188,-0.34252161769858835]
[null,null,"Full rebuild",0.59841524285086689,0.59815312838814227,0.59873396269102785,2.457290302942456,3.5611195651749656,4.139096469862892,3.836057076339435,3.6224032147991552,3.4143945110240606,3.3403071291602298,null,1.7953023339300369,6.0184098681174216,7.8137122020474585,null,18.352258401185772,1.3487246428626916]
[null,null,"Undergrounding",0.79788699046782252,0.79753750451752314,0.79831195025470381,3.5742404406435715,1.4467048233523299,0,0,0,0,0]
[null,null,"Covered Conductor",0,0,0,0,0,0,0,0,0,0]
[null,null,"Pole replacement only (i.e. D poles)",0,0,0,0,0,0,0,0,0,0]
[null,null,"Total OHL expenditure (£m)",2.6928685928289013,2.6916890777466405,2.6943028321096252,11.616281432091608,10.126933763466308,6.3678407228659877,5.8059242236488746,5.4853534395530064,5.1733250167031217,5.1148452915266009,null,8.078860502685167,21.743215195557916,29.822075698243083,null,27.94728869429759,-6.2865744923849901E-2]
[null,"EHV - Pole line","Refurbishment",9.9735873808477815E-2,0.49846094032345195,0.99788993781837976,3.4625454268734597,0.66770991847030603,0,0.10367721827944419,0.41398893883418919,0,0.20876919557251436,null,1.5960867519503097,4.130255345343766,5.7263420972940757,null,0.72643535268614778,-0.87314146791379843]
[null,null,"Full rebuild",0,0,0,0,0,1.804221538145363,5.9096014419283183,1.9664474594623982,11.070915535744682,6.8893834538929735,null,0,0,0,null,27.640569429173738,"0"]
[null,null,"Undergrounding",0,0,0,0,0.22256997282343535,0,0.41470887311777677,0,0,0]
[null,null,"Pole replacement only (i.e. D poles)",0,0,0,0,0,0,0,0,0,0]
[null,"EHV - Tower line","Fittings only",0,0,0,0,0,0,0,0,0,0,null,0,0,0,null,0,"0"]
[null,null,"Reconductoring",0,0,0,0,0,0.21226135742886626,0,0,0.10346650033406245,0.31315379335877147,null,0,0,0,null,0.62888165112170014,"0"]
[null,null,"Undergrounding",0,0,0,0,0,0,0,0,0.20693300066812489,0]
[null,null,"Tower Refurbishment",0,0,0,0,0,0,0,0,0.82773200267249958,0]
[null,"EHV Total","Total OHL expenditure (£m)",9.9735873808477815E-2,0.49846094032345195,0.99788993781837976,3.4625454268734597,0.89027989129374141,2.0164828955742293,6.4279875333255392,2.3804363982965873,12.209047039419369,7.4113064428242588,null,1.5960867519503097,4.3528253181672012,5.9489120701175109,null,30.445260309439984,4.1177862356332637]
[null,"132kV - Pole Line","Refurbishment",0,0,0,0,0,0,0,0,0,0,null,0,0,0,null,0,"0"]
[null,null,"Full rebuild",0,0,0,0,0,0,0,0,0,0,null,0,0,0,null,0,"0"]
[null,null,"Undergrounding",0,0,0,0,0,0,0,0,0,0]
[null,null,"Pole replacement only (i.e. D poles)",0,0,0,0,0,0,0,0,0,0]
[null,"132kV - Tower line","Fittings only",0,0,0,0,0,0,0,0,0,0]
[null,null,"Reconductoring",0.79788699046782252,0.89722969258221352,7.7835415149833613,8.3771260327583708,3.7836895379984008,2.1226135742886623,0,0.72448064295983106,0,4.3841531070228017,null,9.478658198033397,12.160815570756771,21.639473768790172,null,7.2312473242712949,-0.66583072206216676]
[null,null,"Undergrounding",0,0,0,0,3.1159796195280949,0,0,0,0,0]
[null,null,"Tower Refurbishment",0,0,0,0,0,0.63678407228659872,0,0,0,0,null,0,0,0,null,0.63678407228659872,"0"]
[null,"132 kV Total","Total OHL expenditure (£m)",0.79788699046782252,0.89722969258221352,7.7835415149833613,8.3771260327583708,6.8996691575264961,2.7593976465752608,0,0.72448064295983106,0,4.3841531070228017,null,9.478658198033397,15.276795190284867,24.755453388318266,null,7.8680313965578934,-0.68216977192303407]
[]
[null,"LV Services - Split of activities "]
[]
[null,"Asset Categories",null,"DPCR 4",null,null,null,null,"DPCR 5",null,null,null,null,null,"DPCR4",null,null,null,"DPCR5"]
[null,null,null,"2005/06","2006/07","2007/08","2008/09","2009/10","2010/11","2011/12","2012/13","2013/14","2014/015",null,"Actuals","Forecast","Total",null,"Forecast","% change"]
[null,null,null,"£m","£m","£m","£m","£m","£m","£m","£m","£m","£m"]
[null,"LV Services - metered only","OHL"]
[null,null,"Service Replacement",null,null,null,null,null,null,null,null,null,null,null,{"$f":"SUM(D146:G146)","v":0},{"$f":"H146","v":0},{"$f":"SUM(D146:H146)","v":0},null,{"$f":"SUM(I146:M146)","v":0},{"$f":"IF(Q146<>0,(S146-Q146)/Q146,\"0\")","v":"0"}]
[null,null,"Cut out Replacement",null,null,null,null,null,null,null,null,null,null,null,0,0,0,null,0,"0"]
[null,null,null,null,null,null,null,null,null,null,null,null,null,null,0,0,0,null,0,"0"]
[]
[null,null,"UG"]
[null,null,"Service Replacement",null,null,null,null,null,null,null,null,null,null,null,0,0,0,null,0,"0"]
[null,null,"Cut out Replacement",null,null,null,null,null,null,null,null,null,null,null,0,0,0,null,0,"0"]
[null,null,null,null,null,null,null,null,null,null,null,null,null,null,0,0,0,null,0,"0"]

{"sheet":"NL9 - Legal & Safety","index":18,"n_rows":137,"n_cols":24,"rows_kept":137,"cut":false,"hidden":false,"merged":[[6,1,7,2],[30,1,31,2],[39,1,40,2],[58,1,59,1],[67,1,68,1],[57,1,57,7],[131,2,132,2],[131,10,132,10],[131,18,132,18],[121,1,121,7],[121,9,121,15],[121,17,121,23],[122,2,123,2],[122,10,123,10],[122,18,123,18],[130,1,130,7],[122,1,123,1],[131,1,132,1],[75,1,75,7],[75,9,75,15],[76,2,77,2],[76,10,77,10],[75,17,75,23],[76,18,77,18],[76,1,77,1],[76,17,77,17],[113,2,114,2],[112,1,112,7],[112,9,112,15],[112,17,112,23],[130,9,130,15],[130,17,130,23],[113,10,114,10],[113,18,114,18],[113,1,114,1],[103,1,103,7],[103,9,103,15],[103,17,103,23],[104,2,105,2],[104,3,104,7],[104,10,105,10],[104,18,105,18],[104,1,105,1],[66,9,66,15],[66,17,66,23],[67,18,68,18],[66,1,66,7],[67,2,68,2],[67,10,68,10],[67,17,68,17],[84,1,84,7],[84,9,84,15],[84,17,84,23],[85,2,86,2],[85,10,86,10],[85,18,86,18],[85,3,85,7],[85,1,86,1],[85,17,86,17],[57,9,57,15],[57,17,57,23],[58,2,59,2],[58,10,59,10],[58,18,59,18],[58,3,58,7],[58,19,58,23],[58,17,59,17]]}
["June Forecast Business Plan DPCR5"]
["EDFE SPN"]
["NL9 - Legal and safety"]
[]
[null,"Legal and Safety"]
[]
[null,null,null,"DPCR4",null,null,null,null,"DPCR5"]
[null,null,null,"2005/06","2006/07","2007/08","2008/09","2009/10","2010/11","2011/12","2012/13","2013/14","2014/15"]
[null,"ESQCR"]
[null,"ESQCR 43-8 Clearance","£m"]
[null,"ESQCR tree continuity","£m"]
[null,"ESQCR Other","£m"]
[null,"CNI"]
[null,"Black Start","£m"]
[null,"Emergency Batteries","£m"]
[null,"Critical National Infrastructure","£m"]
[null,"Other"]
[null,"Site Security","£m"]
[null,"Asbestos clearance","£m"]
[null,"Safety climbing devices","£m"]
[null,"Rising mains and laterals","£m"]
[null,null,"£m"]
[null,"Retrofit ABSD & Earthing theft & Replace 0.025 OH conductor","£m"]
[null,"Fire Prevention","£m"]
[null,"Total","£m",{"$f":"SUM(D10:D24)","v":0},0,0,0,0,0,0,0,0,0]
[]
[]
[null,"ESQCR 43-8 Safety Clearance Expenditure"]
[]
[null,"Horizontal"]
[null,null,null,"DPCR4",null,null,null,null,"DPCR5"]
[null,null,null,"2005/06","2006/07","2007/08","2008/09","2009/10","2010/11","2011/12","2012/13","2013/14","2014/15"]
[null,"LV ","£m"]
[null,"HV","£m"]
[null,"EHV","£m"]
[null,"132 kV","£m"]
[null,"Total","£m",{"$f":"SUM(D33:D36)","v":0},0,0,0,0,0,0,0,0,0]
[]
[null,"Vertical"]
[null,null,null,"DPCR4",null,null,null,null,"DPCR5"]
[null,null,null,"2005/06","2006/07","2007/08","2008/09","2009/10","2010/11","2011/12","2012/13","2013/14","2014/15"]
[null,"LV ","£m"]
[null,"HV","£m"]
[null,"EHV","£m"]
[null,"132 kV","£m"]
[null,"Total","£m",{"$f":"SUM(D42:D45)","v":0},0,0,0,0,0,0,0,0,0]
[]
[null,"Horizontal - Detailed Information"]
[]
[null,null,"Sites affected as at April 2005","No of sites resolved 05/06 - 07/08","Sites affected as at April 2008","No of sites to be resolved 08/09 - 09/10","No of sites to be resolved in DPCR5","Sites affected as at April 2015"]
[null,"LV ",{"$f":"D51+E51","v":0},{"$f":"C61","v":0},null,{"$f":"K61","v":0},{"$f":"S61","v":0},{"$f":"E51-SUM(F51:G51)","v":0}]
[null,"HV",{"$f":"D52+E52","v":0},{"$f":"C62","v":0},null,{"$f":"K62","v":0},{"$f":"S62","v":0},{"$f":"E52-SUM(F52:G52)","v":0}]
[null,"EHV",{"$f":"D53+E53","v":0},{"$f":"C63","v":0},null,{"$f":"K63","v":0},{"$f":"S63","v":0},{"$f":"E53-SUM(F53:G53)","v":0}]
[null,"132 kV",{"$f":"D54+E54","v":0},{"$f":"C64","v":0},null,{"$f":"K64","v":0},{"$f":"S64","v":0},{"$f":"E54-SUM(F54:G54)","v":0}]
[null,"Total",{"$f":"SUM(C51:C54)","v":0},0,0,0,0,0]
[]
[]
[null,"05/06 - 07/08",null,null,null,null,null,null,null,"08/09-09/10",null,null,null,null,null,null,null,"DPCR5"]
[null,null,"No of sites resolved","Actual Solutions (#)",null,null,null,null,null,null,"No of sites resolved","Forecast Solutions (#)",null,null,null,null,null,null,"No of sites resolved","Forecast Solutions (#)"]
[null,null,null,"Shrouding","Diversions","Under-grounding","Covered conductors","As part of other planned work",null,null,null,"Shrouding","Diversions","Under-grounding","Covered conductors","As part of other planned work",null,null,null,"Shrouding","Diversions","Under-grounding","Covered conductors","As part of other planned work"]
[null,"LV ",{"$f":"SUM(D61:H61)","v":0},null,null,null,null,null,null,"LV ",{"$f":"SUM(L61:P61)","v":0},null,null,null,null,null,null,"LV ",{"$f":"SUM(T61:X61)","v":0}]
[null,"HV",{"$f":"SUM(D62:H62)","v":0},null,null,null,null,null,null,"HV",{"$f":"SUM(L62:P62)","v":0},null,null,null,null,null,null,"HV",{"$f":"SUM(T62:X62)","v":0}]
[null,"EHV",{"$f":"SUM(D63:H63)","v":0},null,null,null,null,null,null,"EHV",{"$f":"SUM(L63:P63)","v":0},null,null,null,null,null,null,"EHV",{"$f":"SUM(T63:X63)","v":0}]
[null,"132 kV",{"$f":"SUM(D64:H64)","v":0},null,null,null,null,null,null,"132 kV",{"$f":"SUM(L64:P64)","v":0},null,null,null,null,null,null,"132 kV",{"$f":"SUM(T64:X64)","v":0}]
[null,"Total",{"$f":"SUM(C61:C64)","v":0},0,0,0,0,0,null,"Total",{"$f":"SUM(K61:K64)","v":0},0,0,0,0,0,null,"Total",{"$f":"SUM(S61:S64)","v":0},0,0,0,0,0]
[]
[null,"05/06 - 07/08",null,null,null,null,null,null,null,"08/09-09/10",null,null,null,null,null,null,null,"DPCR5"]
[null,null,"No of spans changed","Actual Solutions (#)",null,null,null,null,null,null,"No of spans changed","Forecast Solutions (#)",null,null,null,null,null,null,"No of spans changed","Forecast Solutions (#)"]
[null,null,null,"Shrouding","Diversions","Under-grounding","Covered conductors","As part of other planned work",null,null,null,"Shrouding","Diversions","Under-grounding","Covered conductors","As part of other planned work",null,null,null,"Shrouding","Diversions","Under-grounding","Covered conductors","As part of other planned work"]
[null,"LV ",null,null,null,null,null,null,null,"LV ",null,null,null,null,null,null,null,"LV "]
[null,"HV",null,null,null,null,null,null,null,"HV",null,null,null,null,null,null,null,"HV"]
[null,"EHV",null,null,null,null,null,null,null,"EHV",null,null,null,null,null,null,null,"EHV"]
[null,"132 kV",null,null,null,null,null,null,null,"132 kV",null,null,null,null,null,null,null,"132 kV"]
[null,"Total",{"$f":"SUM(C70:C73)","v":0},0,0,0,0,0,null,"Total",{"$f":"SUM(K70:K73)","v":0},0,0,0,0,0,null,"Total",{"$f":"SUM(S70:S73)","v":0},0,0,0,0,0]
[]
[null,"05/06 - 07/08",null,null,null,null,null,null,null,"08/09-09/10",null,null,null,null,null,null,null,"DPCR5"]
[null,null,"Total Cost £m","Expenditure £m",null,null,null,null,null,null,"Total Cost £m","Forecast Solutions (£m)",null,null,null,null,null,null,"Total Cost £m","Forecast Solutions (£m)"]
[null,null,null,"Shrouding","Diversions","Under-grounding","Covered conductors","As part of other planned work",null,null,null,"Shrouding","Diversions","Under-grounding","Covered conductors","As part of other planned work",null,null,null,"Shrouding","Diversions","Under-grounding","Covered conductors","As part of other planned work"]
[null,"LV ",null,null,null,null,null,null,null,"LV ",{"$f":"SUM(G33:H33)","v":0},null,null,null,null,null,null,"LV ",{"$f":"SUM(I33:M33)","v":0}]
[null,"HV",null,null,null,null,null,null,null,"HV",{"$f":"SUM(G34:H34)","v":0},null,null,null,null,null,null,"HV",{"$f":"SUM(I34:M34)","v":0}]
[null,"EHV",null,null,null,null,null,null,null,"EHV",{"$f":"SUM(G35:H35)","v":0},null,null,null,null,null,null,"EHV",{"$f":"SUM(I35:M35)","v":0}]
[null,"132 kV",null,null,null,null,null,null,null,"132 kV",{"$f":"SUM(G36:H36)","v":0},null,null,null,null,null,null,"132 kV",{"$f":"SUM(I36:M36)","v":0}]
[null,"Total",{"$f":"SUM(C79:C82)","v":0},0,0,0,0,0,null,"Total",{"$f":"SUM(K79:K82)","v":0},0,0,0,0,0,null,"Total",{"$f":"SUM(S79:S82)","v":0},0,0,0,0,0]
[]
[null,"05/06 - 07/08",null,null,null,null,null,null,null,"08/09-09/10",null,null,null,null,null,null,null,"DPCR5"]
[null,null,"Total unit Cost £k/per span","Unit cost £k/span",null,null,null,null,null,null,"Total unit Cost £k/per span","Forecast Unit cost £k/span",null,null,null,null,null,null,"Total unit Cost £k/per span","Forecast Unit cost £k/span"]
[null,null,null,"Shrouding","Diversions","Under-grounding","Covered conductors","As part of other planned work",null,null,null,"Shrouding","Diversions","Under-grounding","Covered conductors",null,null,null,null,"Shrouding","Diversions","Under-grounding","Covered conductors"]
[null,"LV ",{"$f":"IF(C70>0,C79*1000/C70,0)","v":0},0,0,0,0,null,null,"LV ",{"$f":"IF(K70>0,K79*1000/K70,0)","v":0},0,0,0,0,null,null,"LV ",{"$f":"IF(S70>0,S79*1000/S70,0)","v":0},0,0,0,0]
[null,"HV",0,0,0,0,0,null,null,"HV",0,0,0,0,0,null,null,"HV",0,0,0,0,0]
[null,"EHV",0,0,0,0,0,null,null,"EHV",0,0,0,0,0,null,null,"EHV",0,0,0,0,0]
[null,"132 kV",0,0,0,0,0,null,null,"132 kV",0,0,0,0,0,null,null,"132 kV",0,0,0,0,0]
[]
[]
[null,"Vertical - Detailed Information"]
[]
[null,null,"Sites affected as at April 2005","No of sites resolved 05/06 - 07/08","Sites affected as at April 2008","No of sites to be resolved 08/09 - 09/10","No of sites to be resolved in DPCR5","Sites affected as at April 2015"]
[null,"LV ",{"$f":"D97+E97","v":0},{"$f":"C107","v":0},null,{"$f":"K107","v":0},{"$f":"S107","v":0},{"$f":"E97-SUM(F97:G97)","v":0}]
[null,"HV",{"$f":"D98+E98","v":0},{"$f":"C108","v":0},null,{"$f":"K108","v":0},{"$f":"S108","v":0},{"$f":"E98-SUM(F98:G98)","v":0}]
[null,"EHV",{"$f":"D99+E99","v":0},{"$f":"C109","v":0},null,{"$f":"K109","v":0},{"$f":"S109","v":0},{"$f":"E99-SUM(F99:G99)","v":0}]
[null,"132 kV",{"$f":"D100+E100","v":0},{"$f":"C110","v":0},null,{"$f":"K110","v":0},{"$f":"S110","v":0},{"$f":"E100-SUM(F100:G100)","v":0}]
[null,"Total",{"$f":"SUM(C97:C100)","v":0},0,0,0,0,0]
[]
[]
[null,"05/06 - 07/08",null,null,null,null,null,null,null,"08/09-09/10",null,null,null,null,null,null,null,"DPCR5"]
[null,null,"No of sites resolved","Actual Solutions (#)",null,null,null,null,null,null,"No of sites resolved","Forecast Solutions (#)",null,null,null,null,null,null,"No of sites resolved","Forecast Solutions (#)"]
[null,null,null,"Rebuild","Under-grounding","Other","Derogation","As part of other planned work",null,null,null,"Rebuild","Under-grounding","Other","Derogation","As part of other planned work",null,null,null,"Rebuild","Under-grounding","Other","Derogation","As part of other planned work"]
[null,"LV ",{"$f":"SUM(D107:H107)","v":0},null,null,null,null,null,null,"LV ",{"$f":"SUM(L107:P107)","v":0},null,null,null,null,null,null,"LV ",{"$f":"SUM(T107:X107)","v":0}]
[null,"HV",{"$f":"SUM(D108:H108)","v":0},null,null,null,null,null,null,"HV",{"$f":"SUM(L108:P108)","v":0},null,null,null,null,null,null,"HV",{"$f":"SUM(T108:X108)","v":0}]
[null,"EHV",{"$f":"SUM(D109:H109)","v":0},null,null,null,null,null,null,"EHV",{"$f":"SUM(L109:P109)","v":0},null,null,null,null,null,null,"EHV",{"$f":"SUM(T109:X109)","v":0}]
[null,"132 kV",{"$f":"SUM(D110:H110)","v":0},null,null,null,null,null,null,"132 kV",{"$f":"SUM(L110:P110)","v":0},null,null,null,null,null,null,"132 kV",{"$f":"SUM(T110:X110)","v":0}]
[null,"Total",{"$f":"SUM(C107:C110)","v":0},0,0,0,0,0,null,"Total",{"$f":"SUM(K107:K110)","v":0},0,0,0,0,0,null,"Total",{"$f":"SUM(S107:S110)","v":0},0,0,0,0,0]
[]
[null,"05/06 - 07/08",null,null,null,null,null,null,null,"08/09-09/10",null,null,null,null,null,null,null,"DPCR5"]
[null,null,"No of spans changed","Actual Solutions (#)",null,null,null,null,null,null,"No of spans changed","Forecast Solutions (#)",null,null,null,null,null,null,"No of spans changed","Forecast Solutions (#)"]
[null,null,null,"Rebuild","Under-grounding","Other","Derogation","As part of other planned work",null,null,null,"Rebuild","Under-grounding","Other","Derogation","As part of other planned work",null,null,null,"Rebuild","Under-grounding","Other","Derogation","As part of other planned work"]
[null,"LV ",null,null,null,null,null,null,null,"LV ",null,null,null,null,null,null,null,"LV "]
[null,"HV",null,null,null,null,null,null,null,"HV",null,null,null,null,null,null,null,"HV"]
[null,"EHV",null,null,null,null,null,null,null,"EHV",null,null,null,null,null,null,null,"EHV"]
[null,"132 kV",null,null,null,null,null,null,null,"132 kV",null,null,null,null,null,null,null,"132 kV"]
[null,"Total",{"$f":"SUM(C116:C119)","v":0},{"$f":"SUM(D116:D119)","v":0},{"$f":"SUM(E116:E119)","v":0},{"$f":"SUM(F116:F119)","v":0},null,{"$f":"SUM(H116:H119)","v":0},null,"Total",{"$f":"SUM(K116:K119)","v":0},0,0,0,0,0,null,"Total",{"$f":"SUM(S116:S119)","v":0},0,0,0,0,0]
[]
[null,"05/06 - 07/08",null,null,null,null,null,null,null,"08/09-09/10",null,null,null,null,null,null,null,"DPCR5"]
[null,null,"Total Cost £m","Expenditure £m",null,null,null,null,null,null,"Total Cost £m","Forecast Solutions (£m)",null,null,null,null,null,null,"Total Cost £m","Forecast Solutions (£m)"]
[null,null,null,"Rebuild","Under-grounding","Other","Derogation","As part of other planned work",null,null,null,"Rebuild","Under-grounding","Other","Derogation","As part of other planned work",null,null,null,"Rebuild","Under-grounding","Other","Derogation","As part of other planned work"]
[null,"LV ",{"$f":"SUM(D42:F42)","v":0},null,null,null,null,null,null,"LV ",{"$f":"SUM(G42:H42)","v":0},null,null,null,null,null,null,"LV ",{"$f":"SUM(I42:M42)","v":0}]
[null,"HV",{"$f":"SUM(D43:F43)","v":0},null,null,null,null,null,null,"HV",{"$f":"SUM(G43:H43)","v":0},null,null,null,null,null,null,"HV",{"$f":"SUM(I43:M43)","v":0}]
[null,"EHV",{"$f":"SUM(D44:F44)","v":0},null,null,null,null,null,null,"EHV",{"$f":"SUM(G44:H44)","v":0},null,null,null,null,null,null,"EHV",{"$f":"SUM(I44:M44)","v":0}]
[null,"132 kV",{"$f":"SUM(D45:F45)","v":0},null,null,null,null,null,null,"132 kV",{"$f":"SUM(G45:H45)","v":0},null,null,null,null,null,null,"132 kV",{"$f":"SUM(I45:M45)","v":0}]
[null,"Total",{"$f":"SUM(C125:C128)","v":0},{"$f":"SUM(D125:D128)","v":0},{"$f":"SUM(E125:E128)","v":0},{"$f":"SUM(F125:F128)","v":0},null,{"$f":"SUM(H125:H128)","v":0},null,"Total",{"$f":"SUM(K125:K128)","v":0},{"$f":"SUM(L125:L128)","v":0},{"$f":"SUM(M125:M128)","v":0},{"$f":"SUM(N125:N128)","v":0},null,{"$f":"SUM(P125:P128)","v":0},null,"Total",{"$f":"SUM(S125:S128)","v":0},{"$f":"SUM(T125:T128)","v":0},{"$f":"SUM(U125:U128)","v":0},{"$f":"SUM(V125:V128)","v":0},null,{"$f":"SUM(X125:X128)","v":0}]
[]
[null,"05/06 - 07/08",null,null,null,null,null,null,null,"08/09-09/10",null,null,null,null,null,null,null,"DPCR5"]
[null,null,"Total unit Cost £k/per span","Unit cost £k/span",null,null,null,null,null,null,"Total unit Cost £k/per span","Forecast Unit cost £k/span",null,null,null,null,null,null,"Total unit Cost £k/per span","Forecast Unit cost £k/span"]
[null,null,null,"Rebuild","Under-grounding","Other","Derogation","As part of other planned work",null,null,null,"Rebuild","Under-grounding","Other","Derogation","As part of other planned work",null,null,null,"Rebuild","Under-grounding","Other","Derogation","As part of other planned work"]
[null,"LV ",{"$f":"IF(C116>0,C125*1000/C116,0)","v":0},0,0,0,null,null,null,"LV ",{"$f":"IF(K116>0,K125*1000/K116,0)","v":0},0,0,0,null,null,null,"LV ",{"$f":"IF(S116>0,S125*1000/S116,0)","v":0},0,0,0]
[null,"HV",0,0,0,0,null,null,null,"HV",0,0,0,0,null,null,null,"HV",0,0,0,0]
[null,"EHV",0,0,0,0,null,null,null,"EHV",0,0,0,0,null,null,null,"EHV",0,0,0,0]
[null,"132 kV",0,0,0,0,null,null,null,"132 kV",0,0,0,0,null,null,null,"132 kV",0,0,0,0]

{"sheet":"FBPQ C2","index":19,"n_rows":155,"n_cols":10,"rows_kept":155,"cut":false,"hidden":false,"merged":[[6,1,8,4],[6,5,8,5],[6,6,6,7],[6,8,6,9]]}
["Main Forecast Business Plan DPCR5",null,null,null,null,"Index"]
[]
["C2 - Unit costs"]
[]
[]
[]
[null,"Asset categories",null,null,null,"Units","New build ",null,"Replacement"]
[null,null,null,null,null,null,"Direct costs","Cost including indirects (absorbed costs in T2A)","Direct costs","Cost including indirects (absorbed costs in T2A)"]
[null,null,null,null,null,null,"(£k)","(£k)","(£k)","(£k)"]
[null,null,"LV Network"]
[null,null,null,"Overhead lines"]
[null,null,null,null,"LV Main (OHL)","km",null,null,null,39.50991010706953]
[null,null,null,null,"LV Service (OHL)","Each",null,null,null,0.48182817203743339]
[]
[null,null,null,"Overhead lines - Support"]
[null,null,null,null,"LV Support","Each",null,null,null,0]
[]
[null,null,null,"Underground cables"]
[null,null,null,null,"LV Main (UG Consac)","km",null,null,null,120.45704300935833]
[null,null,null,null,"LV Main (UG Plastic)","km",null,null,null,120.45704300935833]
[null,null,null,null,"LV Main (UG Paper)","km",null,null,null,120.45704300935833]
[null,null,null,null,"LV Service (UG)","Each",null,null,null,1.6107756705297416]
[]
[null,null,null,"Switchgear "]
[null,null,null,null,"LV Pillar (ID)","Each",null,null,null,5.4205669354211254]
[null,null,null,null,"LV Pillar (OD)","Each",null,null,null,5.4205669354211254]
[null,null,null,null,"LV Board (WM)","Each",null,null,null,5.4205669354211254]
[null,null,null,null,"LV UGB","Each",null,null,null,4.5773676343556167]
[null,null,null,null,"LV Fuses (PM)","Each"]
[null,null,null,null,"LV Fuses (TM)","Each"]
[]
[null,null,"HV network"]
[null,null,null,"Overhead lines"]
[null,null,null,null,"6.6/11 kV OHL (Open)","km",null,null,null,40.834937580172472]
[null,null,null,null,"6.6/11 kV OHL (Covered)","km",null,null,null,40.834937580172472]
[null,null,null,null,"20 kV OHL (Open)","km",null,null,null,0]
[null,null,null,null,"20 kV OHL (Covered)","km",null,null,null,0]
[]
[null,null,null,"Overhead lines - Support"]
[null,null,null,null,"6.6/11 kV Support","Each",null,null,null,0]
[null,null,null,null,"20 kV Support","Each",null,null,null,0]
[]
[null,null,null,"Underground cables (kms)"]
[null,null,null,null,"6.6/11kV UG Cable","km",null,null,null,80.103933601223289]
[null,null,null,null,"20kV UG Cable","km",null,null,null,0]
[]
[null,null,null,"Submarine cables (kms)"]
[null,null,null,null,"HV Sub Cable","km",null,null,null,0]
[]
[null,null,null,"Switchgear "]
[null,null,null,null,"6.6/11 kV CB (PM)","Each",null,null,null,13.250274731029416]
[null,null,null,null,"6.6/11 kV CB (GM)","Each",null,null,null,29.271061451274075]
[null,null,null,null,"6.6/11 kV Switch (PM)","Each",null,null,null,1.5659415591216583]
[null,null,null,null,"6.6/11 kV Switch (GM)","Each",null,null,null,4.9387387633836912]
[null,null,null,null,"6.6/11 kV RMU","Each",null,null,null,15.538958548207226]
[null,null,null,null,"6.6/11 kV Switchgear - Other (PM)","Each"]
[null,null,null,null,"6.6/11 kV Switchgear - Other (GM)","Each"]
[null,null,null,null,"20 kV CB (PM)","Each",null,null,null,0]
[null,null,null,null,"20 kV CB (GM)","Each",null,null,null,0]
[null,null,null,null,"20 kV Switch (PM)","Each",null,null,null,0]
[null,null,null,null,"20 kV Switch (GM)","Each",null,null,null,0]
[null,null,null,null,"20 kV RMU","Each",null,null,null,0]
[null,null,null,null,"20 kV Switchgear - Other (PM)","Each"]
[null,null,null,null,"20 kV Switchgear - Other (GM)","Each"]
[]
[null,null,null,"Transformers  "]
[null,null,null,null,"6.6/11 kV Transformer (PM)","Each",null,null,null,3.4932542472713912]
[null,null,null,null,"6.6/11 kV Transformer (GM)","Each",null,null,null,11.322962042879682]
[null,null,null,null,"20 kV Transformer (PM)","Each",null,null,null,0]
[null,null,null,null,"20 kV Transformer (GM)","Each",null,null,null,0]
[]
[null,null,"EHV Network"]
[null,null,null,"Overhead lines"]
[null,null,null,null,"33kV OHL (Pole Line)","km",null,null,null,93.233751289243358]
[null,null,null,null,"33kV OHL (Tower Line)","km",null,null,null,148.5235340305388]
[null,null,null,null,"66kV OHL (Pole Line)","km",null,null,null,175.86728279366315]
[null,null,null,null,"66kV OHL (Tower Line)","km",null,null,null,175.86728279366315]
[]
[null,null,null,"Overhead lines - Support"]
[null,null,null,null,"33kV Pole","Each",null,null,null,0]
[null,null,null,null,"33kV Tower","Each",null,null,null,0]
[null,null,null,null,"66kV Pole","Each",null,null,null,0]
[null,null,null,null,"66kV Tower","Each",null,null,null,0]
[]
[null,null,null,"Underground cables (kms)"]
[null,null,null,null,"33kV UG Cable (Non Pressurised)","km",null,null,null,243.56414096492253]
[null,null,null,null,"33kV UG Cable (Oil)","km",null,null,null,243.56414096492253]
[null,null,null,null,"33kV UG Cable (Gas)","km",null,null,null,0]
[null,null,null,null,"66kV UG Cable (Non Pressurised)","km",null,null,null,1143.1373381588107]
[null,null,null,null,"66kV UG Cable (Oil)","km",null,null,null,1143.1373381588107]
[null,null,null,null,"66kV UG Cable (Gas)","km",null,null,null,0]
[]
[null,null,null,"Submarine cables (kms)"]
[null,null,null,null,"EHV Sub Cable","km",null,null,null,0]
[]
[null,null,null,"Switchgear "]
[null,null,null,null,"33 KV CB (ID)","Each",null,null,null,175.26499757861637]
[null,null,null,null,"33 kV CB (OD)","Each",null,null,null,175.26499757861637]
[null,null,null,null,"33 kV Switch (GM)","Each",null,null,null,0]
[null,null,null,null,"33 kV Switch (PM)","Each",null,null,null,0]
[null,null,null,null,"33 kV RMU","Each",null,null,null,557.59565209031973]
[null,null,null,null,"33 kV Switchgear - Other","Each"]
[null,null,null,null,"66 KV CB (ID & OD)","Each",null,null,null,661.18870907836788]
[null,null,null,null,"66 KV Switchgear - Other","Each"]
[]
[null,null,null,"Transformers  "]
[null,null,null,null,"33 kV Transformer (PM)","Each",null,null,null,504.59455316620199]
[null,null,null,null,"33 kV Transformer (GM)","Each",null,null,null,541.93623649910307]
[null,null,null,null,"33 kV AuxiliaryTransfomer","Each"]
[null,null,null,null,"66 kV Transformer","Each",null,null,null,2117.5143590615103]
[null,null,null,null,"66 kV AuxiliaryTransfomer","Each"]
[]
[null,null,"132kV Network"]
[null,null,null,"Overhead lines"]
[null,null,null,null,"132kV OHL Conductor (Pole Line)","km",null,null,null,677.32995284162189]
[null,null,null,null,"132kV OHL Conductor (Tower Line)","km",null,null,null,1163.9764065994295]
[]
[null,null,null,"Overhead lines - Support"]
[null,null,null,null,"132kV Pole","Each",null,null,null,0]
[null,null,null,null,"132kV Tower","Each",null,null,null,0]
[null,null,null,null,"132kV Fittings (Tower Line)","Each",null,null,null,0]
[]
[null,null,null,"Underground cables (kms)"]
[null,null,null,null,"132kV UG Cable (Non Pressurised)","km",null,null,null,1174.4561693412438]
[null,null,null,null,"132kV UG Cable (Oil)","km",null,null,null,1174.4561693412438]
[null,null,null,null,"132kV UG Cable (Gas)","km",null,null,null,0]
[]
[null,null,null,"Submarine cables (kms)"]
[null,null,null,null,"132 kV Sub Cable","km",null,null,null,0]
[]
[null,null,null,"Switchgear "]
[null,null,null,null,"132 kV CB (ID & OD)","Each",null,null,null,1048.3376453104456]
[null,null,null,null,"132 kV Switchgear (other)","Each"]
[]
[null,null,null,"Transformers  "]
[null,null,null,null,"132 kV Transformer","Each",null,null,null,2117.5143590615103]
[null,null,null,null,"132 kV AuxiliaryTransfomer","Each"]
[]
[null,null,"Tele-control / SCADA"]
[null,null,null,"Primary substation"]
[null,null,null,null,"132 kV/EHV RTU (PM)","Each"]
[null,null,null,null,"132 kV/EHV RTU (GM)","Each"]
[]
[null,null,null,"Secondary substation"]
[null,null,null,null,"HV RTU (PM)","Each"]
[null,null,null,null,"HV RTU (GM)","Each"]
[]
[]
[null,null,"HV network switchgear"]
[null,null,null,null,"6.6/11 kV CB (GM)"]
[null,null,null,null,"Primary","Each",null,null,null,29.271061451274075]
[null,null,null,null,"Distribution","Each",null,null,null,7.4683366665802167]
[null,null,null,null,"20 kV Switch (GM)"]
[null,null,null,null,"Primary","Each",null,null,null,0]
[null,null,null,null,"Distribution","Each",null,null,null,0]

{"sheet":"RRP 1.3","index":20,"n_rows":26,"n_cols":37,"rows_kept":26,"cut":false,"hidden":false,"merged":[[6,26,8,26],[6,36,8,36],[7,3,7,8],[7,9,7,23],[6,31,8,31],[6,32,8,32],[6,33,8,33],[6,34,8,34],[6,27,8,27],[6,28,8,28],[6,29,8,29],[6,35,8,35],[6,30,8,30],[6,3,6,23],[6,24,8,24],[6,25,8,25],[25,3,25,26],[21,3,21,26],[22,3,22,26],[23,3,23,26],[24,3,24,26]]}
["Regulatory Reporting Pack (RRP)",null,null,null,null,"Index",null,"CAUTION - THIS PACK DOES NOT BALANCE"]
[]
["2007/08"]
[]
[null,null,"Electricity Distribution Industry Activity Costs - individual DNO input"]
[]
[null,null,null,"Cash typical costs (excluding disallowed related party margins)",null,null,null,null,null,null,null,null,null,null,null,null,null,null,null,null,null,null,null,null,"Atypical cash costs","Pension deficit payments","Metering","Excluded services & de minimis","Relevant distributed generation (less contributions)","IFI","Disallowed Related Party Margins","Statutory Depreciation","Network Rates","Transmission Exit Charges","Pension deficit repair payments by related parties (note 2)","Non activity costs and reconciling amounts (note 3)","Total Annual Operating & Capital Expenditure per Regulatory Accounts"]
[null,null,null,"Direct activities",null,null,null,null,null,"Indirect activities"]
[null,null,"Year ended","Load related new connections & reinforcement (net of contributions)","Non-load new & replacement assets (net of contributions)","Non-operational capex","Faults","Inspections, & Maintenance","Tree Cutting","Network Policy","Network Design & Engineering","Project Management","Engineering Mgt & Clerical Support","Control Centre","System Mapping - Cartographical","Customer Call Centre","Stores","Vehicles & Transport","IT & Telecoms","Property Mgt","HR & Non-operational Training","Health & Safety & Operational Training","Finance & Regulation","CEO etc"]
[null,null,null,"£'m","£'m","£'m","£'m","£'m","£'m","£'m","£'m","£'m","£'m","£'m","£'m","£'m","£'m","£'m","£'m","£'m","£'m","£'m","£'m","£'m","£'m","£'m","£'m","£'m","£'m","£'m","£'m","£'m","£'m","£'m","£'m","£'m","£'m"]
[]
[null,null,"31 March 2008",46.459524808852009,62.531667485618783,2.3969412916799993,26.514424209436648,11.606716180984,3.1208690599999995,0.63889207162799966,5.1305774955097965,2.2167176620892537,16.939612814221448,4.4300162415596507,1.5094657008872003,1.3239399267640004,1.562325762189239,6.1510443854799997,10.240069047105548,4.5836090382398558,1.4397993171236436,2.0706365899867683,7.5444930721556567,1.6451252035656032,1.32151902,9.5,0.79378199999999999,9.751431000299192,-8.3266726846886741E-16,1.0145090392,4.3032873328058328,41.912756859700004,27.091992000000001,4.4000000000000004,-9.5,2.3542553829179269,313]
[null,null,"Adjustments on T4.3",null,null,null,null,null,null,null,null,null,null,null,null,null,null,null,null,null,null,null,null,null,null,null,null,null,null,null,null,null,null,null,null,null,0]
[null,null,"31 March 2008",46.459524808852009,62.531667485618783,2.3969412916799993,26.514424209436648,11.606716180984,3.1208690599999995,0.63889207162799966,5.1305774955097965,2.2167176620892537,16.939612814221448,4.4300162415596507,1.5094657008872003,1.3239399267640004,1.562325762189239,6.1510443854799997,10.240069047105548,4.5836090382398558,1.4397993171236436,2.0706365899867683,7.5444930721556567,1.6451252035656032,1.32151902,9.5,0.79378199999999999,9.751431000299192,-8.3266726846886741E-16,1.0145090392,4.3032873328058328,41.912756859700004,27.091992000000001,4.4000000000000004,-9.5,2.3542553829179269,313]
[]
[null,null,"31 March 2007",14.151282694386488,41.901947565729692,2.5346743360699997,29.351257701719597,11.519941237081493,5.8257634456637231,1.3252198300408482,3.7900776636320539,4.791652885966827,16.963168868641358,4.4092795317044633,1.8923039644686004,1.9938320736628832,1.5195982432433788,4.8615322519232107,13.529966622211505,4.2317714531526214,1.9208223019260779,2.2641922279217139,7.1645215567985527,1.8087584738886002,1.5637426000000001,0,5.3809152985718995,15.699185752649853,0,0,1.8407559641693809,40.602506950469994,26.111617219999999,4.5662790900000001,0,-5.7906823056947019,267.72588550000012]
[]
[null,null,"31 March 2006",17.394742274489687,35.088115916993331,1.9914601539999999,27.186515151318229,10.780594265829606,3.2645322649343638,0.42116821067413113,7.2462549143267321,6.1037403167946209,11.676644510200507,3.7007240906480638,1.9451231500906572,1.4674598631707632,2.007539016691029,4.1312202910262137,7.0587166141664746,4.89466808916952,1.2662056907617996,2.0034273403142651,6.7695236474636857,2.2294360003843123,5.8295019999999997,45.6,9.2171990705459876,8.6510472243001466,0,0,0,42.388523990000003,25.863890000000001,4.7382850099999994,-45.6,-5.0462590682941197,250.27]
[]
[]
[null,null,"Notes"]
[null,null,1,"The individual activities are defined in the Electricity Distribution Price Control Review Price control cost reporting rules: Instructions and Guidance April 2008 "]
[null,null,2,"Pension deficit payments made by a related party and not charged in the regulatory accounts of the DNO"]
[null,null,3,"Non-activity costs include Ofgem licence fee, Shetland Balancing Costs (SHEPD only), Scottish Electricity Settlements run-off (Scottish DNOs only) and proceeds of asset sales; and reconciling amounts, e.g. intra-group recharges treated as de minimis costs"]
[null,null,4,"Total Annual Operating & Capital Expenditure per Regulatory Accounts has been adjusted, where appropriate, to include intangible fixed assets and customer contributions, the latter may be reported within Creditors as deferred income"]
[null,null,5,"This information has not been audited."]

{"sheet":"RRP 2.3","index":21,"n_rows":48,"n_cols":17,"rows_kept":48,"cut":false,"hidden":false,"merged":[[46,2,46,5],[43,12,43,13],[35,4,36,7],[41,14,42,14],[33,0,33,2],[43,2,43,5],[44,2,44,5],[45,2,45,5],[41,12,42,13],[37,4,37,7],[38,4,38,7],[39,4,39,7],[41,2,42,5],[41,6,42,6],[10,4,11,4],[5,12,5,16],[6,4,6,6],[6,8,6,10],[6,12,7,14],[6,16,7,16],[10,6,11,6],[10,5,11,5],[19,0,22,0],[19,1,19,2],[22,1,22,2],[8,0,9,2],[10,0,11,0],[10,1,10,2],[11,1,11,2],[13,6,15,6],[14,1,14,2],[15,1,15,2],[16,0,18,0],[16,1,16,2],[17,1,17,2],[18,1,18,2],[12,0,15,0],[12,1,12,2],[13,1,13,2],[13,4,15,4],[13,5,15,5],[23,0,26,0],[23,1,23,2],[26,1,26,2],[31,0,31,2],[32,0,32,2],[28,0,28,2],[29,0,29,2],[30,0,30,2],[27,0,27,2]]}
["Regulatory Reporting Pack (RRP)",null,null,null,"Index"]
[]
["2007/08"]
[]
["Inspections & Maintenance, Tree Cutting and Fault Costs"]
[null,null,null,null,null,null,null,null,null,null,null,null,"Memorandum Information - Scottish DNOs 132kV"]
[null,null,null,null,"Inspections & Maintenance",null,null,null,"Fault Costs",null,null,null,"Inspections & Maintenance",null,null,null,"Faults"]
[null,null,null,null,null,"Cash typicals",null,null,"Cash typicals",null,"Atypicals"]
["Inspection and Maintenance",null,null,null,"Inspections ","Maintenance ","Total ",null,"Total ",null,"Total ",null,"Inspections ","Maintenance ","Total ",null,"Total "]
[null,null,null,null,"£'m","£'m","£'m",null,"£'m",null,"£'m",null,"£'m","£'m","£'m",null,"£'m"]
["LV Services","Overhead",null,null,0,0.36181519995774197,{"$f":"SUM(E11:F11)","v":0.36181519995774197},null,0.44431694812253475,null,0]
[null,"Underground",null,null,null,null,null,null,4.7953367704089898,null,0]
["LV System","Overhead Mains",null,null,0.39717937245801499,0.118111357439522,{"$f":"SUM(E13:F13)","v":0.51529072989753699},null,1.19960729316716,null,0.20706630150757177]
[null,"Underground Mains - Consac",null,null,0.229663769257235,0.112411254057019,{"$f":"SUM(E14:F14)","v":0.34207502331425399},null,9.2383940591736491E-3,null,0]
[null,"Underground Mains - Non Consac",null,null,0,0,null,null,9.2962537572156698,null,0]
[null,"Switchgear (incl other plant & equipment)",null,null,0,0,null,null,0.20110809962398224,null,0]
["HV ","Overhead lines",null,null,2.6450309304946802E-2,0.32631011622364703,{"$f":"SUM(E17:F17)","v":0.35276042552859382},null,1.9214642911566087,null,0.1739622662704251]
[null,"Underground Cables",null,null,0,0.15632920001592032,0.15632920001592032,null,4.34436105494588,null,0]
[null,"Switchgear, Transformers, Substation",null,null,0.52095547972967593,3.7559833450097067,4.2769388247393829,null,0.55050054364771606,null,0]
["EHV","Overhead lines",null,null,0,0,0,null,0.45049410821776609,null,0]
[null,"Underground - Pressure assisted",null,null,0,0,0,null,1.2794757770246144E-4,null,0]
[null,"Underground - Non Pressure assisted",null,null,0,0,0,null,0.50689587057303287,null,0]
[null,"Switchgear, Transformers, Substation",null,null,3.4253363869449022E-2,0.54131910307239062,0.57557246694183961,null,1.3595209014202313E-4,null,0]
["132kV","Overhead lines",null,null,0.14570113797854389,1.9379218620848797,2.0836230000634237,null,2.7840239766498171E-3,null,5.2674322220031544E-3,null,null,null,0]
[null,"Underground - Pressure assisted",null,null,9.7464896642148011E-2,0.13435964818256071,0.23182454482470871,null,0.61958612229318499,null,0,null,null,null,0]
[null,"Underground - Non Pressure assisted",null,null,0,0,0,null,0,null,0,null,null,null,0]
[null,"Switchgear, Transformers, Substation",null,null,0.21059578286325348,1.2008979828373454,1.4114937657005988,null,1.5441425698751693E-3,null,0,null,null,null,0]
["Submarine cables - all voltages",null,null,null,0,0,{"$f":"SUM(E28:F28)","v":0},null,0,null,0,null,null,null,0]
["Non-QoS Faults",null,null,null,null,null,null,null,5.7302192640935399,null,0]
["Substation electricity",null,null,null,null,0,{"$f":"SUM(E30:F30)","v":0}]
["Diesel generation costs (permanent emergency back up on islands)",null,null,null,null,null,{"$f":"SUM(E31:F31)","v":0}]
["Third party cable damage - recoveries",null,null,null,null,null,null,null,-2.22315]
["Dismantlement",null,null,null,null,1.198993,{"$f":"SUM(E33:F33)","v":1.198993}]
["Total",null,null,null,{"$f":"SUM(E11:E33)","v":1.6622641121032671},{"$f":"SUM(F11:F33)","v":9.8444520688807344},{"$f":"SUM(G11:G33)","v":11.506716180984},null,{"$f":"SUM(I11:I33)","v":27.850824583739605},null,{"$f":"SUM(K11:K33)","v":0.38629600000000003},null,0,0,0,null,0]
[]
[null,null,null,null,"Fault costs allocated to Opex and Capex",null,null,null,"Cash typicals",null,"Atypicals"]
[null,null,null,null,null,null,null,null,"£'m",null,"£'m"]
[null,null,null,null,"Fault opex",null,null,null,7.6046734961971971,null,0.38629600000000003]
[null,null,null,null,"Fault capex",null,null,null,20.246151087542405,null,0]
[null,null,null,null,"Total Fault Costs",null,null,null,{"$f":"SUM(I38:I39)","v":27.850824583739602},null,{"$f":"SUM(K38:K39)","v":0.38629600000000003}]
[]
[null,null,"Tree Cutting",null,null,null,"£'m",null,null,null,null,null,"Tree Cutting",null,"£'m"]
[]
[null,null,"LV",null,null,null,2.6698203074440059,null,null,null,null,null,"132kV"]
[null,null,"HV",null,null,null,3.8399956961413602]
[null,null,"EHV",null,null,null,0.60219434135132166]
[null,null,"132kV",null,null,null,0.20885871506331286]
[null,null,"Total Tree Cutting",null,null,null,{"$f":"SUM(G44:G47)","v":7.3208690599999997}]

{"sheet":"RRP 2.4","index":22,"n_rows":89,"n_cols":12,"rows_kept":89,"cut":false,"hidden":false,"merged":[[75,2,75,3],[76,2,76,3],[81,2,81,3],[87,2,87,3],[88,2,88,3],[79,2,80,3],[82,2,82,3],[83,2,83,3],[84,2,84,3],[85,2,85,3],[86,2,86,3],[69,2,69,3],[70,2,70,3],[71,2,71,3],[72,2,72,3],[74,2,74,3],[64,2,64,3],[65,2,65,3],[66,2,66,3],[67,2,67,3],[68,2,68,3],[57,2,57,3],[60,2,60,3],[61,2,61,3],[62,2,62,3],[63,2,63,3],[17,2,17,3],[18,2,18,3],[19,2,19,3],[55,2,55,3],[56,2,56,3],[20,2,20,3],[21,2,21,3],[43,2,48,2],[49,2,54,2],[22,2,22,3],[23,2,23,3],[24,2,24,3],[7,2,8,3],[9,2,9,3],[14,2,14,3],[15,2,15,3],[16,2,16,3],[10,2,10,3],[11,2,11,3],[12,2,12,3],[13,2,13,3],[27,4,27,5],[30,2,31,2],[32,2,33,2],[34,2,36,2],[37,2,42,2],[27,2,29,3]]}
["Regulatory Reporting Pack (RRP)",null,null,null,"Index"]
[]
["2007/08"]
[]
["NEW AND REPLACEMENT ASSETS (EXCL. FAULTS)"]
[]
[null,null,"          Load Related New Connections & Reinforcement"]
[null,null,"Direct Costs only",null,"New Connections (carried out by DNO/RP)","New Connections (carried out by Third Parties)","Customer Specific Reinforcement - Chargeable","Customer Specific Reinforcement - Non Chargeable","General Reinforcement","Fault Level Reinforcement","Non Relevant Distributed Generation","Total"]
[null,null,null,null,"£'m","£'m","£'m","£'m","£'m","£'m","£'m","£'m"]
[null,null,"New Connections & Customer Specific Reinforcement:",null,null,null,null,null,null,null,null,{"$f":"SUM(E10:K10)","v":0}]
[null,null,"Connections provided at LV",null,49.1,0,0,10,null,null,null,59.1]
[null,null,"Connections provided at HV",null,24.91,0,0,7.25,null,null,null,32.159999999999997]
[null,null,"Connections provided at EHV",null,0.44,0,0,0.2,null,null,null,0.64]
[null,null,"Connections provided at 132kV",null,0,0,0,0,null,null,null,0]
[null,null,"General Reinforcement:",null,null,null,null,null,null,null,null,0]
[null,null,"LV System",null,null,null,null,null,1.3,0,null,1.3]
[null,null,"HV System",null,null,null,null,null,3.9,0.8,null,4.7]
[null,null,"EHV System",null,null,null,null,null,3.2173750667821648,0.82835842627990319,null,4.0457334930620679]
[null,null,"132kV System",null,null,null,null,null,24.1,2.14,null,26.240000000000002]
[null,null,"Non Relevant Distributed Generation",null,null,null,null,null,null,null,0,0]
[null,null,"Total Direct Costs excluding Reallocations",null,{"$f":"SUM(E11:E20)","v":74.45},{"$f":"SUM(F11:F20)","v":0},0,17.45,32.517375066782165,3.7683584262799035,0,128.18573349306206]
[null,null,"Direct Cost Reallocation ",null,0,null,0,0,0,0,0,{"$f":"SUM(E22:K22)","v":0}]
[null,null,"Total Costs including Reallocations",null,{"$f":"SUM(E21:E22)","v":74.45},0,0,17.45,32.517375066782165,3.7683584262799035,0,{"$f":"SUM(E23:K23)","v":128.18573349306209}]
[null,null,"Customer Contributions (-ve)",null,-81.8,0,0,null,null,null,0,{"$f":"SUM(E24:K24)","v":-81.8}]
[null,null,"Total Costs less Capital Contributions",null,{"$f":"SUM(E23:E24)","v":-7.3499999999999943},0,0,17.45,32.517375066782165,3.7683584262799035,0,{"$f":"SUM(E25:K25)","v":46.385733493062077}]
[]
[null,null,"          Non-load related replacement (Condition based)"]
[null,null,"Direct Costs only",null,"Condition based"]
[null,null,null,null,"Non-fault Related","Fault Related","Total\n"]
[null,null,null,null,"£'m","£'m","£'m"]
[null,null,"Metered LV Services","Overhead",1.1213124016896909,1.0171234508950289E-2,{"$f":"SUM(E31:F31)","v":1.1314836361986411}]
[null,null,null,"Underground",3.5,0.1,3.6]
[null,null,"Un-metered LV Services","Overhead",0,0,0]
[null,null,null,"Underground",0,0,0]
[null,null,"LV System","Overhead Mains",0.83168933444578297,7.9609978999791425E-3,0.83965033234576214]
[null,null,null,"Underground Mains",3.9067448152387647,0.10147681851144906,4.0082216337502139]
[null,null,null,"Switchgear (incl other plant & equipment)",0.44802067462397693,0.8448052869692545,1.2928259615932314]
[null,null,"HV","Overhead lines",2.8,0.1,2.9]
[null,null,null,"Underground Cables",3.1075738096423557,2.0378510399683657E-2,3.1279523200420396]
[null,null,null,"Submarine",0,0,0]
[null,null,null,"Switchgear (incl other plant & equipment)",5.612711767166652,1.0011134157441124,6.6138251829107642]
[null,null,null,"Transformers ",0.53103437507471163,0.70512111305901981,1.2361554881337313]
[null,null,null,"Substation",1.9,0.4,2.2999999999999998]
[null,null,"EHV","Overhead lines",1.0243794927017467,0,1.0243794927017467]
[null,null,null,"Underground Cables",1.927075053930345,2.1754858762321388E-2,1.9488299126926663]
[null,null,null,"Submarine",0,0,0]
[null,null,null,"Switchgear (incl other plant & equipment)",1.1254418351098032,0.1,1.2254418351098033]
[null,null,null,"Transformers ",0.2,0.3,0.5]
[null,null,null,"Substation",1.0400698027565143,1.1384128074684282E-2,1.0514539308311985]
[null,null,"132kV","Overhead lines",7.8472133596123301,0,7.8472133596123301]
[null,null,null,"Underground Cables",3.8898690278038127E-2,0,3.8898690278038127E-2]
[null,null,null,"Submarine Cables",0,0,0]
[null,null,null,"Switchgear (incl other plant & equipment)",0.2,0,0.2]
[null,null,null,"Transformers ",4.6738919770647272E-2,0,4.6738919770647272E-2]
[null,null,null,"Substation",2.7136963328324701E-2,3.935454194238814E-3,3.1072417522563515E-2]
[null,null,"Total Non-load replacement",null,{"$f":"SUM(E31:E55)","v":37.236041295369688},{"$f":"SUM(F31:F55)","v":3.7281018181236933},40.964143113493378]
[null,null,"Customer Contributions (-ve)",null,0,0,0]
[null,null,"Total Net Non-load replacement",null,{"$f":"SUM(E56:E57)","v":37.236041295369688},{"$f":"SUM(F56:F57)","v":3.7281018181236933},40.964143113493378]
[]
[null,null,"Non-load related (other)",null,"LV","HV","EHV","132kV","Total"]
[null,null,"Direct Costs only",null,"£'m","£'m","£'m","£'m","£'m"]
[null,null,"Quality of Service",null,0.78154528992298744,7.0200429885700197,0,0,{"$f":"SUM(E62:H62)","v":7.8015882784930071}]
[null,null,"Safety",null,0.17370324919855229,0.35464789533482799,0.10272204271495809,0.1197787213940734,{"$f":"SUM(E63:H63)","v":0.7508519086424118}]
[null,null,"Environment",null,0,0,0.11286464185897649,0,0.11286464185897649]
[null,null,"Visual Amenity",null,2.4138485563832291E-2,1.3113855472286782E-3,0,0,2.5449871111060968E-2]
[null,null,"ESQCR",null,0.11120728744961361,0.29512880668171876,0,0,0.40633609413133237]
[null,null,"Resilience",null,0,1.8356852588707312E-2,0,0,1.8356852588707312E-2]
[null,null,"Operational IT & Telecoms - BT 21CN",null,0,0,0,0,0]
[null,null,"Operational IT & Telecoms - other",null,0,9.8116957770448456E-3,0,0,9.8116957770448456E-3]
[null,null,"Non - rechargeable diversions",null,2.4874614662343606,3.2468033810427106,0.64503786162548138,1.7982738528536242,8.177576561756176]
[null,null,"Total Non-load related (other non-fault)",null,{"$f":"SUM(E62:E70)","v":3.5780557783693463},{"$f":"SUM(F62:F70)","v":10.946103005542257},{"$f":"SUM(G62:G70)","v":0.86062454619941597},{"$f":"SUM(H62:H70)","v":1.9180525742476975},{"$f":"SUM(I62:I70)","v":17.302835904358716}]
[null,null,"Customer Contributions (-ve)",null,0,0,0,0,{"$f":"SUM(E72:H72)","v":0}]
[null,null,"Total Net Non-load related (other non-fault)",null,{"$f":"SUM(E71:E72)","v":3.5780557783693463},{"$f":"SUM(F71:F72)","v":10.946103005542257},{"$f":"SUM(G71:G72)","v":0.86062454619941597},{"$f":"SUM(H71:H72)","v":1.9180525742476975},{"$f":"SUM(I71:I72)","v":17.302835904358716}]
[]
[null,null,"Total Non-load related expenditure (direct costs)",null,{"$f":"+I71+G56","v":58.266979017852094}]
[null,null,"Customer Contributions (-ve)"]
[null,null,"Total Net Non-load replacement (Direct Costs)",null,{"$f":"+E76+E75","v":58.266979017852094}]
[]
[null,null,"          Non-operational "]
[null,null,"Direct Costs only",null,"Total","Owned by DNO","Owned by related party"]
[null,null,null,null,"£'m","£'m","£'m"]
[null,null,"Vehicles",null,{"$f":"SUM(F82:G82)","v":0.3},0.3]
[null,null,"Plant & Machinery",null,0]
[null,null,"Small Tools & Equipment",null,1.4990000000000001,1.4990000000000001]
[null,null,"Office Equipment",null,0]
[null,null,"Non-operational property",null,0]
[null,null,"IT Non-operational Capital Expenditure",null,0.60899999999999999,0.60899999999999999]
[null,null,"Telecoms Non-operational Capital Expenditures",null,0]
[null,null,"Total Non-operational New Assets & Replacement",null,{"$f":"SUM(E82:E88)","v":2.4080000000000004},{"$f":"SUM(F82:F88)","v":2.4080000000000004},{"$f":"SUM(G82:G88)","v":0}]

{"sheet":"RRP 2.6","index":23,"n_rows":99,"n_cols":12,"rows_kept":99,"cut":false,"hidden":false,"merged":[[98,2,98,5],[97,4,97,5],[82,3,82,5],[87,3,87,5],[88,3,88,5],[91,3,91,5],[93,3,93,5],[75,3,75,5],[77,4,77,5],[78,4,78,5],[79,4,79,5],[80,4,80,5],[35,4,35,5],[36,4,36,5],[8,2,8,5],[9,3,9,5],[10,3,10,5],[11,3,11,5],[12,3,12,5],[13,3,13,5],[15,2,15,5],[19,2,19,5],[24,2,24,5],[21,3,21,5],[22,3,22,5],[17,3,17,5],[18,3,18,5],[59,3,59,4],[64,3,64,4],[14,3,14,5],[16,3,16,5],[20,3,20,5],[41,4,41,5],[42,4,42,5],[43,4,43,5],[44,4,44,5],[45,4,45,5],[46,4,46,5],[47,4,47,5],[48,4,48,5],[49,4,49,5],[50,4,50,5],[33,4,33,5]]}
["Regulatory Reporting Pack",null,null,null,null,"Index"]
[]
["2007/08"]
[]
["MISCELLANEOUS"]
[]
[null,null,"Non-activity based costs (excluded from Table 2.2)(enter as positive)"]
[null,null,null,null,null,null,"£'m","£'m"]
[null,null,"Pass through Costs"]
[null,null,null,"Transmission exit charges",null,null,4.4000000000000004]
[null,null,null,"Wheeled units imported",null,null,0]
[null,null,null,"Network rates",null,null,27.091992000000001]
[null,null,null,"Ofgem licence fee",null,null,1.45009349]
[null,null,null,"Shetland Balancing Costs (SHEPD only)",null,null,0]
[null,null,null,"Scottish Electricity Settlements run-off (Scottish DNOs only)",null,null,0,{"$f":"SUM(G10:G15)","v":32.942085490000004}]
[null,null,"Costs inside scope of DPCR4 allowances"]
[null,null,null,"Guaranteed standard of performance compensation payments",null,null,0]
[null,null,null,"Ex-gratia compensation payments",null,null,0.54859910000000001]
[null,null,null,"Bad debt expense (net of recoveries)",null,null,0.31404121340000002,{"$f":"SUM(G17:G19)","v":0.86264031340000003}]
[null,null,"Costs outside scope of DPCR4 allowances"]
[null,null,null,"(Profit)/loss on sale of fixed assets and scrap[(-ve)/+ve]",null,null,1.6526079999999665E-2]
[null,null,null,"Statutory Depreciation on operational assets",null,null,39.912756859700004]
[null,null,null,"Pension deficit repair payments",null,null,9.5,{"$f":"SUM(G21:G23)","v":49.429282939700002}]
[]
[null,null,"Total Non-Activity Based Costs",null,null,null,null,{"$f":"SUM(H10:H24)","v":83.234008743100006}]
[]
[]
[null,null,"OTHER ITEMS adjusting RAV"]
[null,null,null,"Proceeds of sale of assets and scrap (not recorded on Table 2.2)"]
[null,null,null,null,"Cash proceeds received on sale of:",null,"£'m"]
[null,null,null,null,"Operational assets (-ve)"]
[null,null,null,null,"Sales of scrap (-ve)",null,-0.34825349999999999]
[null,null,null,null,"Non-operational assets (-ve)",null,-7.6416120000000004E-2]
[null,null,null,null,"Total",null,{"$f":"SUM(G31:G33)","v":-0.42466961999999997}]
[]
[null,null,null,null,"ANALYSIS OF ASSET DISPOSALS",null,"Cost","Depn.","Net Book Value","Net Sales Proceeds","(Profit) / Loss on Disposal","Asset Owner"]
[null,null,null,null,"Asset Type",null,"£m","£m","£m","£m","£m"]
[null,null,null,null,"Network",null,0.51624532999999995,0.26987753000000003,{"$f":"+G38-H38","v":0.24636779999999991},null,{"$f":"+I38-J38","v":0.24636779999999991}]
[null,null,null,null,"Land and Building",null,1.2436879999999999,1.0488601000000002,0.19482789999999972,null,{"$f":"+I39-J39","v":0.19482789999999972}]
[null,null,null,null,"Vehicles",null,0.42553903000000004,0.42553902999999998,0,7.6416120000000004E-2,-7.6416120000000004E-2]
[null,null,null,null,"Sale of various small elements of surplus Land & Buildings on sites",null,null,null,0,0.34825349999999999,-0.34825349999999999]
[]
[]
[]
[]
[]
[]
[]
[]
[]
[null,null,null,null,"Total"]
[null,null,null,null,null,null,null,null,null,"OK","OK"]
[]
[null,null,null,"Use of System Bad Debts",null,null,"£m","£m"]
[null,null,null,null,null,null,null,"previously allowed"]
[null,null,null,null,"Costs incurred (excluding VAT)",null,0,0]
[null,null,null,null,"Receipts/(recoveries)",null,0,0]
[null,null,null,null,"Total Use of System Bad Debts",null,0]
[]
[null,null,null,"Salary sacrifice schemes (including flexible benefit schemes)",null,null,"Total","Direct capex","Direct opex, faults & Non-op capex","Indirect costs","All Other non-distrib'n activities"]
[null,null,null,null,null,null,"£m","£m","£m","£m","£m"]
[null,null,null,null,"Salary element sacrificed by employee(-ve)",null,0,0,0,0,0]
[null,null,null,null,"Additional employer pension contributions (+ve)",null,0,0,0,0,0]
[]
[null,null,null,"Lane rentals analysis: including logged up costs (see below):",null,null,"Total","Load Related New Connections & Reinforcement","Non-load non-fault new & replacement assets","Faults","Inspectns & Maint. (exc. Tree Cutting)","Tree Cutting"]
[null,null,null,null,null,null,"£m","£m","£m","£m","£m","£m"]
[null,null,null,null,"Fines and penalties",null,{"$f":"SUM(H67:L67)","v":0.364514},0.20150799999999999,5.4666000000000006E-2,0.10834000000000001,0,0]
[null,null,null,null,"Road occupation costs",null,0,0,0,0,0,0]
[null,null,null,null,"Permit scheme costs",null,0,0,0,0,0,0]
[null,null,null,null,"Congestion charges",null,0,0,0,0,0,0]
[null,null,null,null,"Total per Table 2.2",null,0.2,0,0.1,0.1,0,0]
[]
[]
[null,null,"Uncertain Costs (included in table 2.2 costs)"]
[]
[null,null,null,"Road Occupation & Permit Scheme Costs included within Lane Rentals, previously agreed in writing with Ofgem to be treated as logged up costs:",null,null,"Total","Load Related New Connections & Reinforcement","Non-load non-fault new & replacement assets","Faults","Inspectns & Maint. (exc. Tree Cutting)","Tree Cutting"]
[null,null,null,null,null,null,"£m","£m","£m","£m","£m","£m"]
[null,null,null,null,"Road occupation costs",null,0]
[null,null,null,null,"Permit scheme costs",null,0]
[null,null,null,null,"Congestion charges",null,0]
[null,null,null,null,"Total",null,0,0,0,0,0,0]
[]
[null,null,null,"Costs previously agreed with Ofgem in writing for additional security",null,null,0,null,0]
[]
[]
[null,null,"Miscellaneous costs (included in table 2.2 costs)"]
[null,null,null,null,null,null,"£m"]
[null,null,null,"Pension administration costs (reported in HR & Non-op training)"]
[null,null,null,"LV Control centre costs (where it remotely controls LV network)"]
[]
[null,null,null,null,null,null,"£m","km"]
[null,null,null,"Expenditure replacing Pressure Assisted cables"]
[]
[null,null,null,"Undergrounding in National Parks / AONB - direct costs",null,null,"£m","km"]
[null,null,null,null,"LV"]
[null,null,null,null,"HV"]
[null,null,null,null,"EHV/132kV"]
[null,null,null,null,"Undergrounding in National Parks / AONB - indirect costs"]
[null,null,"Total Undergrounding in National Parks / AONB"]

{"sheet":"RRP 5.1","index":24,"n_rows":73,"n_cols":9,"rows_kept":73,"cut":false,"hidden":false,"merged":[[4,0,4,2],[7,7,7,8],[7,4,7,6]]}
["Regulatory Reporting Pack (RRP)",null,null,null,null,"Index"]
[]
["2007/08"]
[]
["Network Data"]
[]
[null,null,null,"Units","2005/06","2006/07","2007/08","2008/09","2009/10"]
[null,null,"QUALITY OF SERVICE",null,"Historical data",null,null,"For Future years"]
[null,null,"Customer Numbers ","Millions",null,null,2580775]
[null,null,"Total CIs (Excluding EE)","CIs",null,null,2119306]
[null,null,"Total CMLs (Excluding EE)","CMLs",null,null,198961241]
[]
[null,null,"NETWORK ACTIVITY INDICATORS"]
[]
[null,null,"CONNECTIONS"]
[null,null,"Number of new connections"]
[null,null,"EHV (Includes 132kV)","No. Connections",null,null,0]
[null,null,"HV","No. Connections",null,null,17]
[null,null,"LV","No. Connections",null,null,29758]
[null,null,"DG","No. Connections",null,null,9]
[]
[null,null,"Total Connected Distributed Generation "]
[null,null,"132kV","MW",null,null,0]
[null,null,"EHV","MW",null,null,166]
[null,null,"HV","MW",null,null,145]
[null,null,"LV","MW",null,null,2.2000000000000002]
[null,null,"Total",null,null,null,313.2]
[]
[null,null,"DEMANDS"]
[null,null,"System Maximum Demand ","MW",null,null,5635]
[null,null,"System Maximum Demand (Weather corrected)","MW",null,null,5497]
[]
[null,null,"Units Distributed"]
[null,null,"EHV (Includes 132kV)","GWh",null,null,710]
[null,null,"HV","GWh",null,null,9669]
[null,null,"LV","GWh",null,null,19286]
[null,null,"Total",null,null,null,29665]
[]
[null,null,"LOSSES"]
[null,null,"Units of distribution losses ","(GWh)",null,null,1439]
[null,null,"Losses ","(%)",null,null,4.8508343165346371E-2]
[]
[]
[null,null,"SYSTEM PARAMETERS"]
[]
[null,null,"Distribution Circuit Length - Overhead (km)"]
[null,null,"132kV","Circuit km",null,null,2384]
[null,null,"EHV","Circuit km",null,null,2702]
[null,null,"HV","Circuit km",null,null,12593]
[null,null,"LV","Circuit km",null,null,5071]
[null,null,"Total","Circuit km",null,null,22750]
[]
[null,null,"Distribution Circuit Length - Underground (km)"]
[null,null,"132kV","Circuit km",null,null,199]
[null,null,"EHV","Circuit km",null,null,1721]
[null,null,"HV","Circuit km",null,null,13288]
[null,null,"LV","Circuit km",null,null,32990]
[null,null,"Total","Circuit km",null,null,48198]
[]
[null,null,"Distribution Circuit Length - Total (km)"]
[null,null,"132kV","Circuit km",null,null,2583]
[null,null,"EHV","Circuit km",null,null,4423]
[null,null,"HV","Circuit km",null,null,25881]
[null,null,"LV","Circuit km",null,null,38061]
[null,null,"Total","Circuit km",null,null,70948]
[]
[null,null,"Number of Substations and Switching Stations "]
[null,null,"132kV","No. Subs",null,null,80]
[null,null,"EHV ground mounted","No. Subs",null,null,340]
[null,null,"EHV pole mounted","No. Subs",null,null,0]
[null,null,"HV ground mounted","No. Subs",null,null,19981]
[null,null,"HV pole mounted","No. Subs",null,null,22698]
[null,null,"Total","No. Subs",null,null,43099]

{"sheet":"LR1 Refs","index":25,"n_rows":55,"n_cols":3,"rows_kept":55,"cut":false,"hidden":false,"merged":[[37,1,37,2],[38,1,38,2],[7,1,7,2],[8,1,8,2],[16,1,16,2],[17,1,17,2],[28,1,28,2],[29,1,29,2]]}
[]
[]
[]
[null,"LR1 an LR1 (opt3) formula references"]
[]
[null,"LR1 (opt3) variant"]
[null,"Cell Ref: B16"]
[null,"Connections Capex 2005/06 -2014/15 (£m)"]
[null,"Connections spend minus customer contributions (from FBPQ LR1 v5 opt3)"]
[]
[null,"LV",{"$f":"SUM('FBPQ LR1 - V5 opt3'!D227:M227,'FBPQ LR1 - V5 opt3'!I229:M229)-SUM('FBPQ LR1 - V5 opt3'!D250:M250,'FBPQ LR1 - V5 opt3'!I252:M252)","v":0}]
[null,"HV",{"$f":"(SUM('FBPQ LR1 - V5 opt3'!D231:H231,'FBPQ LR1 - V5 opt3'!I230:M230,'FBPQ LR1 - V5 opt3'!I233:M233)-SUM('FBPQ LR1 - V5 opt3'!D254:H254,'FBPQ LR1 - V5 opt3'!I253:M253,'FBPQ LR1 - V5 opt3'!I256:M256))","v":0}]
[null,"EHV",{"$f":"SUM('FBPQ LR1 - V5 opt3'!D235:H235,'FBPQ LR1 - V5 opt3'!I234:M234,'FBPQ LR1 - V5 opt3'!I237:M237)-SUM('FBPQ LR1 - V5 opt3'!D258:H258,'FBPQ LR1 - V5 opt3'!I257:M257,'FBPQ LR1 - V5 opt3'!I260:M260)","v":0}]
[null,"132 kV",{"$f":"SUM('FBPQ LR1 - V5 opt3'!D239:H239,'FBPQ LR1 - V5 opt3'!I238:M238)-SUM('FBPQ LR1 - V5 opt3'!D262:H262,'FBPQ LR1 - V5 opt3'!I261:M261)","v":0}]
[]
[null,"Cell Ref B36"]
[null,"Connections Capex 2005/06 -2014/15 (£m)"]
[null,"Connections spend minus customer contributions (from FBPQ LR1 v5 opt3)"]
[]
[null,"LV",{"$f":"SUM('FBPQ LR1 - V5 opt3'!D227:M227,'FBPQ LR1 - V5 opt3'!I229:M229)-SUM('FBPQ LR1 - V5 opt3'!D250:M250,'FBPQ LR1 - V5 opt3'!I252:M252)","v":0}]
[null,"LV/HV",{"$f":"(SUM('FBPQ LR1 - V5 opt3'!D231:H231,'FBPQ LR1 - V5 opt3'!I230:M230,'FBPQ LR1 - V5 opt3'!I233:M233)-SUM('FBPQ LR1 - V5 opt3'!D254:H254,'FBPQ LR1 - V5 opt3'!I253:M253,'FBPQ LR1 - V5 opt3'!I256:M256))*(C55)","v":0}]
[null,"HV",{"$f":"(SUM('FBPQ LR1 - V5 opt3'!D231:H231,'FBPQ LR1 - V5 opt3'!I230:M230,'FBPQ LR1 - V5 opt3'!I233:M233)-SUM('FBPQ LR1 - V5 opt3'!D254:H254,'FBPQ LR1 - V5 opt3'!I253:M253,'FBPQ LR1 - V5 opt3'!I256:M256))*(1-C55)","v":0}]
[null,"EHV",{"$f":"SUM('FBPQ LR1 - V5 opt3'!D235:H235,'FBPQ LR1 - V5 opt3'!I234:M234,'FBPQ LR1 - V5 opt3'!I237:M237)-SUM('FBPQ LR1 - V5 opt3'!D258:H258,'FBPQ LR1 - V5 opt3'!I257:M257,'FBPQ LR1 - V5 opt3'!I260:M260)","v":0}]
[null,"132 kV",{"$f":"SUM('FBPQ LR1 - V5 opt3'!D239:H239,'FBPQ LR1 - V5 opt3'!I238:M238)-SUM('FBPQ LR1 - V5 opt3'!D262:H262,'FBPQ LR1 - V5 opt3'!I261:M261)","v":0}]
[]
[]
[null,"LR1 variant"]
[null,"Cell Ref: B16"]
[null,"Connections Capex 2005/06 -2014/15 (£m)"]
[null,"Connections spend minus customer contributions (from FBPQ LR1 v5 opt3)"]
[]
[null,"LV",{"$f":"SUM('FBPQ LR1'!D82:M82)-SUM('FBPQ LR1'!D110:M110)","v":41.132566013145379}]
[null,"HV",{"$f":"(SUM('FBPQ LR1'!D86:M86)-SUM('FBPQ LR1'!D114:M114))","v":100.38915569099296}]
[null,"EHV",{"$f":"(SUM('FBPQ LR1'!D90:M90)-SUM('FBPQ LR1'!D118:M118))","v":0.3967625126607135}]
[null,"132 kV",{"$f":"(SUM('FBPQ LR1'!D94:M94)-SUM('FBPQ LR1'!D122:M122))","v":0}]
[]
[null,"Cell Ref B36"]
[null,"Connections Capex 2005/06 -2014/15 (£m)"]
[null,"Connections spend minus customer contributions (from FBPQ LR1 v5 opt3)"]
[]
[null,"LV",{"$f":"SUM('FBPQ LR1'!D82:M82)-SUM('FBPQ LR1'!D110:M110)","v":41.132566013145379}]
[null,"LV/HV",{"$f":"(SUM('FBPQ LR1'!D86:M86)-SUM('FBPQ LR1'!D114:M114))*C55","v":19.84513086747566}]
[null,"HV",{"$f":"(SUM('FBPQ LR1'!D86:M86)-SUM('FBPQ LR1'!D114:M114))*(1-C55)","v":80.544024823517304}]
[null,"EHV",{"$f":"(SUM('FBPQ LR1'!D90:M90)-SUM('FBPQ LR1'!D118:M118))","v":0.3967625126607135}]
[null,"132 kV",{"$f":"(SUM('FBPQ LR1'!D94:M94)-SUM('FBPQ LR1'!D122:M122))","v":0}]
[]
[]
[]
[]
[]
[]
[]
[]
[]
[null,null,{"$f":"'Calc-Net capex'!C50/'Calc-Net capex'!C51","v":0.19768201785221498}]