{"text_format":"1","workbook":"xlsx","n_sheets":26,"sheets":["Change Log","Inputs","Outputs","Allocation Summary","DNO - Final Allocation","Calc - DNO Opex Allocation","Calc-Units","Calc-Drivers","Calc-MEAV","Calc-Net capex","Summary of revenue","Allowed revenue -DPCR4","FBPQ T4","FBPQ LR1","FBPQ LR1 - V5 opt3","FBPQ LR4","FBPQ LR6","FBPQ NL1 0309","NL9 - Legal & Safety","FBPQ C2","RRP 1.3","RRP 2.3","RRP 2.4","RRP 2.6","RRP 5.1","LR1 Refs"],"not_rendered":{"charts":0,"images":3,"macros":1,"external_links":9,"defined_names":65,"comments":0,"pivot_tables":0},"unopened":[],"bounds":{"document_bytes":16777216,"sheet_cells":100000,"rows_first":2000,"rows_last":500,"rows_between":2000,"halvings":0,"cell_chars":16384,"cell_head_chars":4096},"cells_cut":0,"cells_raw":0,"read":"whole","date_system":"1900"}

{"sheet":"Change Log","index":0,"n_rows":13,"n_cols":4,"rows_kept":13,"cut":false,"hidden":false,"merged":[]}
[]
["Method M Version No.",null,"[Extended Disaggregation Model PB LZ v1.0]"]
["Release Date:",null,"[01 April 2013]"]
[]
[]
[]
[]
["This version of Method M incorporates the following change proposals:"]
[]
["Ref","Approval Date","Implementation Date","Title"]
["DCP 071A","2011-06-20","2011-10-01","Allocation of Costs to HV Connected IDNOs with LV End Users"]
["DCP 095","2011-12-09","2012-04-01","Not included in this model"]
["DCP 096","2011-12-09","2012-04-01","Treatment of Transmission Exit Charges in CDCM Price Control Disaggregation Model (Method M)"]

{"sheet":"Inputs","index":1,"n_rows":41,"n_cols":6,"rows_kept":41,"cut":false,"hidden":false,"merged":[]}
[{"$f":"\"Extended Method M for \"&B5&\" in \"&B6&\"  Status: \"&B7&\"\"","v":"Extended Method M for WPD South Wales in 2014/15  Status: Indicative"}]
[]
[]
["1000. Company, charging year, data version"]
["DNO","WPD South Wales"]
["Charging Year","2014/15"]
["Version","Indicative"]
[]
[]
["1001. LV/HV Split"]
["Sources: HV main usage value provided each year by the Nominated Calculation Agent"]
["DNO LV Main usage",0.18440000000000001]
["DNO HV Main usage",0.4]
["DNO 33kV split",1]
["DNO 132kV split",1]
[]
[]
["1002. Method M input data"]
["Each DNO selects one of the options below to calculate the LDNO discounts:"]
["'LR1 opt 3' is an extended version of LR1, which contains all information from LR1, but breaks down certain lines into more detail."]
["Version LR1"]
["Version LR1, Option 3"]
[]
[]
[null,"This spreadsheet is currently using version: ","LR1"]
[]
["1003. Depreciation Factor"]
["Depreciation Factor",5.5449999999999999E-2]
[]
[]
["1004. CDCM Discounts"]
["Sources: CDCM Table 1037. (Embedded network (LDNO) discounts)"]
[null,"No discount","LDNO LV: LV user","LDNO HV: LV user","LDNO HV: LV sub user","LDNO HV: HV user"]
["LDNO discount using data in this model",null,0.31917482545910347,0.6722493164427723,0.50491311354064428,0.40641595144069448]
[]
["Additional Input Links"]
["Calc-Net capex'!K5","Suggest these values are set to 0 for those using LR1"]
["Calc-Net capex'!O6 to O10","Suggest these values are set to 0 for those using LR1"]
[]
["Notes"]
[" - Where DNOs do not hold asset data required by the Method M model within the RRP data tables, the DNO can substitute equivalent data within the Method M input tables."]

{"sheet":"Outputs","index":2,"n_rows":28,"n_cols":7,"rows_kept":28,"cut":false,"hidden":false,"merged":[[4,1,4,4]]}
[{"$f":"\"Extended Method M for \"&Inputs!B5&\" in \"&Inputs!B6&\"  Status: \"&Inputs!B7&\"\"","v":"Extended Method M for WPD South Wales in 2014/15  Status: Indicative"},null,null,null,null,null,"Index"]
[]
["The data table below is used to populate EDCM table 1181 (LDNO discounts)"]
[]
[]
["Boundary category","LV demand end user","LV Sub demand or LV generation end user","HV demand or LV Sub generation end user","HV generation end user"]
["Boundary 0000",{"$f":"IF((SUM('Allocation Summary'!B$13:H$13)-SUMPRODUCT('Allocation Summary'!B22:E22,'Allocation Summary'!E$13:H$13))/(1-SUMPRODUCT('Allocation Summary'!F22:I22,'Allocation Summary'!E$13:H$13))>1,1,(SUM('Allocation Summary'!B$13:H$13)-SUMPRODUCT('Allocation Summary'!B22:E22,'Allocation Summary'!E$13:H$13))/(1-SUMPRODUCT('Allocation Summary'!F22:I22,'Allocation Summary'!E$13:H$13)))","v":0.97120958425931259},{"$f":"IF((SUM('Allocation Summary'!C$13:H$13)-SUMPRODUCT('Allocation Summary'!B22:E22,'Allocation Summary'!E$13:H$13))/(1-'Allocation Summary'!B$13-SUMPRODUCT('Allocation Summary'!F22:I22,'Allocation Summary'!E$13:H$13))>1,1,(SUM('Allocation Summary'!C$13:H$13)-SUMPRODUCT('Allocation Summary'!B22:E22,'Allocation Summary'!E$13:H$13))/(1-'Allocation Summary'!B$13-SUMPRODUCT('Allocation Summary'!F22:I22,'Allocation Summary'!E$13:H$13)))","v":0.95711151239106973},{"$f":"IF((SUM('Allocation Summary'!D$13:H$13)-SUMPRODUCT('Allocation Summary'!B22:E22,'Allocation Summary'!E$13:H$13))/(1-SUM('Allocation Summary'!B$13:C$13)-SUMPRODUCT('Allocation Summary'!F22:I22,'Allocation Summary'!E$13:H$13))>1,1,(SUM('Allocation Summary'!D$13:H$13)-SUMPRODUCT('Allocation Summary'!B22:E22,'Allocation Summary'!E$13:H$13))/(1-SUM('Allocation Summary'!B$13:C$13)-SUMPRODUCT('Allocation Summary'!F22:I22,'Allocation Summary'!E$13:H$13)))","v":0.94905634905924496},{"$f":"IF((SUM('Allocation Summary'!E$13:H$13)-SUMPRODUCT('Allocation Summary'!B22:E22,'Allocation Summary'!E$13:H$13))/(1-SUM('Allocation Summary'!B$13:D$13)-SUMPRODUCT('Allocation Summary'!F22:I22,'Allocation Summary'!E$13:H$13))>1,1,(SUM('Allocation Summary'!E$13:H$13)-SUMPRODUCT('Allocation Summary'!B22:E22,'Allocation Summary'!E$13:H$13))/(1-SUM('Allocation Summary'!B$13:D$13)-SUMPRODUCT('Allocation Summary'!F22:I22,'Allocation Summary'!E$13:H$13)))","v":0.88893016873466779}]
["Boundary 132kV",{"$f":"IF((SUM('Allocation Summary'!B$13:H$13)-SUMPRODUCT('Allocation Summary'!B23:E23,'Allocation Summary'!E$13:H$13))/(1-SUMPRODUCT('Allocation Summary'!F23:I23,'Allocation Summary'!E$13:H$13))>1,1,(SUM('Allocation Summary'!B$13:H$13)-SUMPRODUCT('Allocation Summary'!B23:E23,'Allocation Summary'!E$13:H$13))/(1-SUMPRODUCT('Allocation Summary'!F23:I23,'Allocation Summary'!E$13:H$13)))","v":0.89924477814383641},{"$f":"IF((SUM('Allocation Summary'!C$13:H$13)-SUMPRODUCT('Allocation Summary'!B23:E23,'Allocation Summary'!E$13:H$13))/(1-'Allocation Summary'!B$13-SUMPRODUCT('Allocation Summary'!F23:I23,'Allocation Summary'!E$13:H$13))>1,1,(SUM('Allocation Summary'!C$13:H$13)-SUMPRODUCT('Allocation Summary'!B23:E23,'Allocation Summary'!E$13:H$13))/(1-'Allocation Summary'!B$13-SUMPRODUCT('Allocation Summary'!F23:I23,'Allocation Summary'!E$13:H$13)))","v":0.84990702728872991},{"$f":"IF((SUM('Allocation Summary'!D$13:H$13)-SUMPRODUCT('Allocation Summary'!B23:E23,'Allocation Summary'!E$13:H$13))/(1-SUM('Allocation Summary'!B$13:C$13)-SUMPRODUCT('Allocation Summary'!F23:I23,'Allocation Summary'!E$13:H$13))>1,1,(SUM('Allocation Summary'!D$13:H$13)-SUMPRODUCT('Allocation Summary'!B23:E23,'Allocation Summary'!E$13:H$13))/(1-SUM('Allocation Summary'!B$13:C$13)-SUMPRODUCT('Allocation Summary'!F23:I23,'Allocation Summary'!E$13:H$13)))","v":0.82171709853272901},{"$f":"IF((SUM('Allocation Summary'!E$13:H$13)-SUMPRODUCT('Allocation Summary'!B23:E23,'Allocation Summary'!E$13:H$13))/(1-SUM('Allocation Summary'!B$13:D$13)-SUMPRODUCT('Allocation Summary'!F23:I23,'Allocation Summary'!E$13:H$13))>1,1,(SUM('Allocation Summary'!E$13:H$13)-SUMPRODUCT('Allocation Summary'!B23:E23,'Allocation Summary'!E$13:H$13))/(1-SUM('Allocation Summary'!B$13:D$13)-SUMPRODUCT('Allocation Summary'!F23:I23,'Allocation Summary'!E$13:H$13)))","v":0.61129892699500066}]
["Boundary 132kV/EHV",{"$f":"IF((SUM('Allocation Summary'!B$13:H$13)-SUMPRODUCT('Allocation Summary'!B24:E24,'Allocation Summary'!E$13:H$13))/(1-SUMPRODUCT('Allocation Summary'!F24:I24,'Allocation Summary'!E$13:H$13))>1,1,(SUM('Allocation Summary'!B$13:H$13)-SUMPRODUCT('Allocation Summary'!B24:E24,'Allocation Summary'!E$13:H$13))/(1-SUMPRODUCT('Allocation Summary'!F24:I24,'Allocation Summary'!E$13:H$13)))","v":0.82666334843429168},{"$f":"IF((SUM('Allocation Summary'!C$13:H$13)-SUMPRODUCT('Allocation Summary'!B24:E24,'Allocation Summary'!E$13:H$13))/(1-'Allocation Summary'!B$13-SUMPRODUCT('Allocation Summary'!F24:I24,'Allocation Summary'!E$13:H$13))>1,1,(SUM('Allocation Summary'!C$13:H$13)-SUMPRODUCT('Allocation Summary'!B24:E24,'Allocation Summary'!E$13:H$13))/(1-'Allocation Summary'!B$13-SUMPRODUCT('Allocation Summary'!F24:I24,'Allocation Summary'!E$13:H$13)))","v":0.74178397075582159},{"$f":"IF((SUM('Allocation Summary'!D$13:H$13)-SUMPRODUCT('Allocation Summary'!B24:E24,'Allocation Summary'!E$13:H$13))/(1-SUM('Allocation Summary'!B$13:C$13)-SUMPRODUCT('Allocation Summary'!F24:I24,'Allocation Summary'!E$13:H$13))>1,1,(SUM('Allocation Summary'!D$13:H$13)-SUMPRODUCT('Allocation Summary'!B24:E24,'Allocation Summary'!E$13:H$13))/(1-SUM('Allocation Summary'!B$13:C$13)-SUMPRODUCT('Allocation Summary'!F24:I24,'Allocation Summary'!E$13:H$13)))","v":0.69328675375384108},{"$f":"IF((SUM('Allocation Summary'!E$13:H$13)-SUMPRODUCT('Allocation Summary'!B24:E24,'Allocation Summary'!E$13:H$13))/(1-SUM('Allocation Summary'!B$13:D$13)-SUMPRODUCT('Allocation Summary'!F24:I24,'Allocation Summary'!E$13:H$13))>1,1,(SUM('Allocation Summary'!E$13:H$13)-SUMPRODUCT('Allocation Summary'!B24:E24,'Allocation Summary'!E$13:H$13))/(1-SUM('Allocation Summary'!B$13:D$13)-SUMPRODUCT('Allocation Summary'!F24:I24,'Allocation Summary'!E$13:H$13)))","v":0.33128882837586793}]
["Boundary EHV",{"$f":"IF((SUM('Allocation Summary'!B$13:H$13)-SUMPRODUCT('Allocation Summary'!B25:E25,'Allocation Summary'!E$13:H$13))/(1-SUMPRODUCT('Allocation Summary'!F25:I25,'Allocation Summary'!E$13:H$13))>1,1,(SUM('Allocation Summary'!B$13:H$13)-SUMPRODUCT('Allocation Summary'!B25:E25,'Allocation Summary'!E$13:H$13))/(1-SUMPRODUCT('Allocation Summary'!F25:I25,'Allocation Summary'!E$13:H$13)))","v":0.79197190773349257},{"$f":"IF((SUM('Allocation Summary'!C$13:H$13)-SUMPRODUCT('Allocation Summary'!B25:E25,'Allocation Summary'!E$13:H$13))/(1-'Allocation Summary'!B$13-SUMPRODUCT('Allocation Summary'!F25:I25,'Allocation Summary'!E$13:H$13))>1,1,(SUM('Allocation Summary'!C$13:H$13)-SUMPRODUCT('Allocation Summary'!B25:E25,'Allocation Summary'!E$13:H$13))/(1-'Allocation Summary'!B$13-SUMPRODUCT('Allocation Summary'!F25:I25,'Allocation Summary'!E$13:H$13)))","v":0.69010484816053774},{"$f":"IF((SUM('Allocation Summary'!D$13:H$13)-SUMPRODUCT('Allocation Summary'!B25:E25,'Allocation Summary'!E$13:H$13))/(1-SUM('Allocation Summary'!B$13:C$13)-SUMPRODUCT('Allocation Summary'!F25:I25,'Allocation Summary'!E$13:H$13))>1,1,(SUM('Allocation Summary'!D$13:H$13)-SUMPRODUCT('Allocation Summary'!B25:E25,'Allocation Summary'!E$13:H$13))/(1-SUM('Allocation Summary'!B$13:C$13)-SUMPRODUCT('Allocation Summary'!F25:I25,'Allocation Summary'!E$13:H$13)))","v":0.631901442002479},{"$f":"IF((SUM('Allocation Summary'!E$13:H$13)-SUMPRODUCT('Allocation Summary'!B25:E25,'Allocation Summary'!E$13:H$13))/(1-SUM('Allocation Summary'!B$13:D$13)-SUMPRODUCT('Allocation Summary'!F25:I25,'Allocation Summary'!E$13:H$13))>1,1,(SUM('Allocation Summary'!E$13:H$13)-SUMPRODUCT('Allocation Summary'!B25:E25,'Allocation Summary'!E$13:H$13))/(1-SUM('Allocation Summary'!B$13:D$13)-SUMPRODUCT('Allocation Summary'!F25:I25,'Allocation Summary'!E$13:H$13)))","v":0.19745357918411574}]
["Boundary HVplus",{"$f":"IF((SUM('Allocation Summary'!B$13:H$13)-SUMPRODUCT('Allocation Summary'!B26:E26,'Allocation Summary'!E$13:H$13))/(1-SUMPRODUCT('Allocation Summary'!F26:I26,'Allocation Summary'!E$13:H$13))>1,1,(SUM('Allocation Summary'!B$13:H$13)-SUMPRODUCT('Allocation Summary'!B26:E26,'Allocation Summary'!E$13:H$13))/(1-SUMPRODUCT('Allocation Summary'!F26:I26,'Allocation Summary'!E$13:H$13)))","v":0.74078995697841132},{"$f":"IF((SUM('Allocation Summary'!C$13:H$13)-SUMPRODUCT('Allocation Summary'!B26:E26,'Allocation Summary'!E$13:H$13))/(1-'Allocation Summary'!B$13-SUMPRODUCT('Allocation Summary'!F26:I26,'Allocation Summary'!E$13:H$13))>1,1,(SUM('Allocation Summary'!C$13:H$13)-SUMPRODUCT('Allocation Summary'!B26:E26,'Allocation Summary'!E$13:H$13))/(1-'Allocation Summary'!B$13-SUMPRODUCT('Allocation Summary'!F26:I26,'Allocation Summary'!E$13:H$13)))","v":0.61386015337976729},{"$f":"IF((SUM('Allocation Summary'!D$13:H$13)-SUMPRODUCT('Allocation Summary'!B26:E26,'Allocation Summary'!E$13:H$13))/(1-SUM('Allocation Summary'!B$13:C$13)-SUMPRODUCT('Allocation Summary'!F26:I26,'Allocation Summary'!E$13:H$13))>1,1,(SUM('Allocation Summary'!D$13:H$13)-SUMPRODUCT('Allocation Summary'!B26:E26,'Allocation Summary'!E$13:H$13))/(1-SUM('Allocation Summary'!B$13:C$13)-SUMPRODUCT('Allocation Summary'!F26:I26,'Allocation Summary'!E$13:H$13)))","v":0.54133673959531847},{"$f":"IF((SUM('Allocation Summary'!E$13:H$13)-SUMPRODUCT('Allocation Summary'!B26:E26,'Allocation Summary'!E$13:H$13))/(1-SUM('Allocation Summary'!B$13:D$13)-SUMPRODUCT('Allocation Summary'!F26:I26,'Allocation Summary'!E$13:H$13))>1,1,(SUM('Allocation Summary'!E$13:H$13)-SUMPRODUCT('Allocation Summary'!B26:E26,'Allocation Summary'!E$13:H$13))/(1-SUM('Allocation Summary'!B$13:D$13)-SUMPRODUCT('Allocation Summary'!F26:I26,'Allocation Summary'!E$13:H$13)))","v":0}]
[]
[]
[]
[]
["Input data reconciliation check"]
["Compares results to current CDCM Method M*"]
[null,"LDNO LV: LV user","LDNO HV: LV user","LDNO HV: LV sub user","LDNO HV: HV user"]
["LDNO discount using data in this model",{"$f":"'Allocation Summary'!B9*(1-'Allocation Summary'!B10*Inputs!B12)","v":0.29827302842480446},{"$f":"'Allocation Summary'!B9+'Allocation Summary'!C9+'Allocation Summary'!D9*(1-'Allocation Summary'!D10*Inputs!B13)","v":0.65040256007512043},{"$f":"('Allocation Summary'!C9+'Allocation Summary'!D9*(1-'Allocation Summary'!D10*Inputs!B13))/(1-'Allocation Summary'!B9)","v":0.47921191533394425},{"$f":"'Allocation Summary'!D9*(1-'Allocation Summary'!D10*Inputs!B13)/(1-'Allocation Summary'!B9-'Allocation Summary'!C9)","v":0.38139934797310193}]
["LDNO discount using Method M",{"$f":"+Inputs!C34","v":0.31917482545910347},{"$f":"+Inputs!D34","v":0.6722493164427723},{"$f":"+Inputs!E34","v":0.50491311354064428},{"$f":"+Inputs!F34","v":0.40641595144069448}]
["*Note variances at LV:LV are expected as this version of extended Method M does not implement DCP095"]
[]
[]
[null,{"$f":"B7-'[9]Allocation Summary'!B25","v":0},{"$f":"C7-'[9]Allocation Summary'!C25","v":0},{"$f":"D7-'[9]Allocation Summary'!D25","v":0},{"$f":"E7-'[9]Allocation Summary'!E25","v":0}]
[null,{"$f":"B8-'[9]Allocation Summary'!B26","v":0},{"$f":"C8-'[9]Allocation Summary'!C26","v":0},{"$f":"D8-'[9]Allocation Summary'!D26","v":0},{"$f":"E8-'[9]Allocation Summary'!E26","v":0}]
[null,{"$f":"B9-'[9]Allocation Summary'!B27","v":0},{"$f":"C9-'[9]Allocation Summary'!C27","v":0},{"$f":"D9-'[9]Allocation Summary'!D27","v":0},{"$f":"E9-'[9]Allocation Summary'!E27","v":0}]
[null,{"$f":"B10-'[9]Allocation Summary'!B28","v":0},{"$f":"C10-'[9]Allocation Summary'!C28","v":0},{"$f":"D10-'[9]Allocation Summary'!D28","v":0},{"$f":"E10-'[9]Allocation Summary'!E28","v":0}]
[null,{"$f":"B11-'[9]Allocation Summary'!B29","v":0},{"$f":"C11-'[9]Allocation Summary'!C29","v":0},{"$f":"D11-'[9]Allocation Summary'!D29","v":0},{"$f":"E11-'[9]Allocation Summary'!E29","v":0}]

{"sheet":"Allocation Summary","index":3,"n_rows":26,"n_cols":9,"rows_kept":26,"cut":false,"hidden":false,"merged":[[2,1,2,5],[19,1,19,4],[19,5,19,8],[19,9,19,12]]}
[null,null,null,null,null,null,"Index"]
[]
["Category","% by network tier "]
[null,"LV","LV/HV","HV","EHV","Unallocated"]
["Opex and transmission exit charges",{"$f":"'DNO - Final Allocation'!I47","v":0.41429082693770697},{"$f":"'DNO - Final Allocation'!H47","v":8.3502633405527271E-2},{"$f":"'DNO - Final Allocation'!G47","v":0.28905190907172873},{"$f":"'DNO - Final Allocation'!E47","v":0.21315463058503697}]
["Depreciation",{"$f":"'DNO - Final Allocation'!I46","v":0.18558934458027709},{"$f":"'DNO - Final Allocation'!H46","v":8.6838733515246375E-2},{"$f":"'DNO - Final Allocation'!G46","v":0.35034237125516859},{"$f":"'DNO - Final Allocation'!E46","v":0.37722955064930797}]
["Return",{"$f":"'DNO - Final Allocation'!I45","v":0.18558934458027709},{"$f":"'DNO - Final Allocation'!H45","v":8.6838733515246375E-2},{"$f":"'DNO - Final Allocation'!G45","v":0.35034237125516859},{"$f":"'DNO - Final Allocation'!E45","v":0.37722955064930797}]
["Weighted Average",{"$f":"'DNO - Final Allocation'!N50","v":0.26532884296766313},{"$f":"'DNO - Final Allocation'!M50","v":8.5675562439234923E-2},{"$f":"'DNO - Final Allocation'!L50","v":0.32897272091420404},{"$f":"'DNO - Final Allocation'!K50","v":0.32002287367889787}]
["Weighted Average (after incentive and pension deficit costs removed and weighted by units flowing)",{"$f":"'DNO - Final Allocation'!O79","v":0.32871459578601642},{"$f":"'DNO - Final Allocation'!N79","v":0.10614303202379342},{"$f":"'DNO - Final Allocation'!M79","v":0.30593232916860152},{"$f":"'DNO - Final Allocation'!L79","v":0.23041962728090132},{"$f":"'DNO - Final Allocation'!P79","v":2.8790415740687234E-2}]
["Direct cost %",{"$f":"'Calc - DNO Opex Allocation'!AA48","v":0.50221202165909151},{"$f":"'Calc - DNO Opex Allocation'!Z48","v":0.74756196671321606},{"$f":"'Calc - DNO Opex Allocation'!Y48","v":0.73862246880647398},{"$f":"'Calc - DNO Opex Allocation'!X48","v":0.71937478264273791},"N/A"]
[]
[null,"LV","HV/LV","HV","EHV/HV","EHV","132kV/EHV","132kV"]
["Weighted by units flowing",{"$f":"B9","v":0.32871459578601642},0.10614303202379342,0.30593232916860152,{"$f":"E9*'Calc-MEAV'!$N28","v":3.7648958882146616E-2},{"$f":"E9*'Calc-MEAV'!$N29","v":4.8224432573733815E-2},{"$f":"E9*'Calc-MEAV'!$N30","v":4.4508247488674123E-2},{"$f":"E9*'Calc-MEAV'!$N31","v":0.10003798833634676}]
["Direct cost %",0.50221202165909151,0.74756196671321606,0.73862246880647398,{"$f":"E10","v":0.71937478264273791},{"$f":"E10","v":0.71937478264273791},{"$f":"E10","v":0.71937478264273791},{"$f":"E10","v":0.71937478264273791}]
[]
["Options","DCP071"]
[null,true]
["Discount matrix"]
[]
[null,"Network levels provided or bypassed by the DNO",null,null,null,"Network levels bypassed by the DNO"]
["Boundary category","EHV/HV","EHV","132kV/EHV","132kV","EHV/HV","EHV","132kV/EHV","132kV"]
["Boundary 0000",0,0,0,0,0,0,0,0]
["Boundary 132kV",0,0,0,{"$f":"IF($B$17,Inputs!$B$15*$H$14,1)","v":0.71937478264273791},0,0,0,0]
["Boundary 132kV/EHV",0,0,1,1,0,0,0,0]
["Boundary EHV",0,{"$f":"IF($B$17,Inputs!$B$14*$F$14,1)","v":0.71937478264273791},1,1,0,0,0,0]
["Boundary HVplus",1,1,1,1,0,0,0,0]

{"sheet":"DNO - Final Allocation","index":4,"n_rows":81,"n_cols":19,"rows_kept":81,"cut":false,"hidden":false,"merged":[[69,3,69,9],[69,11,69,17],[42,4,42,8],[42,10,42,13],[42,15,42,19],[68,3,68,10],[68,11,68,17]]}
["Step 1. Format price control allowed revenue data"]
["Index"]
[]
[null,"I) DPCR3 type presentation",null,null,null,null,null,null,null,null,null,"ii) DPCR4 type presentation"]
[]
[null,null,null,"2005/06","2006/07",null,"2007/08","2008/09","2009/10",null,null,null,null,null,"2005/06","2006/07","2007/08","2008/09","2009/10"]
[null,null,null,null,null,null,null,null,null,null,null,"Opening asset value",null,null,{"$f":"'Allowed revenue -DPCR4'!D3","v":573.6},{"$f":"'Allowed revenue -DPCR4'!E3","v":577.79999999999995},{"$f":"'Allowed revenue -DPCR4'!F3","v":579.29999999999995},{"$f":"'Allowed revenue -DPCR4'!G3","v":578.4},{"$f":"'Allowed revenue -DPCR4'!H3","v":575}]
[null,"Allowed revenue",null,{"$f":"O33","v":140.70458227880613},{"$f":"P33","v":142.53374184843059},null,{"$f":"Q33","v":144.36290141805509},{"$f":"R33","v":145.91065182312195},{"$f":"S33","v":147.73981139274645},null,null,"Total capex",null,null,{"$f":"'Allowed revenue -DPCR4'!D4","v":49.9},{"$f":"'Allowed revenue -DPCR4'!E4","v":49.7},{"$f":"'Allowed revenue -DPCR4'!F4","v":49.7},{"$f":"'Allowed revenue -DPCR4'!G4","v":49.7},{"$f":"'Allowed revenue -DPCR4'!H4","v":49.7}]
[null,null,null,null,null,null,null,null,null,null,null,"Depreciation",null,null,{"$f":"'Allowed revenue -DPCR4'!D5","v":-45.7},{"$f":"'Allowed revenue -DPCR4'!E5","v":-48.2},{"$f":"'Allowed revenue -DPCR4'!F5","v":-50.6},{"$f":"'Allowed revenue -DPCR4'!G5","v":-53.1},{"$f":"'Allowed revenue -DPCR4'!H5","v":-55.6}]
[null,"Opex (incl pensions after  57.7% capitalized)",null,{"$f":"O14+(1-0.577)*O16","v":47.230000000000004},{"$f":"P14+(1-0.577)*P16","v":48.6877},null,{"$f":"Q14+(1-0.577)*Q16","v":49.4146},{"$f":"R14+(1-0.577)*R16","v":49.099200000000003},{"$f":"S14+(1-0.577)*S16","v":48.741499999999995},null,null,"Closing asset value",null,null,{"$f":"'Allowed revenue -DPCR4'!D6","v":577.79999999999995},{"$f":"'Allowed revenue -DPCR4'!E6","v":579.29999999999995},{"$f":"'Allowed revenue -DPCR4'!F6","v":578.4},{"$f":"'Allowed revenue -DPCR4'!G6","v":575},{"$f":"'Allowed revenue -DPCR4'!H6","v":569.1}]
[null,"Quality Reward",null,{"$f":"O20","v":1.6},{"$f":"P20","v":1.6},{"$f":"Q20","v":1.6},{"$f":"Q20","v":1.6},{"$f":"R20","v":1.3},{"$f":"S20","v":1.3},null,null,"Present value of opening/closing RAV",null,null,{"$f":"'Allowed revenue -DPCR4'!D7","v":0},null,{"$f":"'Allowed revenue -DPCR4'!F7","v":" "},null,{"$f":"'Allowed revenue -DPCR4'!H7","v":434.51048876277451}]
[null,"DPCR3 costs",null,{"$f":"O21","v":0.9},null,null,null,null,null,null,null,"5 year movement in closing RAV",null,null,null,{"$f":"'Allowed revenue -DPCR4'!E8","v":" "},null,null,{"$f":"'Allowed revenue -DPCR4'!H8","v":139.08951123722551}]
[null,"Total Opex",null,{"$f":"SUM(D10:D12)","v":49.730000000000004},{"$f":"SUM(E10:E12)","v":50.287700000000001},null,{"$f":"SUM(G10:G12)","v":51.014600000000002},{"$f":"SUM(H10:H12)","v":50.3992},{"$f":"SUM(I10:I12)","v":50.041499999999992}]
[null,null,null,null,null,null,null,null,null,null,null,"Operating costs (excl pensions)",null,null,{"$f":"'Allowed revenue -DPCR4'!D10","v":43},{"$f":"'Allowed revenue -DPCR4'!E10","v":44.5},{"$f":"'Allowed revenue -DPCR4'!F10","v":45.1},{"$f":"'Allowed revenue -DPCR4'!G10","v":44.7},{"$f":"'Allowed revenue -DPCR4'!H10","v":44.3}]
[null,"Capital elements",null,null,null,null,null,null,null,null,null,"Capex (excl pensions)",null,null,{"$f":"'Allowed revenue -DPCR4'!D11","v":44.1},{"$f":"'Allowed revenue -DPCR4'!E11","v":44},{"$f":"'Allowed revenue -DPCR4'!F11","v":43.8},{"$f":"'Allowed revenue -DPCR4'!G11","v":43.7},{"$f":"'Allowed revenue -DPCR4'!H11","v":43.6}]
[null,"Depreciation",null,{"$f":"-O9","v":45.7},{"$f":"-P9","v":48.2},null,{"$f":"-Q9","v":50.6},{"$f":"-R9","v":53.1},{"$f":"-S9","v":55.6},null,null,"Pensions",null,null,{"$f":"'Allowed revenue -DPCR4'!D12","v":10},{"$f":"'Allowed revenue -DPCR4'!E12","v":9.9},{"$f":"'Allowed revenue -DPCR4'!F12","v":10.199999999999999},{"$f":"'Allowed revenue -DPCR4'!G12","v":10.4},{"$f":"'Allowed revenue -DPCR4'!H12","v":10.5}]
[null,"Tax allowance",null,{"$f":"O17","v":13.1},14.2,null,{"$f":"Q17","v":15},15.9,16.7,null,null,"Tax allowance",null,null,{"$f":"'Allowed revenue -DPCR4'!D13","v":13.1},{"$f":"'Allowed revenue -DPCR4'!E13","v":14.2},{"$f":"'Allowed revenue -DPCR4'!F13","v":15},{"$f":"'Allowed revenue -DPCR4'!G13","v":15.9},{"$f":"'Allowed revenue -DPCR4'!H13","v":16.7}]
[null,"Capital incentive",null,-1.7,-1.1000000000000001,null,-0.9,-0.3,-0.1,null,null,"Capex incentive",null,null,{"$f":"'Allowed revenue -DPCR4'!D14","v":-1.7},{"$f":"'Allowed revenue -DPCR4'!E14","v":-1.1000000000000001},{"$f":"'Allowed revenue -DPCR4'!F14","v":-0.9},{"$f":"'Allowed revenue -DPCR4'!G14","v":-0.3},{"$f":"'Allowed revenue -DPCR4'!H14","v":-0.1}]
[null,"Sliding scale",null,1.2,1.2,null,1.2,1.2,1.1000000000000001,null,null,"Sliding scale addn income",null,null,{"$f":"'Allowed revenue -DPCR4'!D15","v":1.2},{"$f":"'Allowed revenue -DPCR4'!E15","v":1.2},{"$f":"'Allowed revenue -DPCR4'!F15","v":1.2},{"$f":"'Allowed revenue -DPCR4'!G15","v":1.2},{"$f":"'Allowed revenue -DPCR4'!H15","v":1.1000000000000001}]
[null,"Return",null,{"$f":"D8-D13-D16-D17-D18-D19","v":32.67458227880612},{"$f":"E8-E13-E16-E17-E18-E19","v":29.746041848430593},null,{"$f":"G8-G13-G16-G17-G18-G19","v":27.448301418055085},{"$f":"H8-H13-H16-H17-H18-H19","v":25.611451823121946},{"$f":"I8-I13-I16-I17-I18-I19","v":24.398311392746461},null,null,"Quality reward/Opex incentive & Other Adjustments",null,null,{"$f":"IF(ISNUMBER('Allowed revenue -DPCR4'!D16+'Allowed revenue -DPCR4'!D17),'Allowed revenue -DPCR4'!D16+'Allowed revenue -DPCR4'!D17,\"\")","v":1.6},{"$f":"IF(ISNUMBER('Allowed revenue -DPCR4'!E16+'Allowed revenue -DPCR4'!E17),'Allowed revenue -DPCR4'!E16+'Allowed revenue -DPCR4'!E17,\"\")","v":1.6},{"$f":"IF(ISNUMBER('Allowed revenue -DPCR4'!F16+'Allowed revenue -DPCR4'!F17),'Allowed revenue -DPCR4'!F16+'Allowed revenue -DPCR4'!F17,\"\")","v":1.6},{"$f":"IF(ISNUMBER('Allowed revenue -DPCR4'!G16+'Allowed revenue -DPCR4'!G17),'Allowed revenue -DPCR4'!G16+'Allowed revenue -DPCR4'!G17,\"\")","v":1.3},{"$f":"IF(ISNUMBER('Allowed revenue -DPCR4'!H16+'Allowed revenue -DPCR4'!H17),'Allowed revenue -DPCR4'!H16+'Allowed revenue -DPCR4'!H17,\"\")","v":1.3}]
[null,"Total capital",null,{"$f":"SUM(D16:D20)","v":90.974582278806125},{"$f":"SUM(E16:E20)","v":92.246041848430593},null,{"$f":"SUM(G16:G20)","v":93.348301418055073},{"$f":"SUM(H16:H20)","v":95.511451823121945},{"$f":"SUM(I16:I20)","v":97.698311392746461},null,null,"DPCR3 costs",null,null,{"$f":"'Allowed revenue -DPCR4'!D18","v":0.9},{"$f":"'Allowed revenue -DPCR4'!E18","v":0},{"$f":"'Allowed revenue -DPCR4'!F18","v":0},{"$f":"'Allowed revenue -DPCR4'!G18","v":0},{"$f":"'Allowed revenue -DPCR4'!H18","v":0}]
[null,"Total capital ex depreciation",null,{"$f":"D21-D16","v":45.274582278806122},{"$f":"E21-E16","v":44.04604184843059},null,{"$f":"G21-G16","v":42.748301418055071},{"$f":"H21-H16","v":42.411451823121944},{"$f":"I21-I16","v":42.09831139274646},null,null,"Total allowed items",null,null,{"$f":"'Allowed revenue -DPCR4'!D19","v":112.2},{"$f":"'Allowed revenue -DPCR4'!E19","v":114.3},{"$f":"'Allowed revenue -DPCR4'!F19","v":116},{"$f":"'Allowed revenue -DPCR4'!G19","v":116.9},{"$f":"'Allowed revenue -DPCR4'!H19","v":117.4}]
[null,null,null,null,null,null,null,null,null,null,null,"PV of allowed items",null,null,{"$f":"'Allowed revenue -DPCR4'!D20","v":109.21292148782669},{"$f":"'Allowed revenue -DPCR4'!E20","v":105.41192249868327},{"$f":"'Allowed revenue -DPCR4'!F20","v":101.35935275953834},{"$f":"'Allowed revenue -DPCR4'!G20","v":96.779346753468715},{"$f":"'Allowed revenue -DPCR4'!H20","v":92.087060022660708}]
[null,"Allocation of allowed revenue to:-",null,null,null,null,null,null,null,null,null,"5 year movement in closing RAV",null,null,null,null,null,null,{"$f":"'Allowed revenue -DPCR4'!H21","v":139.08951123722551}]
[null,null,null,null,null,null,null,null,null,null,null,"TOTAL PV OVER 5 YEARS",null,null,null,null,null,null,{"$f":"'Allowed revenue -DPCR4'!H22","v":643.94011475940329}]
[null,"Opex",null,{"$f":"D13","v":49.730000000000004},{"$f":"E13","v":50.287700000000001},null,{"$f":"G13","v":51.014600000000002},{"$f":"H13","v":50.3992},{"$f":"I13","v":50.041499999999992}]
[null,"Depreciation",null,{"$f":"D16","v":45.7},{"$f":"E16","v":48.2},null,{"$f":"G16","v":50.6},{"$f":"H16","v":53.1},{"$f":"I16","v":55.6},null,null,null,null,null,{"$f":"1/(1+Inputs!B28)","v":0.94746316736936853},{"$f":"O27/(1+Inputs!B28)","v":0.89768645352159604},{"$f":"P27/(1+Inputs!B28)","v":0.85052485055814675},{"$f":"Q27/(1+Inputs!B28)","v":0.8058409688361805},{"$f":"R27/(1+Inputs!B28)","v":0.76350463672952817}]
[null,"Return",null,{"$f":"D20","v":32.67458227880612},{"$f":"E20","v":29.746041848430593},null,{"$f":"G20","v":27.448301418055085},{"$f":"H20","v":25.611451823121946},{"$f":"I20","v":24.398311392746461},null,null,null,null,null,1,{"$f":"O27","v":0.94746316736936853},{"$f":"P27","v":0.89768645352159604},{"$f":"Q27","v":0.85052485055814675},{"$f":"R27","v":0.8058409688361805}]
[null,null,null,null,null,null,null,null,null,null,null,null,null,null,{"$f":"1/(1+Inputs!B28)^0.5","v":0.97337719686120061},{"$f":"1/(1+Inputs!B28)^1.5","v":0.92223904198323059},{"$f":"1/(1+Inputs!B28)^2.5","v":0.87378752378912361},{"$f":"1/(1+Inputs!B28)^3.5","v":0.82788149489708041},{"$f":"1/(1+Inputs!B28)^4.5","v":0.78438722336167555}]
[]
[null,null,null,null,null,null,null,null,null,null,null,"Revenue index",null,null,{"$f":"'Allowed revenue -DPCR4'!D24","v":1},{"$f":"'Allowed revenue -DPCR4'!E24","v":1.0129999999999999},{"$f":"'Allowed revenue -DPCR4'!F24","v":1.026},{"$f":"'Allowed revenue -DPCR4'!G24","v":1.0369999999999999},{"$f":"'Allowed revenue -DPCR4'!H24","v":1.05}]
[null,null,null,null,null,null,null,null,null,null,null,"Discounted revenue index",null,null,{"$f":"O31*O29","v":0.97337719686120061},{"$f":"P31*P29","v":0.93422814952901245},{"$f":"Q31*Q29","v":0.89650599940764086},{"$f":"R31*R29","v":0.85851311020827237},{"$f":"S31*S29","v":0.82360658452975932}]
[null,null,null,null,null,null,null,null,null,null,null,"Price control revenue",null,null,{"$f":"($S$25-$N$39)/SUM($O$32:$U$32)*O31","v":140.70458227880613},{"$f":"($S$25-$N$39)/SUM($O$32:$U$32)*P31","v":142.53374184843059},{"$f":"($S$25-$N$39)/SUM($O$32:$U$32)*Q31","v":144.36290141805509},{"$f":"($S$25-$N$39)/SUM($O$32:$U$32)*R31","v":145.91065182312195},{"$f":"($S$25-$N$39)/SUM($O$32:$U$32)*S31","v":147.73981139274645}]
[null,null,null,null,null,null,null,null,null,null,null,"Excluded services revenue",null,null,{"$f":"'Allowed revenue -DPCR4'!D27","v":2.9},{"$f":"'Allowed revenue -DPCR4'!E27","v":2.9},{"$f":"'Allowed revenue -DPCR4'!F27","v":2.9},{"$f":"'Allowed revenue -DPCR4'!G27","v":2.9},{"$f":"'Allowed revenue -DPCR4'!H27","v":2.9}]
[null,null,null,null,null,null,null,null,null,null,null,"Total revenue",null,null,{"$f":"O34+O33","v":143.60458227880613},{"$f":"P34+P33","v":145.4337418484306},{"$f":"Q34+Q33","v":147.26290141805509},{"$f":"R34+R33","v":148.81065182312196},{"$f":"S34+S33","v":150.63981139274645}]
[null,null,null,null,null,null,null,null,null,null,null,"PV of total revenue",null,null,{"$f":"O35*O29","v":139.78142575496796},{"$f":"P35*P29","v":134.12467475433311},{"$f":"Q35*Q29","v":128.67648597608419},{"$f":"R35*R29","v":123.19758488793515},{"$f":"S35*S29","v":118.15994338608289}]
[null,null,null,null,null,null,null,null,null,null,null,"TOTAL PV OVER 5 YEARS",null,null,null,null,null,null,{"$f":"SUM(O36:S36)","v":643.94011475940329}]
[]
[null,null,null,null,null,null,null,null,null,null,null,"PV of excluded service revenue",null,{"$f":"SUM(O39:S39)","v":12.706850194587702},{"$f":"O34*O29","v":2.8227938708974816},{"$f":"P34*P29","v":2.6744932217513688},{"$f":"Q34*Q29","v":2.5339838189884585},{"$f":"R34*R29","v":2.4008563352015333},{"$f":"S34*S29","v":2.2747229477488591}]
[]
["Step 2. Allocate price control revenues to network tiers "]
[]
[null,"Hence DPCR4 revenue made up of","Total DPCR4","Basis of allocation","% used",null,null,null,null,null,"£m"]
[null,null,null,null,"EHV",null,"HV","HV/LV","LV",null,"EHV","HV","HV/LV","LV"]
[null,"Return",{"$f":"SUM(D22:I22)","v":216.57868876116021},"Net Capex",{"$f":"VLOOKUP($D45,'Calc-Drivers'!$B$17:$F$27,E$51,FALSE)","v":0.37722955064930797},null,{"$f":"VLOOKUP($D45,'Calc-Drivers'!$B$17:$F$27,G$51,FALSE)","v":0.35034237125516859},{"$f":"VLOOKUP($D45,'Calc-Drivers'!$B$17:$F$27,H$51,FALSE)","v":8.6838733515246375E-2},{"$f":"VLOOKUP($D45,'Calc-Drivers'!$B$17:$F$27,I$51,FALSE)","v":0.18558934458027709},null,{"$f":"$C45*E45","v":81.699881441588786},{"$f":"$C45*G45","v":75.876691383920004},18.807419038411876,40.194696897239545]
[null,"Depreciation",{"$f":"SUM(D16:I16)","v":253.2},"Net Capex",{"$f":"VLOOKUP($D46,'Calc-Drivers'!$B$17:$F$27,E$51,FALSE)","v":0.37722955064930797},null,{"$f":"VLOOKUP($D46,'Calc-Drivers'!$B$17:$F$27,G$51,FALSE)","v":0.35034237125516859},{"$f":"VLOOKUP($D46,'Calc-Drivers'!$B$17:$F$27,H$51,FALSE)","v":8.6838733515246375E-2},{"$f":"VLOOKUP($D46,'Calc-Drivers'!$B$17:$F$27,I$51,FALSE)","v":0.18558934458027709},null,{"$f":"$C46*E46","v":95.514522224404772},88.706688401808691,21.987567326060383,46.991222047726161]
[null,"Operating costs",{"$f":"SUM(D13:I13)","v":251.47300000000001},"Overall Opex split",{"$f":"'Calc - DNO Opex Allocation'!AN41","v":0.21315463058503697},null,{"$f":"'Calc - DNO Opex Allocation'!AO41","v":0.28905190907172873},{"$f":"'Calc - DNO Opex Allocation'!AP41","v":8.3502633405527271E-2},{"$f":"'Calc - DNO Opex Allocation'!AQ41","v":0.41429082693770697},null,{"$f":"$C47*E47","v":53.602634417111005},72.688750729994837,20.99865773038816,{"$f":"$C47*I47","v":104.182957122506}]
[]
[null,"Total",{"$f":"SUM(C45:C47)","v":721.25168876116027},null,null,null,null,null,null,null,{"$f":"SUM(K45:K48)","v":230.81703808310456},{"$f":"SUM(L45:L48)","v":237.27213051572355},{"$f":"SUM(M45:M48)","v":61.793644094860419},{"$f":"SUM(N45:N48)","v":191.36887606747172}]
[null,null,null,null,null,null,null,null,null,null,{"$f":"K49/SUM($K$49:$N$49)","v":0.32002287367889787},{"$f":"L49/SUM($K$49:$N$49)","v":0.32897272091420404},{"$f":"M49/SUM($K$49:$N$49)","v":8.5675562439234923E-2},{"$f":"N49/SUM($K$49:$N$49)","v":0.26532884296766313}]
[null,null,null,null,5,null,4,3,2]
[]
[null,null,null,"NET CAPEX SPLIT FROM \"CALC -NET CAPEX\" SHEET"]
[null,null,null,"OVERALL OPEX SPLIT FROM \"CALC DNO OPEX ALLOCATION\" SHEET"]
[]
["Step 3. Remove incentive revenue and pension deficit payment from allocations"]
[]
[null,"2007/08 allowed revenue source from page \"summary allowed revenue\""]
[null,"Base revenue",null,null,null,{"$f":"'Summary of revenue'!J11","v":164.61900800000001},{"$f":"F59/$F$64","v":0.94427803641023134},null,null,null,null,null,null,null,null,"£m"]
[null,"Allowed pass through items",null,null,null,{"$f":"'Summary of revenue'!J12","v":-0.91199699999999995},{"$f":"F60/$F$64","v":-5.2313444652273789E-3}]
[null,"Incentive revenue",null,null,null,{"$f":"'Summary of revenue'!J13","v":2.5028890000000001},{"$f":"F61/$F$64","v":1.435692717983556E-2},null,null,null,null,null,"Total allowed income",null,null,{"$f":"F64","v":174.33319600000002},"From 2007/08 revenue summary"]
[null,"Under/over revoery",null,null,null,{"$f":"'Summary of revenue'!J21","v":2.533296},{"$f":"F62/$F$64","v":1.4531346055285993E-2}]
[null,"Excluded",null,null,null,{"$f":"'Summary of revenue'!J46+'Summary of revenue'!J47","v":5.59},{"$f":"F63/$F$64","v":3.2065034819874459E-2},null,null,null,null,null,"Less incentive revenue ?",null,"Y",{"$f":"IF(O63=\"Y\",-F61,0)","v":-2.5028890000000001},"From 2007/08 revenue summary"]
[null,"Total",null,null,null,{"$f":"SUM(F59:F63)","v":174.33319600000002},{"$f":"SUM(G59:G63)","v":1},null,null,null,null,null,"Less Pension deficit payment?",null,"N",{"$f":"IF(O64=\"Y\",-F66,0)","v":0}]
[null,null,null,null,null,null,null,null,null,null,null,null,"Less transmission exit charges?",null,"Y",{"$f":"IF(O65=\"Y\",-'RRP 1.3'!AH12,0)","v":-4.2}]
[null,"Input pension deficit payment",null,null,null,0]
[null,null,null,null,null,null,null,null,null,null,null,null,"Total revenue to share",null,null,{"$f":"P61+P63+P64+P65","v":167.63030700000002}]
[]
[null,null,null,"Step 3.a. Split out pension deficit and incentive payments",null,null,null,null,null,null,null,"Step 2.b. Divide cost by units flowing - effectively adjust the cost because of electricity lost as it flows thorugh the network meaning that there is more cost in the lower tiers"]
[null,"SPLIT OF TARIFFS",null,"£m",null,null,null,null,null,null,null,"p/kWh"]
[null,null,null,"Total",null,"EHV","HV","HV/LV","LV","Not to be split",null,"EHV","HV","HV/LV","LV","Not to be split",null,"Total"]
[]
[null,"Income",null,{"$f":"SUM(F73:J73)","v":174.33319600000002},null,{"$f":"$P$67*K50","v":53.645532561815877},{"$f":"$P$67*L50","v":55.145798201473347},{"$f":"$P$67*M50","v":14.36182083408662},{"$f":"$P$67*N50","v":44.477155402624163},{"$f":"P61-P67","v":6.702888999999999},null,{"$f":"F73*100000000/'Calc-Units'!E21","v":0.43204468939218393},{"$f":"G73*100000000/'Calc-Units'!D21","v":0.57363359055147412},{"$f":"H73*100000000/'Calc-Units'!C21","v":0.19902181877049463},{"$f":"I73*100000000/'Calc-Units'!C21","v":0.61635112039267781},{"$f":"J73*100000000/'Calc-Units'!E21","v":5.3983015131749856E-2}]
[]
[null,"All LV Tariffs",null,null,null,null,null,null,null,null,null,{"$f":"L73","v":0.43204468939218393},{"$f":"M73","v":0.57363359055147412},{"$f":"N73","v":0.19902181877049463},{"$f":"O73","v":0.61635112039267781},{"$f":"P73","v":5.3983015131749856E-2},null,{"$f":"SUM(L75:P75)","v":1.8750342342385804}]
[null,"HV Tariffs"]
[null,"EHV Tariffs"]
[]
[null,"All LV Tariffs",null,null,null,null,null,null,null,null,null,{"$f":"L75/$R75","v":0.23041962728090132},{"$f":"M75/$R75","v":0.30593232916860152},{"$f":"N75/$R75","v":0.10614303202379342},{"$f":"O75/$R75","v":0.32871459578601642},{"$f":"P75/$R75","v":2.8790415740687234E-2},null,{"$f":"SUM(L79:P79)","v":0.99999999999999989}]
[null,"HV Tariffs"]
[null,"EHV Tariffs"]

{"sheet":"Calc - DNO Opex Allocation","index":5,"n_rows":49,"n_cols":49,"rows_kept":49,"cut":false,"hidden":false,"merged":[[41,38,41,42],[41,0,61,0],[41,1,46,1],[47,1,61,1],[3,4,3,7],[2,4,2,8],[5,0,10,0],[5,1,10,1],[11,1,25,1],[38,45,38,48],[38,29,38,32],[3,11,3,14],[38,23,38,26],[38,39,38,42],[2,17,2,20],[2,23,2,26],[2,45,2,48],[2,34,2,36],[2,39,2,42],[2,29,2,32],[2,10,2,14],[1,34,1,48],[1,3,1,8],[1,10,1,14],[1,17,1,20],[1,23,1,26],[1,29,1,32]]}
["Index"]
[null,null,null,"Step 1 - extract total activity costs from cost report",null,null,null,null,null,null,"Step 2. Identify costs included in price control revenues to be allocated by MEAV",null,null,null,null,null,null,"Step 3.  Allocate costs not directly attributable to network teirs to network tiers using MEAV",null,null,null,null,null,"Step 4.  Sum directly attributed and allocated costs",null,null,null,null,null,"Step 5. Divide cost by units flowing - effectively adjust the cost because of electricity lost as it flows through the network meaning that there is more cost in the lower tiers",null,null,null,null,"Step 6.   Adjust costs so that they are aligned with the definition of opex in the allowed price control revenues"]
[null,null,null,null,"Costs extracted from RRP Tables",null,null,null,null,null,"Cost drivers - lookup from \"Calc-Drivers\"",null,null,null,null,null,null,"Allocation of \"Unallocated\" costs by cost driver to network tiers",null,null,null,null,null,"Sum of allocated and \"unallocated\" costs",null,null,null,null,null,"Sum of allocated and \"unallocated\" costs expressed per unit throughput (p/kWh)",null,null,null,null,"Proportion of costs allocated to Opex and Capex",null,null,null,null,"Operating costs = sum of allocated and unallocated multiplied by 1 minus capitalised proportion",null,null,null,null,null,"Opex only on p/kWh throughput"]
[null,null,null,"Total activity cost - from RRP 1.3","Costs allocated to network tiers in RRP - from 2.2 amd 2.3",null,null,null,"Unallocated costs = Total - costs allocated to network tiers",null,"Insert name of cost driver","Proportion of cost allocated to each network tier",null,null,null,null,null,null,null,null,null,null,null,null,null,null,null,null,null,null,null,null,null,null,"% Cost capitalised (from DCPR settlement - same for all DNOs)","Capex","Opex",null,null,"EHV","HV","HV/LV","LV",null,null,"EHV","HV","HV/LV","LV"]
[null,null,null,null,"EHV","HV","HV/LV","LV",null,null,null,"EHV","HV","HV/LV","LV",null,null,"EHV","HV","HV/LV","LV",null,null,"EHV","HV","HV/LV","LV",null,null,"EHV","HV","HV/LV","LV"]
["Cash typical costs (excluding disallowed related party margins)","Direct activities - From RRP 2.2 Detailed Cost Matrix","Load related new connections & reinforcement (net of contributions)",{"$f":"'RRP 1.3'!D$12","v":-0.50000000000000178},{"$f":"'RRP 2.4'!L13+'RRP 2.4'!L14+'RRP 2.4'!L18+'RRP 2.4'!L19","v":4.7},{"$f":"'RRP 2.4'!L12+'RRP 2.4'!L17-'Calc - DNO Opex Allocation'!G6","v":3.8},0,{"$f":"'RRP 2.4'!L11+'RRP 2.4'!L16+'RRP 2.4'!L24","v":-9},{"$f":"D6-E6-F6-G6-H6","v":0},null,"MEAV",{"$f":"IF(ISERROR(VLOOKUP($K6,'Calc-Drivers'!$B$17:$F$27,L$42,FALSE)),\" \",VLOOKUP($K6,'Calc-Drivers'!$B$17:$F$27,L$42,FALSE))","v":0.22063382481052818},{"$f":"IF(ISERROR(VLOOKUP($K6,'Calc-Drivers'!$B$17:$F$27,M$42,FALSE)),\" \",VLOOKUP($K6,'Calc-Drivers'!$B$17:$F$27,M$42,FALSE))","v":0.27826178252589195},{"$f":"IF(ISERROR(VLOOKUP($K6,'Calc-Drivers'!$B$17:$F$27,N$42,FALSE)),\" \",VLOOKUP($K6,'Calc-Drivers'!$B$17:$F$27,N$42,FALSE))","v":6.8102560342398366E-2},{"$f":"IF(ISERROR(VLOOKUP($K6,'Calc-Drivers'!$B$17:$F$27,O$42,FALSE)),\" \",VLOOKUP($K6,'Calc-Drivers'!$B$17:$F$27,O$42,FALSE))","v":0.43300183232118161},null,null,{"$f":"IF(ISERROR($I6*L6),\" \",$I6*L6)","v":0},0,0,0,null,null,{"$f":"IF($K6=\"Do not allocate\",\" \",R6+E6)","v":4.7},{"$f":"IF($K6=\"Do not allocate\",\" \",S6+F6)","v":3.8},{"$f":"IF($K6=\"Do not allocate\",\" \",T6+G6)","v":0},{"$f":"IF($K6=\"Do not allocate\",\" \",U6+H6)","v":-9},null,null,{"$f":"IF(ISERROR(X6*100000000/'Calc-Units'!$E$21),\" \",X6*100000000/'Calc-Units'!$E$21)","v":3.7852360544718015E-2},{"$f":"IF(ISERROR(Y6*100000000/'Calc-Units'!$D$21),\" \",Y6*100000000/'Calc-Units'!$D$21)","v":3.9528082196430385E-2},{"$f":"IF(ISERROR(Z6*100000000/'Calc-Units'!$C$21),\" \",Z6*100000000/'Calc-Units'!$C$21)","v":0},{"$f":"IF(ISERROR(AA6*100000000/'Calc-Units'!$C$21),\" \",AA6*100000000/'Calc-Units'!$C$21)","v":-0.12471930889732255},null,1,{"$f":"AI6*D6","v":-0.50000000000000178},{"$f":"D6*(1-AI6)","v":0},null,null,{"$f":"IF(ISERROR(X6*(1-$AI6)),\" \",X6*(1-$AI6))","v":0},{"$f":"IF(ISERROR(Y6*(1-$AI6)),\" \",Y6*(1-$AI6))","v":0},{"$f":"IF(ISERROR(Z6*(1-$AI6)),\" \",Z6*(1-$AI6))","v":0},{"$f":"IF(ISERROR(AA6*(1-$AI6)),\" \",AA6*(1-$AI6))","v":0},null,null,{"$f":"IF(ISERROR(AN6*100000000/'Calc-Units'!$E$21),\" \",AN6*100000000/'Calc-Units'!$E$21)","v":0},{"$f":"IF(ISERROR(AO6*100000000/'Calc-Units'!$D$21),\" \",AO6*100000000/'Calc-Units'!$D$21)","v":0},{"$f":"IF(ISERROR(AP6*100000000/'Calc-Units'!$C$21),\" \",AP6*100000000/'Calc-Units'!$C$21)","v":0},{"$f":"IF(ISERROR(AQ6*100000000/'Calc-Units'!$C$21),\" \",AQ6*100000000/'Calc-Units'!$C$21)","v":0}]
[null,null,"Non-load new & replacement assets (net of contributions)",{"$f":"'RRP 1.3'!E$12","v":32.299999999999997},{"$f":"SUM('RRP 2.4'!G44:G55)+'RRP 2.4'!G71+'RRP 2.4'!H71","v":8.5},{"$f":"SUM('RRP 2.4'!G38:G40)+'RRP 2.4'!F71","v":14.299999999999999},{"$f":"'RRP 2.4'!G41+'RRP 2.4'!G42+'RRP 2.4'!G43","v":4.2},{"$f":"SUM('RRP 2.4'!G31:G37)+'RRP 2.4'!E71","v":5.1999999999999993},9.9999999999998757E-2,null,"MEAV",{"$f":"IF(ISERROR(VLOOKUP($K7,'Calc-Drivers'!$B$17:$F$27,L$42,FALSE)),\" \",VLOOKUP($K7,'Calc-Drivers'!$B$17:$F$27,L$42,FALSE))","v":0.22063382481052818},{"$f":"IF(ISERROR(VLOOKUP($K7,'Calc-Drivers'!$B$17:$F$27,M$42,FALSE)),\" \",VLOOKUP($K7,'Calc-Drivers'!$B$17:$F$27,M$42,FALSE))","v":0.27826178252589195},{"$f":"IF(ISERROR(VLOOKUP($K7,'Calc-Drivers'!$B$17:$F$27,N$42,FALSE)),\" \",VLOOKUP($K7,'Calc-Drivers'!$B$17:$F$27,N$42,FALSE))","v":6.8102560342398366E-2},{"$f":"IF(ISERROR(VLOOKUP($K7,'Calc-Drivers'!$B$17:$F$27,O$42,FALSE)),\" \",VLOOKUP($K7,'Calc-Drivers'!$B$17:$F$27,O$42,FALSE))","v":0.43300183232118161},null,null,2.2063382481052544E-2,2.7826178252588849E-2,6.8102560342397523E-3,4.3300183232117623E-2,null,null,8.5220633824810523,14.327826178252588,4.20681025603424,5.2433001832321171,null,null,{"$f":"IF(ISERROR(X7*100000000/'Calc-Units'!$E$21),\" \",X7*100000000/'Calc-Units'!$E$21)","v":6.863408845502382E-2},{"$f":"IF(ISERROR(Y7*100000000/'Calc-Units'!$D$21),\" \",Y7*100000000/'Calc-Units'!$D$21)","v":0.14903986601845667},{"$f":"IF(ISERROR(Z7*100000000/'Calc-Units'!$C$21),\" \",Z7*100000000/'Calc-Units'!$C$21)","v":5.8296718643862107E-2},{"$f":"IF(ISERROR(AA7*100000000/'Calc-Units'!$C$21),\" \",AA7*100000000/'Calc-Units'!$C$21)","v":7.2660086132657148E-2},null,1,32.299999999999997,0,null,null,{"$f":"IF(ISERROR(X7*(1-$AI7)),\" \",X7*(1-$AI7))","v":0},0,0,0,null,null,{"$f":"IF(ISERROR(AN7*100000000/'Calc-Units'!$E$21),\" \",AN7*100000000/'Calc-Units'!$E$21)","v":0},{"$f":"IF(ISERROR(AO7*100000000/'Calc-Units'!$D$21),\" \",AO7*100000000/'Calc-Units'!$D$21)","v":0},{"$f":"IF(ISERROR(AP7*100000000/'Calc-Units'!$C$21),\" \",AP7*100000000/'Calc-Units'!$C$21)","v":0},{"$f":"IF(ISERROR(AQ7*100000000/'Calc-Units'!$C$21),\" \",AQ7*100000000/'Calc-Units'!$C$21)","v":0}]
[null,null,"Non-operational capex",{"$f":"'RRP 1.3'!F$12","v":3},0,0,0,0,3,null,"MEAV",{"$f":"IF(ISERROR(VLOOKUP($K8,'Calc-Drivers'!$B$17:$F$27,L$42,FALSE)),\" \",VLOOKUP($K8,'Calc-Drivers'!$B$17:$F$27,L$42,FALSE))","v":0.22063382481052818},{"$f":"IF(ISERROR(VLOOKUP($K8,'Calc-Drivers'!$B$17:$F$27,M$42,FALSE)),\" \",VLOOKUP($K8,'Calc-Drivers'!$B$17:$F$27,M$42,FALSE))","v":0.27826178252589195},{"$f":"IF(ISERROR(VLOOKUP($K8,'Calc-Drivers'!$B$17:$F$27,N$42,FALSE)),\" \",VLOOKUP($K8,'Calc-Drivers'!$B$17:$F$27,N$42,FALSE))","v":6.8102560342398366E-2},{"$f":"IF(ISERROR(VLOOKUP($K8,'Calc-Drivers'!$B$17:$F$27,O$42,FALSE)),\" \",VLOOKUP($K8,'Calc-Drivers'!$B$17:$F$27,O$42,FALSE))","v":0.43300183232118161},null,null,0.66190147443158454,0.83478534757767586,0.2043076810271951,1.2990054969635447,null,null,0.66190147443158454,0.83478534757767586,0.2043076810271951,1.2990054969635447,null,null,{"$f":"IF(ISERROR(X8*100000000/'Calc-Units'!$E$21),\" \",X8*100000000/'Calc-Units'!$E$21)","v":5.3307517564393173E-3},{"$f":"IF(ISERROR(Y8*100000000/'Calc-Units'!$D$21),\" \",Y8*100000000/'Calc-Units'!$D$21)","v":8.6835431145858115E-3},{"$f":"IF(ISERROR(Z8*100000000/'Calc-Units'!$C$21),\" \",Z8*100000000/'Calc-Units'!$C$21)","v":2.8312347533473764E-3},{"$f":"IF(ISERROR(AA8*100000000/'Calc-Units'!$C$21),\" \",AA8*100000000/'Calc-Units'!$C$21)","v":1.8001229759457369E-2},null,0.23499999999999999,0.70499999999999996,2.2949999999999999,null,null,0.50635462794016217,0.63861079089692208,0.15629537598580426,0.99373920517711178,null,null,{"$f":"IF(ISERROR(AN8*100000000/'Calc-Units'!$E$21),\" \",AN8*100000000/'Calc-Units'!$E$21)","v":4.0780250936760781E-3},{"$f":"IF(ISERROR(AO8*100000000/'Calc-Units'!$D$21),\" \",AO8*100000000/'Calc-Units'!$D$21)","v":6.6429104826581454E-3},{"$f":"IF(ISERROR(AP8*100000000/'Calc-Units'!$C$21),\" \",AP8*100000000/'Calc-Units'!$C$21)","v":2.1658945863107433E-3},{"$f":"IF(ISERROR(AQ8*100000000/'Calc-Units'!$C$21),\" \",AQ8*100000000/'Calc-Units'!$C$21)","v":1.3770940765984887E-2}]
[null,null,"Faults",{"$f":"'RRP 1.3'!G$12","v":8.3000000000000007},{"$f":"SUM('RRP 2.3'!I20:I27)","v":0.60000000000000009},{"$f":"SUM('RRP 2.3'!I17:I18)","v":2.2999999999999998},{"$f":"SUM('RRP 2.3'!I19)","v":0.2},{"$f":"SUM('RRP 2.3'!I11:I16)","v":4.8999999999999995},0.3000000000000016,null,"MEAV",{"$f":"IF(ISERROR(VLOOKUP($K9,'Calc-Drivers'!$B$17:$F$27,L$42,FALSE)),\" \",VLOOKUP($K9,'Calc-Drivers'!$B$17:$F$27,L$42,FALSE))","v":0.22063382481052818},{"$f":"IF(ISERROR(VLOOKUP($K9,'Calc-Drivers'!$B$17:$F$27,M$42,FALSE)),\" \",VLOOKUP($K9,'Calc-Drivers'!$B$17:$F$27,M$42,FALSE))","v":0.27826178252589195},{"$f":"IF(ISERROR(VLOOKUP($K9,'Calc-Drivers'!$B$17:$F$27,N$42,FALSE)),\" \",VLOOKUP($K9,'Calc-Drivers'!$B$17:$F$27,N$42,FALSE))","v":6.8102560342398366E-2},{"$f":"IF(ISERROR(VLOOKUP($K9,'Calc-Drivers'!$B$17:$F$27,O$42,FALSE)),\" \",VLOOKUP($K9,'Calc-Drivers'!$B$17:$F$27,O$42,FALSE))","v":0.43300183232118161},null,null,6.6190147443158806E-2,8.3478534757768036E-2,2.0430768102719619E-2,0.12990054969635517,null,null,0.66619014744315885,2.3834785347577681,0.22043076810271964,5.0299005496963547,null,null,{"$f":"IF(ISERROR(X9*100000000/'Calc-Units'!$E$21),\" \",X9*100000000/'Calc-Units'!$E$21)","v":5.3652914153951708E-3},{"$f":"IF(ISERROR(Y9*100000000/'Calc-Units'!$D$21),\" \",Y9*100000000/'Calc-Units'!$D$21)","v":2.4793246167192765E-2},{"$f":"IF(ISERROR(Z9*100000000/'Calc-Units'!$C$21),\" \",Z9*100000000/'Calc-Units'!$C$21)","v":3.0546636730530183E-3},{"$f":"IF(ISERROR(AA9*100000000/'Calc-Units'!$C$21),\" \",AA9*100000000/'Calc-Units'!$C$21)","v":6.9702857820043568E-2},null,0.23499999999999999,1.9505000000000001,6.3495000000000008,null,null,0.5096354627940165,1.8233610790896926,0.16862953759858051,3.8478739205177113,null,null,{"$f":"IF(ISERROR(AN9*100000000/'Calc-Units'!$E$21),\" \",AN9*100000000/'Calc-Units'!$E$21)","v":4.1044479327773057E-3},{"$f":"IF(ISERROR(AO9*100000000/'Calc-Units'!$D$21),\" \",AO9*100000000/'Calc-Units'!$D$21)","v":1.8966833317902467E-2},{"$f":"IF(ISERROR(AP9*100000000/'Calc-Units'!$C$21),\" \",AP9*100000000/'Calc-Units'!$C$21)","v":2.3368177098855589E-3},{"$f":"IF(ISERROR(AQ9*100000000/'Calc-Units'!$C$21),\" \",AQ9*100000000/'Calc-Units'!$C$21)","v":5.3322686232333327E-2}]
[null,null,"Inspections, & Maintenance",{"$f":"'RRP 1.3'!H$12","v":5.5},{"$f":"SUM('RRP 2.3'!G20:G27)","v":2.3000000000000003},{"$f":"SUM('RRP 2.3'!G17:G18)","v":0.6},{"$f":"SUM('RRP 2.3'!G19)","v":1.6},{"$f":"SUM('RRP 2.3'!G11:G16)","v":0.70000000000000007},0.29999999999999949,null,"MEAV",{"$f":"IF(ISERROR(VLOOKUP($K10,'Calc-Drivers'!$B$17:$F$27,L$42,FALSE)),\" \",VLOOKUP($K10,'Calc-Drivers'!$B$17:$F$27,L$42,FALSE))","v":0.22063382481052818},{"$f":"IF(ISERROR(VLOOKUP($K10,'Calc-Drivers'!$B$17:$F$27,M$42,FALSE)),\" \",VLOOKUP($K10,'Calc-Drivers'!$B$17:$F$27,M$42,FALSE))","v":0.27826178252589195},{"$f":"IF(ISERROR(VLOOKUP($K10,'Calc-Drivers'!$B$17:$F$27,N$42,FALSE)),\" \",VLOOKUP($K10,'Calc-Drivers'!$B$17:$F$27,N$42,FALSE))","v":6.8102560342398366E-2},{"$f":"IF(ISERROR(VLOOKUP($K10,'Calc-Drivers'!$B$17:$F$27,O$42,FALSE)),\" \",VLOOKUP($K10,'Calc-Drivers'!$B$17:$F$27,O$42,FALSE))","v":0.43300183232118161},null,null,6.6190147443158334E-2,8.3478534757767439E-2,2.0430768102719474E-2,0.12990054969635426,null,null,2.3661901474431586,0.68347853475776743,1.6204307681027195,0.82990054969635429,null,null,{"$f":"IF(ISERROR(X10*100000000/'Calc-Units'!$E$21),\" \",X10*100000000/'Calc-Units'!$E$21)","v":1.9056570761357004E-2},{"$f":"IF(ISERROR(Y10*100000000/'Calc-Units'!$D$21),\" \",Y10*100000000/'Calc-Units'!$D$21)","v":7.1096304477370614E-3},{"$f":"IF(ISERROR(Z10*100000000/'Calc-Units'!$C$21),\" \",Z10*100000000/'Calc-Units'!$C$21)","v":2.2455445057080966E-2},{"$f":"IF(ISERROR(AA10*100000000/'Calc-Units'!$C$21),\" \",AA10*100000000/'Calc-Units'!$C$21)","v":1.1500513667959711E-2},null,0.23499999999999999,1.2925,4.2075000000000005,null,null,1.8101354627940163,0.52286107908969215,1.2396295375985804,0.63487392051771108,null,null,{"$f":"IF(ISERROR(AN10*100000000/'Calc-Units'!$E$21),\" \",AN10*100000000/'Calc-Units'!$E$21)","v":1.4578276632438106E-2},{"$f":"IF(ISERROR(AO10*100000000/'Calc-Units'!$D$21),\" \",AO10*100000000/'Calc-Units'!$D$21)","v":5.4388672925188529E-3},{"$f":"IF(ISERROR(AP10*100000000/'Calc-Units'!$C$21),\" \",AP10*100000000/'Calc-Units'!$C$21)","v":1.7178415468666941E-2},{"$f":"IF(ISERROR(AQ10*100000000/'Calc-Units'!$C$21),\" \",AQ10*100000000/'Calc-Units'!$C$21)","v":8.7978929559891783E-3}]
[null,null,"Tree Cutting",{"$f":"'RRP 1.3'!I$12","v":4.0999999999999996},{"$f":"'RRP 2.3'!G46+'RRP 2.3'!G47","v":0.6297770891609763},{"$f":"'RRP 2.3'!G45","v":2.3630693363750601},0,{"$f":"'RRP 2.3'!G44","v":1.1655181170566711},-5.8364542592707735E-2,null,"MEAV",{"$f":"IF(ISERROR(VLOOKUP($K11,'Calc-Drivers'!$B$17:$F$27,L$42,FALSE)),\" \",VLOOKUP($K11,'Calc-Drivers'!$B$17:$F$27,L$42,FALSE))","v":0.22063382481052818},{"$f":"IF(ISERROR(VLOOKUP($K11,'Calc-Drivers'!$B$17:$F$27,M$42,FALSE)),\" \",VLOOKUP($K11,'Calc-Drivers'!$B$17:$F$27,M$42,FALSE))","v":0.27826178252589195},{"$f":"IF(ISERROR(VLOOKUP($K11,'Calc-Drivers'!$B$17:$F$27,N$42,FALSE)),\" \",VLOOKUP($K11,'Calc-Drivers'!$B$17:$F$27,N$42,FALSE))","v":6.8102560342398366E-2},{"$f":"IF(ISERROR(VLOOKUP($K11,'Calc-Drivers'!$B$17:$F$27,O$42,FALSE)),\" \",VLOOKUP($K11,'Calc-Drivers'!$B$17:$F$27,O$42,FALSE))","v":0.43300183232118161},null,null,-1.2877192265546089E-2,-1.6240621658155197E-2,-3.9747747837763584E-3,-2.5271953885230097E-2,null,null,0.61689989689543023,2.3468287147169051,-3.9747747837763584E-3,1.1402461631714409,null,null,{"$f":"IF(ISERROR(X11*100000000/'Calc-Units'!$E$21),\" \",X11*100000000/'Calc-Units'!$E$21)","v":4.9683228334649349E-3},{"$f":"IF(ISERROR(Y11*100000000/'Calc-Units'!$D$21),\" \",Y11*100000000/'Calc-Units'!$D$21)","v":2.4412010088492867E-2},{"$f":"IF(ISERROR(Z11*100000000/'Calc-Units'!$C$21),\" \",Z11*100000000/'Calc-Units'!$C$21)","v":-5.5081240450565786E-5},{"$f":"IF(ISERROR(AA11*100000000/'Calc-Units'!$C$21),\" \",AA11*100000000/'Calc-Units'!$C$21)","v":1.5801190382618423E-2},null,0.23499999999999999,0.96349999999999991,3.1364999999999998,null,null,0.47192842112500416,1.7953239667584324,-3.0407027095889143E-3,0.87228831482615232,null,null,{"$f":"IF(ISERROR(AN11*100000000/'Calc-Units'!$E$21),\" \",AN11*100000000/'Calc-Units'!$E$21)","v":3.8007669676006755E-3},{"$f":"IF(ISERROR(AO11*100000000/'Calc-Units'!$D$21),\" \",AO11*100000000/'Calc-Units'!$D$21)","v":1.8675187717697043E-2},{"$f":"IF(ISERROR(AP11*100000000/'Calc-Units'!$C$21),\" \",AP11*100000000/'Calc-Units'!$C$21)","v":-4.2137148944682827E-5},{"$f":"IF(ISERROR(AQ11*100000000/'Calc-Units'!$C$21),\" \",AQ11*100000000/'Calc-Units'!$C$21)","v":1.2087910642703092E-2}]
[null,"Indirect activities - From RRP 2.2 Detailed Cost Matrix","Network Policy",{"$f":"'RRP 1.3'!J$12","v":0.6},0,0,0,0,0.6,null,"MEAV",{"$f":"IF(ISERROR(VLOOKUP($K12,'Calc-Drivers'!$B$17:$F$27,L$42,FALSE)),\" \",VLOOKUP($K12,'Calc-Drivers'!$B$17:$F$27,L$42,FALSE))","v":0.22063382481052818},{"$f":"IF(ISERROR(VLOOKUP($K12,'Calc-Drivers'!$B$17:$F$27,M$42,FALSE)),\" \",VLOOKUP($K12,'Calc-Drivers'!$B$17:$F$27,M$42,FALSE))","v":0.27826178252589195},{"$f":"IF(ISERROR(VLOOKUP($K12,'Calc-Drivers'!$B$17:$F$27,N$42,FALSE)),\" \",VLOOKUP($K12,'Calc-Drivers'!$B$17:$F$27,N$42,FALSE))","v":6.8102560342398366E-2},{"$f":"IF(ISERROR(VLOOKUP($K12,'Calc-Drivers'!$B$17:$F$27,O$42,FALSE)),\" \",VLOOKUP($K12,'Calc-Drivers'!$B$17:$F$27,O$42,FALSE))","v":0.43300183232118161},null,null,0.13238029488631689,0.16695706951553516,4.0861536205439017E-2,0.25980109939270896,null,null,0.13238029488631689,0.16695706951553516,4.0861536205439017E-2,0.25980109939270896,null,null,{"$f":"IF(ISERROR(X12*100000000/'Calc-Units'!$E$21),\" \",X12*100000000/'Calc-Units'!$E$21)","v":1.0661503512878632E-3},{"$f":"IF(ISERROR(Y12*100000000/'Calc-Units'!$D$21),\" \",Y12*100000000/'Calc-Units'!$D$21)","v":1.7367086229171621E-3},{"$f":"IF(ISERROR(Z12*100000000/'Calc-Units'!$C$21),\" \",Z12*100000000/'Calc-Units'!$C$21)","v":5.6624695066947528E-4},{"$f":"IF(ISERROR(AA12*100000000/'Calc-Units'!$C$21),\" \",AA12*100000000/'Calc-Units'!$C$21)","v":3.6002459518914738E-3},null,0.52569999999999995,0.31541999999999998,0.28458,null,null,6.2787973864580113E-2,7.918773807121833E-2,1.9380626622239727E-2,0.12322366144196187,null,null,{"$f":"IF(ISERROR(AN12*100000000/'Calc-Units'!$E$21),\" \",AN12*100000000/'Calc-Units'!$E$21)","v":5.0567511161583368E-4},{"$f":"IF(ISERROR(AO12*100000000/'Calc-Units'!$D$21),\" \",AO12*100000000/'Calc-Units'!$D$21)","v":8.2372089984960998E-4},{"$f":"IF(ISERROR(AP12*100000000/'Calc-Units'!$C$21),\" \",AP12*100000000/'Calc-Units'!$C$21)","v":2.6857092870253213E-4},{"$f":"IF(ISERROR(AQ12*100000000/'Calc-Units'!$C$21),\" \",AQ12*100000000/'Calc-Units'!$C$21)","v":1.7075966549821261E-3}]
[null,null,"Network Design & Engineering",{"$f":"'RRP 1.3'!K$12","v":3.5},0,0,0,0,3.5,null,"MEAV",{"$f":"IF(ISERROR(VLOOKUP($K13,'Calc-Drivers'!$B$17:$F$27,L$42,FALSE)),\" \",VLOOKUP($K13,'Calc-Drivers'!$B$17:$F$27,L$42,FALSE))","v":0.22063382481052818},{"$f":"IF(ISERROR(VLOOKUP($K13,'Calc-Drivers'!$B$17:$F$27,M$42,FALSE)),\" \",VLOOKUP($K13,'Calc-Drivers'!$B$17:$F$27,M$42,FALSE))","v":0.27826178252589195},{"$f":"IF(ISERROR(VLOOKUP($K13,'Calc-Drivers'!$B$17:$F$27,N$42,FALSE)),\" \",VLOOKUP($K13,'Calc-Drivers'!$B$17:$F$27,N$42,FALSE))","v":6.8102560342398366E-2},{"$f":"IF(ISERROR(VLOOKUP($K13,'Calc-Drivers'!$B$17:$F$27,O$42,FALSE)),\" \",VLOOKUP($K13,'Calc-Drivers'!$B$17:$F$27,O$42,FALSE))","v":0.43300183232118161},null,null,0.77221838683684862,0.97391623884062184,0.23835896119839428,1.5155064131241356,null,null,0.77221838683684862,0.97391623884062184,0.23835896119839428,1.5155064131241356,null,null,{"$f":"IF(ISERROR(X13*100000000/'Calc-Units'!$E$21),\" \",X13*100000000/'Calc-Units'!$E$21)","v":6.2192103825125357E-3},{"$f":"IF(ISERROR(Y13*100000000/'Calc-Units'!$D$21),\" \",Y13*100000000/'Calc-Units'!$D$21)","v":1.0130800300350113E-2},{"$f":"IF(ISERROR(Z13*100000000/'Calc-Units'!$C$21),\" \",Z13*100000000/'Calc-Units'!$C$21)","v":3.3031072122386065E-3},{"$f":"IF(ISERROR(AA13*100000000/'Calc-Units'!$C$21),\" \",AA13*100000000/'Calc-Units'!$C$21)","v":2.1001434719366933E-2},null,0.52569999999999995,1.8399499999999998,1.6600500000000002,null,null,0.36626318087671733,0.46192847208210697,0.11305365529639842,0.71880469174477757,null,null,{"$f":"IF(ISERROR(AN13*100000000/'Calc-Units'!$E$21),\" \",AN13*100000000/'Calc-Units'!$E$21)","v":2.9497714844256965E-3},{"$f":"IF(ISERROR(AO13*100000000/'Calc-Units'!$D$21),\" \",AO13*100000000/'Calc-Units'!$D$21)","v":4.8050385824560593E-3},{"$f":"IF(ISERROR(AP13*100000000/'Calc-Units'!$C$21),\" \",AP13*100000000/'Calc-Units'!$C$21)","v":1.5666637507647711E-3},{"$f":"IF(ISERROR(AQ13*100000000/'Calc-Units'!$C$21),\" \",AQ13*100000000/'Calc-Units'!$C$21)","v":9.9609804873957361E-3}]
[null,null,"Project Management",{"$f":"'RRP 1.3'!L$12","v":2.9},0,0,0,0,2.9,null,"MEAV",{"$f":"IF(ISERROR(VLOOKUP($K14,'Calc-Drivers'!$B$17:$F$27,L$42,FALSE)),\" \",VLOOKUP($K14,'Calc-Drivers'!$B$17:$F$27,L$42,FALSE))","v":0.22063382481052818},{"$f":"IF(ISERROR(VLOOKUP($K14,'Calc-Drivers'!$B$17:$F$27,M$42,FALSE)),\" \",VLOOKUP($K14,'Calc-Drivers'!$B$17:$F$27,M$42,FALSE))","v":0.27826178252589195},{"$f":"IF(ISERROR(VLOOKUP($K14,'Calc-Drivers'!$B$17:$F$27,N$42,FALSE)),\" \",VLOOKUP($K14,'Calc-Drivers'!$B$17:$F$27,N$42,FALSE))","v":6.8102560342398366E-2},{"$f":"IF(ISERROR(VLOOKUP($K14,'Calc-Drivers'!$B$17:$F$27,O$42,FALSE)),\" \",VLOOKUP($K14,'Calc-Drivers'!$B$17:$F$27,O$42,FALSE))","v":0.43300183232118161},null,null,0.63983809195053165,0.8069591693250866,0.19749742499295525,1.2557053137314267,null,null,0.63983809195053165,0.8069591693250866,0.19749742499295525,1.2557053137314267,null,null,{"$f":"IF(ISERROR(X14*100000000/'Calc-Units'!$E$21),\" \",X14*100000000/'Calc-Units'!$E$21)","v":5.1530600312246723E-3},{"$f":"IF(ISERROR(Y14*100000000/'Calc-Units'!$D$21),\" \",Y14*100000000/'Calc-Units'!$D$21)","v":8.3940916774329494E-3},{"$f":"IF(ISERROR(Z14*100000000/'Calc-Units'!$C$21),\" \",Z14*100000000/'Calc-Units'!$C$21)","v":2.7368602615691308E-3},{"$f":"IF(ISERROR(AA14*100000000/'Calc-Units'!$C$21),\" \",AA14*100000000/'Calc-Units'!$C$21)","v":1.740118876747546E-2},null,0.52569999999999995,1.5245299999999997,1.3754700000000002,null,null,0.3034752070121372,0.38274073401088859,9.3673028674158693E-2,0.59558103030281573,null,null,{"$f":"IF(ISERROR(AN14*100000000/'Calc-Units'!$E$21),\" \",AN14*100000000/'Calc-Units'!$E$21)","v":2.4440963728098626E-3},{"$f":"IF(ISERROR(AO14*100000000/'Calc-Units'!$D$21),\" \",AO14*100000000/'Calc-Units'!$D$21)","v":3.9813176826064478E-3},{"$f":"IF(ISERROR(AP14*100000000/'Calc-Units'!$C$21),\" \",AP14*100000000/'Calc-Units'!$C$21)","v":1.2980928220622388E-3},{"$f":"IF(ISERROR(AQ14*100000000/'Calc-Units'!$C$21),\" \",AQ14*100000000/'Calc-Units'!$C$21)","v":8.2533838324136098E-3}]
[null,null,"Engineering Mgt & Clerical Support",{"$f":"'RRP 1.3'!M$12","v":7.2},0,0,0,0,7.2,null,"MEAV",{"$f":"IF(ISERROR(VLOOKUP($K15,'Calc-Drivers'!$B$17:$F$27,L$42,FALSE)),\" \",VLOOKUP($K15,'Calc-Drivers'!$B$17:$F$27,L$42,FALSE))","v":0.22063382481052818},{"$f":"IF(ISERROR(VLOOKUP($K15,'Calc-Drivers'!$B$17:$F$27,M$42,FALSE)),\" \",VLOOKUP($K15,'Calc-Drivers'!$B$17:$F$27,M$42,FALSE))","v":0.27826178252589195},{"$f":"IF(ISERROR(VLOOKUP($K15,'Calc-Drivers'!$B$17:$F$27,N$42,FALSE)),\" \",VLOOKUP($K15,'Calc-Drivers'!$B$17:$F$27,N$42,FALSE))","v":6.8102560342398366E-2},{"$f":"IF(ISERROR(VLOOKUP($K15,'Calc-Drivers'!$B$17:$F$27,O$42,FALSE)),\" \",VLOOKUP($K15,'Calc-Drivers'!$B$17:$F$27,O$42,FALSE))","v":0.43300183232118161},null,null,1.588563538635803,2.003484834186422,0.49033843446526826,3.1176131927125077,null,null,1.588563538635803,2.003484834186422,0.49033843446526826,3.1176131927125077,null,null,{"$f":"IF(ISERROR(X15*100000000/'Calc-Units'!$E$21),\" \",X15*100000000/'Calc-Units'!$E$21)","v":1.2793804215454363E-2},{"$f":"IF(ISERROR(Y15*100000000/'Calc-Units'!$D$21),\" \",Y15*100000000/'Calc-Units'!$D$21)","v":2.0840503475005944E-2},{"$f":"IF(ISERROR(Z15*100000000/'Calc-Units'!$C$21),\" \",Z15*100000000/'Calc-Units'!$C$21)","v":6.7949634080337043E-3},{"$f":"IF(ISERROR(AA15*100000000/'Calc-Units'!$C$21),\" \",AA15*100000000/'Calc-Units'!$C$21)","v":4.3202951422697693E-2},null,0.52569999999999995,3.7850399999999995,3.4149600000000007,null,null,0.75345568637496141,0.95025285685462002,0.23256751946687676,1.4786839373035425,null,null,{"$f":"IF(ISERROR(AN15*100000000/'Calc-Units'!$E$21),\" \",AN15*100000000/'Calc-Units'!$E$21)","v":6.0681013393900042E-3},{"$f":"IF(ISERROR(AO15*100000000/'Calc-Units'!$D$21),\" \",AO15*100000000/'Calc-Units'!$D$21)","v":9.8846507981953206E-3},{"$f":"IF(ISERROR(AP15*100000000/'Calc-Units'!$C$21),\" \",AP15*100000000/'Calc-Units'!$C$21)","v":3.2228511444303862E-3},{"$f":"IF(ISERROR(AQ15*100000000/'Calc-Units'!$C$21),\" \",AQ15*100000000/'Calc-Units'!$C$21)","v":2.0491159859785515E-2}]
[null,null,"Control Centre",{"$f":"'RRP 1.3'!N$12","v":1.9},0,0,0,0,1.9,null,"MEAV",{"$f":"IF(ISERROR(VLOOKUP($K16,'Calc-Drivers'!$B$17:$F$27,L$42,FALSE)),\" \",VLOOKUP($K16,'Calc-Drivers'!$B$17:$F$27,L$42,FALSE))","v":0.22063382481052818},{"$f":"IF(ISERROR(VLOOKUP($K16,'Calc-Drivers'!$B$17:$F$27,M$42,FALSE)),\" \",VLOOKUP($K16,'Calc-Drivers'!$B$17:$F$27,M$42,FALSE))","v":0.27826178252589195},{"$f":"IF(ISERROR(VLOOKUP($K16,'Calc-Drivers'!$B$17:$F$27,N$42,FALSE)),\" \",VLOOKUP($K16,'Calc-Drivers'!$B$17:$F$27,N$42,FALSE))","v":6.8102560342398366E-2},{"$f":"IF(ISERROR(VLOOKUP($K16,'Calc-Drivers'!$B$17:$F$27,O$42,FALSE)),\" \",VLOOKUP($K16,'Calc-Drivers'!$B$17:$F$27,O$42,FALSE))","v":0.43300183232118161},null,null,0.41920426714000353,0.52869738679919465,0.12939486465055688,0.82270348141024507,null,null,0.41920426714000353,0.52869738679919465,0.12939486465055688,0.82270348141024507,null,null,{"$f":"IF(ISERROR(X16*100000000/'Calc-Units'!$E$21),\" \",X16*100000000/'Calc-Units'!$E$21)","v":3.3761427790782337E-3},{"$f":"IF(ISERROR(Y16*100000000/'Calc-Units'!$D$21),\" \",Y16*100000000/'Calc-Units'!$D$21)","v":5.4995773059043464E-3},{"$f":"IF(ISERROR(Z16*100000000/'Calc-Units'!$C$21),\" \",Z16*100000000/'Calc-Units'!$C$21)","v":1.7931153437866719E-3},{"$f":"IF(ISERROR(AA16*100000000/'Calc-Units'!$C$21),\" \",AA16*100000000/'Calc-Units'!$C$21)","v":1.1400778847656334E-2},null,0.52569999999999995,0.99882999999999988,0.90117000000000003,null,null,0.1988285839045037,0.25076117055885805,6.137198430375914E-2,0.39020826123287927,null,null,{"$f":"IF(ISERROR(AN16*100000000/'Calc-Units'!$E$21),\" \",AN16*100000000/'Calc-Units'!$E$21)","v":1.6013045201168066E-3},{"$f":"IF(ISERROR(AO16*100000000/'Calc-Units'!$D$21),\" \",AO16*100000000/'Calc-Units'!$D$21)","v":2.6084495161904316E-3},{"$f":"IF(ISERROR(AP16*100000000/'Calc-Units'!$C$21),\" \",AP16*100000000/'Calc-Units'!$C$21)","v":8.5047460755801859E-4},{"$f":"IF(ISERROR(AQ16*100000000/'Calc-Units'!$C$21),\" \",AQ16*100000000/'Calc-Units'!$C$21)","v":5.4073894074433996E-3}]
[null,null,"System Mapping - Cartographical",{"$f":"'RRP 1.3'!O$12","v":1},0,0,0,0,1,null,"MEAV",{"$f":"IF(ISERROR(VLOOKUP($K17,'Calc-Drivers'!$B$17:$F$27,L$42,FALSE)),\" \",VLOOKUP($K17,'Calc-Drivers'!$B$17:$F$27,L$42,FALSE))","v":0.22063382481052818},{"$f":"IF(ISERROR(VLOOKUP($K17,'Calc-Drivers'!$B$17:$F$27,M$42,FALSE)),\" \",VLOOKUP($K17,'Calc-Drivers'!$B$17:$F$27,M$42,FALSE))","v":0.27826178252589195},{"$f":"IF(ISERROR(VLOOKUP($K17,'Calc-Drivers'!$B$17:$F$27,N$42,FALSE)),\" \",VLOOKUP($K17,'Calc-Drivers'!$B$17:$F$27,N$42,FALSE))","v":6.8102560342398366E-2},{"$f":"IF(ISERROR(VLOOKUP($K17,'Calc-Drivers'!$B$17:$F$27,O$42,FALSE)),\" \",VLOOKUP($K17,'Calc-Drivers'!$B$17:$F$27,O$42,FALSE))","v":0.43300183232118161},null,null,0.22063382481052818,0.27826178252589195,6.8102560342398366E-2,0.43300183232118161,null,null,0.22063382481052818,0.27826178252589195,6.8102560342398366E-2,0.43300183232118161,null,null,{"$f":"IF(ISERROR(X17*100000000/'Calc-Units'!$E$21),\" \",X17*100000000/'Calc-Units'!$E$21)","v":1.7769172521464392E-3},{"$f":"IF(ISERROR(Y17*100000000/'Calc-Units'!$D$21),\" \",Y17*100000000/'Calc-Units'!$D$21)","v":2.8945143715286038E-3},{"$f":"IF(ISERROR(Z17*100000000/'Calc-Units'!$C$21),\" \",Z17*100000000/'Calc-Units'!$C$21)","v":9.4374491778245891E-4},{"$f":"IF(ISERROR(AA17*100000000/'Calc-Units'!$C$21),\" \",AA17*100000000/'Calc-Units'!$C$21)","v":6.0004099198191236E-3},null,0.52569999999999995,0.52569999999999995,0.47430000000000005,null,null,0.10464662310763352,0.13197956345203057,3.2301044370399545E-2,0.20537276906993646,null,null,{"$f":"IF(ISERROR(AN17*100000000/'Calc-Units'!$E$21),\" \",AN17*100000000/'Calc-Units'!$E$21)","v":8.4279185269305599E-4},{"$f":"IF(ISERROR(AO17*100000000/'Calc-Units'!$D$21),\" \",AO17*100000000/'Calc-Units'!$D$21)","v":1.3728681664160168E-3},{"$f":"IF(ISERROR(AP17*100000000/'Calc-Units'!$C$21),\" \",AP17*100000000/'Calc-Units'!$C$21)","v":4.4761821450422026E-4},{"$f":"IF(ISERROR(AQ17*100000000/'Calc-Units'!$C$21),\" \",AQ17*100000000/'Calc-Units'!$C$21)","v":2.8459944249702106E-3}]
[null,null,"Customer Call Centre",{"$f":"'RRP 1.3'!P$12","v":0.7},0,0,0,0,0.7,null,"MEAV",{"$f":"IF(ISERROR(VLOOKUP($K18,'Calc-Drivers'!$B$17:$F$27,L$42,FALSE)),\" \",VLOOKUP($K18,'Calc-Drivers'!$B$17:$F$27,L$42,FALSE))","v":0.22063382481052818},{"$f":"IF(ISERROR(VLOOKUP($K18,'Calc-Drivers'!$B$17:$F$27,M$42,FALSE)),\" \",VLOOKUP($K18,'Calc-Drivers'!$B$17:$F$27,M$42,FALSE))","v":0.27826178252589195},{"$f":"IF(ISERROR(VLOOKUP($K18,'Calc-Drivers'!$B$17:$F$27,N$42,FALSE)),\" \",VLOOKUP($K18,'Calc-Drivers'!$B$17:$F$27,N$42,FALSE))","v":6.8102560342398366E-2},{"$f":"IF(ISERROR(VLOOKUP($K18,'Calc-Drivers'!$B$17:$F$27,O$42,FALSE)),\" \",VLOOKUP($K18,'Calc-Drivers'!$B$17:$F$27,O$42,FALSE))","v":0.43300183232118161},null,null,0.15444367736736972,0.19478324776812436,4.7671792239678851E-2,0.30310128262482711,null,null,0.15444367736736972,0.19478324776812436,4.7671792239678851E-2,0.30310128262482711,null,null,{"$f":"IF(ISERROR(X18*100000000/'Calc-Units'!$E$21),\" \",X18*100000000/'Calc-Units'!$E$21)","v":1.2438420765025072E-3},{"$f":"IF(ISERROR(Y18*100000000/'Calc-Units'!$D$21),\" \",Y18*100000000/'Calc-Units'!$D$21)","v":2.0261600600700227E-3},{"$f":"IF(ISERROR(Z18*100000000/'Calc-Units'!$C$21),\" \",Z18*100000000/'Calc-Units'!$C$21)","v":6.6062144244772106E-4},{"$f":"IF(ISERROR(AA18*100000000/'Calc-Units'!$C$21),\" \",AA18*100000000/'Calc-Units'!$C$21)","v":4.2002869438733858E-3},null,0.52569999999999995,0.36798999999999993,0.33201000000000003,null,null,7.3252636175343472E-2,9.2385694416421402E-2,2.261073105927968E-2,0.14376093834895551,null,null,{"$f":"IF(ISERROR(AN18*100000000/'Calc-Units'!$E$21),\" \",AN18*100000000/'Calc-Units'!$E$21)","v":5.8995429688513926E-4},{"$f":"IF(ISERROR(AO18*100000000/'Calc-Units'!$D$21),\" \",AO18*100000000/'Calc-Units'!$D$21)","v":9.610077164912119E-4},{"$f":"IF(ISERROR(AP18*100000000/'Calc-Units'!$C$21),\" \",AP18*100000000/'Calc-Units'!$C$21)","v":3.1333275015295417E-4},{"$f":"IF(ISERROR(AQ18*100000000/'Calc-Units'!$C$21),\" \",AQ18*100000000/'Calc-Units'!$C$21)","v":1.992196097479147E-3}]
[null,null,"Stores",{"$f":"'RRP 1.3'!Q$12","v":0.9},0,0,0,0,0.9,null,"MEAV",{"$f":"IF(ISERROR(VLOOKUP($K19,'Calc-Drivers'!$B$17:$F$27,L$42,FALSE)),\" \",VLOOKUP($K19,'Calc-Drivers'!$B$17:$F$27,L$42,FALSE))","v":0.22063382481052818},{"$f":"IF(ISERROR(VLOOKUP($K19,'Calc-Drivers'!$B$17:$F$27,M$42,FALSE)),\" \",VLOOKUP($K19,'Calc-Drivers'!$B$17:$F$27,M$42,FALSE))","v":0.27826178252589195},{"$f":"IF(ISERROR(VLOOKUP($K19,'Calc-Drivers'!$B$17:$F$27,N$42,FALSE)),\" \",VLOOKUP($K19,'Calc-Drivers'!$B$17:$F$27,N$42,FALSE))","v":6.8102560342398366E-2},{"$f":"IF(ISERROR(VLOOKUP($K19,'Calc-Drivers'!$B$17:$F$27,O$42,FALSE)),\" \",VLOOKUP($K19,'Calc-Drivers'!$B$17:$F$27,O$42,FALSE))","v":0.43300183232118161},null,null,0.19857044232947538,0.25043560427330275,6.1292304308158532E-2,0.38970164908906346,null,null,0.19857044232947538,0.25043560427330275,6.1292304308158532E-2,0.38970164908906346,null,null,{"$f":"IF(ISERROR(X19*100000000/'Calc-Units'!$E$21),\" \",X19*100000000/'Calc-Units'!$E$21)","v":1.5992255269317954E-3},{"$f":"IF(ISERROR(Y19*100000000/'Calc-Units'!$D$21),\" \",Y19*100000000/'Calc-Units'!$D$21)","v":2.605062934375743E-3},{"$f":"IF(ISERROR(Z19*100000000/'Calc-Units'!$C$21),\" \",Z19*100000000/'Calc-Units'!$C$21)","v":8.4937042600421303E-4},{"$f":"IF(ISERROR(AA19*100000000/'Calc-Units'!$C$21),\" \",AA19*100000000/'Calc-Units'!$C$21)","v":5.4003689278372116E-3},null,0.52569999999999995,0.47312999999999994,0.42687000000000008,null,null,9.4181960796870176E-2,0.1187816071068275,2.9070939933359595E-2,0.18483549216294282,null,null,{"$f":"IF(ISERROR(AN19*100000000/'Calc-Units'!$E$21),\" \",AN19*100000000/'Calc-Units'!$E$21)","v":7.5851266742375052E-4},{"$f":"IF(ISERROR(AO19*100000000/'Calc-Units'!$D$21),\" \",AO19*100000000/'Calc-Units'!$D$21)","v":1.2355813497744151E-3},{"$f":"IF(ISERROR(AP19*100000000/'Calc-Units'!$C$21),\" \",AP19*100000000/'Calc-Units'!$C$21)","v":4.0285639305379827E-4},{"$f":"IF(ISERROR(AQ19*100000000/'Calc-Units'!$C$21),\" \",AQ19*100000000/'Calc-Units'!$C$21)","v":2.5613949824731894E-3}]
[null,null,"Vehicles & Transport",{"$f":"'RRP 1.3'!R$12","v":2.7},0,0,0,0,2.7,null,"MEAV",{"$f":"IF(ISERROR(VLOOKUP($K20,'Calc-Drivers'!$B$17:$F$27,L$42,FALSE)),\" \",VLOOKUP($K20,'Calc-Drivers'!$B$17:$F$27,L$42,FALSE))","v":0.22063382481052818},{"$f":"IF(ISERROR(VLOOKUP($K20,'Calc-Drivers'!$B$17:$F$27,M$42,FALSE)),\" \",VLOOKUP($K20,'Calc-Drivers'!$B$17:$F$27,M$42,FALSE))","v":0.27826178252589195},{"$f":"IF(ISERROR(VLOOKUP($K20,'Calc-Drivers'!$B$17:$F$27,N$42,FALSE)),\" \",VLOOKUP($K20,'Calc-Drivers'!$B$17:$F$27,N$42,FALSE))","v":6.8102560342398366E-2},{"$f":"IF(ISERROR(VLOOKUP($K20,'Calc-Drivers'!$B$17:$F$27,O$42,FALSE)),\" \",VLOOKUP($K20,'Calc-Drivers'!$B$17:$F$27,O$42,FALSE))","v":0.43300183232118161},null,null,0.5957113269884261,0.7513068128199083,0.18387691292447561,1.1691049472671904,null,null,0.5957113269884261,0.7513068128199083,0.18387691292447561,1.1691049472671904,null,null,{"$f":"IF(ISERROR(X20*100000000/'Calc-Units'!$E$21),\" \",X20*100000000/'Calc-Units'!$E$21)","v":4.7976765807953847E-3},{"$f":"IF(ISERROR(Y20*100000000/'Calc-Units'!$D$21),\" \",Y20*100000000/'Calc-Units'!$D$21)","v":7.8151888031272286E-3},{"$f":"IF(ISERROR(Z20*100000000/'Calc-Units'!$C$21),\" \",Z20*100000000/'Calc-Units'!$C$21)","v":2.548111278012639E-3},{"$f":"IF(ISERROR(AA20*100000000/'Calc-Units'!$C$21),\" \",AA20*100000000/'Calc-Units'!$C$21)","v":1.6201106783511634E-2},null,0.52569999999999995,1.4193899999999999,1.2806100000000002,null,null,0.28254588239061051,0.35634482132048256,8.7212819800078792E-2,0.55450647648882845,null,null,{"$f":"IF(ISERROR(AN20*100000000/'Calc-Units'!$E$21),\" \",AN20*100000000/'Calc-Units'!$E$21)","v":2.2755380022712515E-3},{"$f":"IF(ISERROR(AO20*100000000/'Calc-Units'!$D$21),\" \",AO20*100000000/'Calc-Units'!$D$21)","v":3.7067440493232457E-3},{"$f":"IF(ISERROR(AP20*100000000/'Calc-Units'!$C$21),\" \",AP20*100000000/'Calc-Units'!$C$21)","v":1.208569179161395E-3},{"$f":"IF(ISERROR(AQ20*100000000/'Calc-Units'!$C$21),\" \",AQ20*100000000/'Calc-Units'!$C$21)","v":7.6841849474195683E-3}]
[null,null,"IT & Telecoms",{"$f":"'RRP 1.3'!S$12","v":6.8},0,0,0,0,6.8,null,"Do not allocate",{"$f":"IF(ISERROR(VLOOKUP($K21,'Calc-Drivers'!$B$17:$F$27,L$42,FALSE)),\" \",VLOOKUP($K21,'Calc-Drivers'!$B$17:$F$27,L$42,FALSE))","v":" "},{"$f":"IF(ISERROR(VLOOKUP($K21,'Calc-Drivers'!$B$17:$F$27,M$42,FALSE)),\" \",VLOOKUP($K21,'Calc-Drivers'!$B$17:$F$27,M$42,FALSE))","v":" "},{"$f":"IF(ISERROR(VLOOKUP($K21,'Calc-Drivers'!$B$17:$F$27,N$42,FALSE)),\" \",VLOOKUP($K21,'Calc-Drivers'!$B$17:$F$27,N$42,FALSE))","v":" "},{"$f":"IF(ISERROR(VLOOKUP($K21,'Calc-Drivers'!$B$17:$F$27,O$42,FALSE)),\" \",VLOOKUP($K21,'Calc-Drivers'!$B$17:$F$27,O$42,FALSE))","v":" "},null,null," "," "," "," ",null,null," "," "," "," ",null,null,{"$f":"IF(ISERROR(X21*100000000/'Calc-Units'!$E$21),\" \",X21*100000000/'Calc-Units'!$E$21)","v":" "},{"$f":"IF(ISERROR(Y21*100000000/'Calc-Units'!$D$21),\" \",Y21*100000000/'Calc-Units'!$D$21)","v":" "},{"$f":"IF(ISERROR(Z21*100000000/'Calc-Units'!$C$21),\" \",Z21*100000000/'Calc-Units'!$C$21)","v":" "},{"$f":"IF(ISERROR(AA21*100000000/'Calc-Units'!$C$21),\" \",AA21*100000000/'Calc-Units'!$C$21)","v":" "},null,0.52569999999999995,3.5747599999999995,3.2252400000000003,null,null," "," "," "," ",null,null,{"$f":"IF(ISERROR(AN21*100000000/'Calc-Units'!$E$21),\" \",AN21*100000000/'Calc-Units'!$E$21)","v":" "},{"$f":"IF(ISERROR(AO21*100000000/'Calc-Units'!$D$21),\" \",AO21*100000000/'Calc-Units'!$D$21)","v":" "},{"$f":"IF(ISERROR(AP21*100000000/'Calc-Units'!$C$21),\" \",AP21*100000000/'Calc-Units'!$C$21)","v":" "},{"$f":"IF(ISERROR(AQ21*100000000/'Calc-Units'!$C$21),\" \",AQ21*100000000/'Calc-Units'!$C$21)","v":" "}]
[null,null,"Property Mgt",{"$f":"'RRP 1.3'!T$12","v":2.1},0,0,0,0,2.1,null,"Do not allocate",{"$f":"IF(ISERROR(VLOOKUP($K22,'Calc-Drivers'!$B$17:$F$27,L$42,FALSE)),\" \",VLOOKUP($K22,'Calc-Drivers'!$B$17:$F$27,L$42,FALSE))","v":" "},{"$f":"IF(ISERROR(VLOOKUP($K22,'Calc-Drivers'!$B$17:$F$27,M$42,FALSE)),\" \",VLOOKUP($K22,'Calc-Drivers'!$B$17:$F$27,M$42,FALSE))","v":" "},{"$f":"IF(ISERROR(VLOOKUP($K22,'Calc-Drivers'!$B$17:$F$27,N$42,FALSE)),\" \",VLOOKUP($K22,'Calc-Drivers'!$B$17:$F$27,N$42,FALSE))","v":" "},{"$f":"IF(ISERROR(VLOOKUP($K22,'Calc-Drivers'!$B$17:$F$27,O$42,FALSE)),\" \",VLOOKUP($K22,'Calc-Drivers'!$B$17:$F$27,O$42,FALSE))","v":" "},null,null," "," "," "," ",null,null," "," "," "," ",null,null,{"$f":"IF(ISERROR(X22*100000000/'Calc-Units'!$E$21),\" \",X22*100000000/'Calc-Units'!$E$21)","v":" "},{"$f":"IF(ISERROR(Y22*100000000/'Calc-Units'!$D$21),\" \",Y22*100000000/'Calc-Units'!$D$21)","v":" "},{"$f":"IF(ISERROR(Z22*100000000/'Calc-Units'!$C$21),\" \",Z22*100000000/'Calc-Units'!$C$21)","v":" "},{"$f":"IF(ISERROR(AA22*100000000/'Calc-Units'!$C$21),\" \",AA22*100000000/'Calc-Units'!$C$21)","v":" "},null,0.52569999999999995,1.1039699999999999,0.99603000000000019,null,null," "," "," "," ",null,null,{"$f":"IF(ISERROR(AN22*100000000/'Calc-Units'!$E$21),\" \",AN22*100000000/'Calc-Units'!$E$21)","v":" "},{"$f":"IF(ISERROR(AO22*100000000/'Calc-Units'!$D$21),\" \",AO22*100000000/'Calc-Units'!$D$21)","v":" "},{"$f":"IF(ISERROR(AP22*100000000/'Calc-Units'!$C$21),\" \",AP22*100000000/'Calc-Units'!$C$21)","v":" "},{"$f":"IF(ISERROR(AQ22*100000000/'Calc-Units'!$C$21),\" \",AQ22*100000000/'Calc-Units'!$C$21)","v":" "}]
[null,null,"HR & Non-operational Training",{"$f":"'RRP 1.3'!U$12","v":0.9},0,0,0,0,0.9,null,"MEAV",{"$f":"IF(ISERROR(VLOOKUP($K23,'Calc-Drivers'!$B$17:$F$27,L$42,FALSE)),\" \",VLOOKUP($K23,'Calc-Drivers'!$B$17:$F$27,L$42,FALSE))","v":0.22063382481052818},{"$f":"IF(ISERROR(VLOOKUP($K23,'Calc-Drivers'!$B$17:$F$27,M$42,FALSE)),\" \",VLOOKUP($K23,'Calc-Drivers'!$B$17:$F$27,M$42,FALSE))","v":0.27826178252589195},{"$f":"IF(ISERROR(VLOOKUP($K23,'Calc-Drivers'!$B$17:$F$27,N$42,FALSE)),\" \",VLOOKUP($K23,'Calc-Drivers'!$B$17:$F$27,N$42,FALSE))","v":6.8102560342398366E-2},{"$f":"IF(ISERROR(VLOOKUP($K23,'Calc-Drivers'!$B$17:$F$27,O$42,FALSE)),\" \",VLOOKUP($K23,'Calc-Drivers'!$B$17:$F$27,O$42,FALSE))","v":0.43300183232118161},null,null,0.19857044232947538,0.25043560427330275,6.1292304308158532E-2,0.38970164908906346,null,null,0.19857044232947538,0.25043560427330275,6.1292304308158532E-2,0.38970164908906346,null,null,{"$f":"IF(ISERROR(X23*100000000/'Calc-Units'!$E$21),\" \",X23*100000000/'Calc-Units'!$E$21)","v":1.5992255269317954E-3},{"$f":"IF(ISERROR(Y23*100000000/'Calc-Units'!$D$21),\" \",Y23*100000000/'Calc-Units'!$D$21)","v":2.605062934375743E-3},{"$f":"IF(ISERROR(Z23*100000000/'Calc-Units'!$C$21),\" \",Z23*100000000/'Calc-Units'!$C$21)","v":8.4937042600421303E-4},{"$f":"IF(ISERROR(AA23*100000000/'Calc-Units'!$C$21),\" \",AA23*100000000/'Calc-Units'!$C$21)","v":5.4003689278372116E-3},null,0.52569999999999995,0.47312999999999994,0.42687000000000008,null,null,9.4181960796870176E-2,0.1187816071068275,2.9070939933359595E-2,0.18483549216294282,null,null,{"$f":"IF(ISERROR(AN23*100000000/'Calc-Units'!$E$21),\" \",AN23*100000000/'Calc-Units'!$E$21)","v":7.5851266742375052E-4},{"$f":"IF(ISERROR(AO23*100000000/'Calc-Units'!$D$21),\" \",AO23*100000000/'Calc-Units'!$D$21)","v":1.2355813497744151E-3},{"$f":"IF(ISERROR(AP23*100000000/'Calc-Units'!$C$21),\" \",AP23*100000000/'Calc-Units'!$C$21)","v":4.0285639305379827E-4},{"$f":"IF(ISERROR(AQ23*100000000/'Calc-Units'!$C$21),\" \",AQ23*100000000/'Calc-Units'!$C$21)","v":2.5613949824731894E-3}]
[null,null,"Health & Safety & Operational Training",{"$f":"'RRP 1.3'!V$12","v":1.1000000000000001},0,0,0,0,1.1000000000000001,null,"MEAV",{"$f":"IF(ISERROR(VLOOKUP($K24,'Calc-Drivers'!$B$17:$F$27,L$42,FALSE)),\" \",VLOOKUP($K24,'Calc-Drivers'!$B$17:$F$27,L$42,FALSE))","v":0.22063382481052818},{"$f":"IF(ISERROR(VLOOKUP($K24,'Calc-Drivers'!$B$17:$F$27,M$42,FALSE)),\" \",VLOOKUP($K24,'Calc-Drivers'!$B$17:$F$27,M$42,FALSE))","v":0.27826178252589195},{"$f":"IF(ISERROR(VLOOKUP($K24,'Calc-Drivers'!$B$17:$F$27,N$42,FALSE)),\" \",VLOOKUP($K24,'Calc-Drivers'!$B$17:$F$27,N$42,FALSE))","v":6.8102560342398366E-2},{"$f":"IF(ISERROR(VLOOKUP($K24,'Calc-Drivers'!$B$17:$F$27,O$42,FALSE)),\" \",VLOOKUP($K24,'Calc-Drivers'!$B$17:$F$27,O$42,FALSE))","v":0.43300183232118161},null,null,0.24269720729158101,0.30608796077848116,7.4912816376638214E-2,0.47630201555329982,null,null,0.24269720729158101,0.30608796077848116,7.4912816376638214E-2,0.47630201555329982,null,null,{"$f":"IF(ISERROR(X24*100000000/'Calc-Units'!$E$21),\" \",X24*100000000/'Calc-Units'!$E$21)","v":1.9546089773610827E-3},{"$f":"IF(ISERROR(Y24*100000000/'Calc-Units'!$D$21),\" \",Y24*100000000/'Calc-Units'!$D$21)","v":3.1839658086814642E-3},{"$f":"IF(ISERROR(Z24*100000000/'Calc-Units'!$C$21),\" \",Z24*100000000/'Calc-Units'!$C$21)","v":1.0381194095607049E-3},{"$f":"IF(ISERROR(AA24*100000000/'Calc-Units'!$C$21),\" \",AA24*100000000/'Calc-Units'!$C$21)","v":6.6004509118010356E-3},null,0.52569999999999995,0.57826999999999995,0.52173000000000014,null,null,0.11511128541839688,0.14517751979723365,3.553114880743951E-2,0.22591004597693012,null,null,{"$f":"IF(ISERROR(AN24*100000000/'Calc-Units'!$E$21),\" \",AN24*100000000/'Calc-Units'!$E$21)","v":9.2707103796236168E-4},{"$f":"IF(ISERROR(AO24*100000000/'Calc-Units'!$D$21),\" \",AO24*100000000/'Calc-Units'!$D$21)","v":1.5101549830576187E-3},{"$f":"IF(ISERROR(AP24*100000000/'Calc-Units'!$C$21),\" \",AP24*100000000/'Calc-Units'!$C$21)","v":4.9238003595464242E-4},{"$f":"IF(ISERROR(AQ24*100000000/'Calc-Units'!$C$21),\" \",AQ24*100000000/'Calc-Units'!$C$21)","v":3.1305938674672318E-3}]
[null,null,"Finance & Regulation",{"$f":"'RRP 1.3'!W$12","v":5.8},0,0,0,0,5.8,null,"MEAV",{"$f":"IF(ISERROR(VLOOKUP($K25,'Calc-Drivers'!$B$17:$F$27,L$42,FALSE)),\" \",VLOOKUP($K25,'Calc-Drivers'!$B$17:$F$27,L$42,FALSE))","v":0.22063382481052818},{"$f":"IF(ISERROR(VLOOKUP($K25,'Calc-Drivers'!$B$17:$F$27,M$42,FALSE)),\" \",VLOOKUP($K25,'Calc-Drivers'!$B$17:$F$27,M$42,FALSE))","v":0.27826178252589195},{"$f":"IF(ISERROR(VLOOKUP($K25,'Calc-Drivers'!$B$17:$F$27,N$42,FALSE)),\" \",VLOOKUP($K25,'Calc-Drivers'!$B$17:$F$27,N$42,FALSE))","v":6.8102560342398366E-2},{"$f":"IF(ISERROR(VLOOKUP($K25,'Calc-Drivers'!$B$17:$F$27,O$42,FALSE)),\" \",VLOOKUP($K25,'Calc-Drivers'!$B$17:$F$27,O$42,FALSE))","v":0.43300183232118161},null,null,1.2796761839010633,1.6139183386501732,0.3949948499859105,2.5114106274628534,null,null,1.2796761839010633,1.6139183386501732,0.3949948499859105,2.5114106274628534,null,null,{"$f":"IF(ISERROR(X25*100000000/'Calc-Units'!$E$21),\" \",X25*100000000/'Calc-Units'!$E$21)","v":1.0306120062449345E-2},{"$f":"IF(ISERROR(Y25*100000000/'Calc-Units'!$D$21),\" \",Y25*100000000/'Calc-Units'!$D$21)","v":1.6788183354865899E-2},{"$f":"IF(ISERROR(Z25*100000000/'Calc-Units'!$C$21),\" \",Z25*100000000/'Calc-Units'!$C$21)","v":5.4737205231382615E-3},{"$f":"IF(ISERROR(AA25*100000000/'Calc-Units'!$C$21),\" \",AA25*100000000/'Calc-Units'!$C$21)","v":3.4802377534950919E-2},null,0.52569999999999995,3.0490599999999994,2.7509400000000004,null,null,0.60695041402427441,0.76548146802177719,0.18734605734831739,1.1911620606056315,null,null,{"$f":"IF(ISERROR(AN25*100000000/'Calc-Units'!$E$21),\" \",AN25*100000000/'Calc-Units'!$E$21)","v":4.8881927456197252E-3},{"$f":"IF(ISERROR(AO25*100000000/'Calc-Units'!$D$21),\" \",AO25*100000000/'Calc-Units'!$D$21)","v":7.9626353652128955E-3},{"$f":"IF(ISERROR(AP25*100000000/'Calc-Units'!$C$21),\" \",AP25*100000000/'Calc-Units'!$C$21)","v":2.5961856441244777E-3},{"$f":"IF(ISERROR(AQ25*100000000/'Calc-Units'!$C$21),\" \",AQ25*100000000/'Calc-Units'!$C$21)","v":1.650676766482722E-2}]
[null,null,"CEO etc",{"$f":"'RRP 1.3'!X$12","v":1.8},0,0,0,0,1.8,null,"MEAV",{"$f":"IF(ISERROR(VLOOKUP($K26,'Calc-Drivers'!$B$17:$F$27,L$42,FALSE)),\" \",VLOOKUP($K26,'Calc-Drivers'!$B$17:$F$27,L$42,FALSE))","v":0.22063382481052818},{"$f":"IF(ISERROR(VLOOKUP($K26,'Calc-Drivers'!$B$17:$F$27,M$42,FALSE)),\" \",VLOOKUP($K26,'Calc-Drivers'!$B$17:$F$27,M$42,FALSE))","v":0.27826178252589195},{"$f":"IF(ISERROR(VLOOKUP($K26,'Calc-Drivers'!$B$17:$F$27,N$42,FALSE)),\" \",VLOOKUP($K26,'Calc-Drivers'!$B$17:$F$27,N$42,FALSE))","v":6.8102560342398366E-2},{"$f":"IF(ISERROR(VLOOKUP($K26,'Calc-Drivers'!$B$17:$F$27,O$42,FALSE)),\" \",VLOOKUP($K26,'Calc-Drivers'!$B$17:$F$27,O$42,FALSE))","v":0.43300183232118161},null,null,0.39714088465895075,0.5008712085466055,0.12258460861631706,0.77940329817812692,null,null,0.39714088465895075,0.5008712085466055,0.12258460861631706,0.77940329817812692,null,null,{"$f":"IF(ISERROR(X26*100000000/'Calc-Units'!$E$21),\" \",X26*100000000/'Calc-Units'!$E$21)","v":3.1984510538635908E-3},{"$f":"IF(ISERROR(Y26*100000000/'Calc-Units'!$D$21),\" \",Y26*100000000/'Calc-Units'!$D$21)","v":5.210125868751486E-3},{"$f":"IF(ISERROR(Z26*100000000/'Calc-Units'!$C$21),\" \",Z26*100000000/'Calc-Units'!$C$21)","v":1.6987408520084261E-3},{"$f":"IF(ISERROR(AA26*100000000/'Calc-Units'!$C$21),\" \",AA26*100000000/'Calc-Units'!$C$21)","v":1.0800737855674423E-2},null,0.52569999999999995,0.94625999999999988,0.85374000000000017,null,null,0.18836392159374035,0.23756321421365501,5.814187986671919E-2,0.36967098432588563,null,null,{"$f":"IF(ISERROR(AN26*100000000/'Calc-Units'!$E$21),\" \",AN26*100000000/'Calc-Units'!$E$21)","v":1.517025334847501E-3},{"$f":"IF(ISERROR(AO26*100000000/'Calc-Units'!$D$21),\" \",AO26*100000000/'Calc-Units'!$D$21)","v":2.4711626995488302E-3},{"$f":"IF(ISERROR(AP26*100000000/'Calc-Units'!$C$21),\" \",AP26*100000000/'Calc-Units'!$C$21)","v":8.0571278610759654E-4},{"$f":"IF(ISERROR(AQ26*100000000/'Calc-Units'!$C$21),\" \",AQ26*100000000/'Calc-Units'!$C$21)","v":5.1227899649463789E-3}]
["Other Costs from full activitty cost allocation",null,"Atypical cash costs",{"$f":"'RRP 1.3'!Y$12","v":4.3},0,0,0,0,4.3,null,"Do not allocate",{"$f":"IF(ISERROR(VLOOKUP($K27,'Calc-Drivers'!$B$17:$F$27,L$42,FALSE)),\" \",VLOOKUP($K27,'Calc-Drivers'!$B$17:$F$27,L$42,FALSE))","v":" "},{"$f":"IF(ISERROR(VLOOKUP($K27,'Calc-Drivers'!$B$17:$F$27,M$42,FALSE)),\" \",VLOOKUP($K27,'Calc-Drivers'!$B$17:$F$27,M$42,FALSE))","v":" "},{"$f":"IF(ISERROR(VLOOKUP($K27,'Calc-Drivers'!$B$17:$F$27,N$42,FALSE)),\" \",VLOOKUP($K27,'Calc-Drivers'!$B$17:$F$27,N$42,FALSE))","v":" "},{"$f":"IF(ISERROR(VLOOKUP($K27,'Calc-Drivers'!$B$17:$F$27,O$42,FALSE)),\" \",VLOOKUP($K27,'Calc-Drivers'!$B$17:$F$27,O$42,FALSE))","v":" "},null,null," "," "," "," ",null,null," "," "," "," ",null,null,{"$f":"IF(ISERROR(X27*100000000/'Calc-Units'!$E$21),\" \",X27*100000000/'Calc-Units'!$E$21)","v":" "},{"$f":"IF(ISERROR(Y27*100000000/'Calc-Units'!$D$21),\" \",Y27*100000000/'Calc-Units'!$D$21)","v":" "},{"$f":"IF(ISERROR(Z27*100000000/'Calc-Units'!$C$21),\" \",Z27*100000000/'Calc-Units'!$C$21)","v":" "},{"$f":"IF(ISERROR(AA27*100000000/'Calc-Units'!$C$21),\" \",AA27*100000000/'Calc-Units'!$C$21)","v":" "},null,0,0,4.3,null,null," "," "," "," ",null,null,{"$f":"IF(ISERROR(AN27*100000000/'Calc-Units'!$E$21),\" \",AN27*100000000/'Calc-Units'!$E$21)","v":" "},{"$f":"IF(ISERROR(AO27*100000000/'Calc-Units'!$D$21),\" \",AO27*100000000/'Calc-Units'!$D$21)","v":" "},{"$f":"IF(ISERROR(AP27*100000000/'Calc-Units'!$C$21),\" \",AP27*100000000/'Calc-Units'!$C$21)","v":" "},{"$f":"IF(ISERROR(AQ27*100000000/'Calc-Units'!$C$21),\" \",AQ27*100000000/'Calc-Units'!$C$21)","v":" "}]
[null,null,"Pension deficit payments",{"$f":"'RRP 1.3'!Z$12","v":13.4},0,0,0,0,13.4,null,"Do not allocate",{"$f":"IF(ISERROR(VLOOKUP($K28,'Calc-Drivers'!$B$17:$F$27,L$42,FALSE)),\" \",VLOOKUP($K28,'Calc-Drivers'!$B$17:$F$27,L$42,FALSE))","v":" "},{"$f":"IF(ISERROR(VLOOKUP($K28,'Calc-Drivers'!$B$17:$F$27,M$42,FALSE)),\" \",VLOOKUP($K28,'Calc-Drivers'!$B$17:$F$27,M$42,FALSE))","v":" "},{"$f":"IF(ISERROR(VLOOKUP($K28,'Calc-Drivers'!$B$17:$F$27,N$42,FALSE)),\" \",VLOOKUP($K28,'Calc-Drivers'!$B$17:$F$27,N$42,FALSE))","v":" "},{"$f":"IF(ISERROR(VLOOKUP($K28,'Calc-Drivers'!$B$17:$F$27,O$42,FALSE)),\" \",VLOOKUP($K28,'Calc-Drivers'!$B$17:$F$27,O$42,FALSE))","v":" "},null,null," "," "," "," ",null,null," "," "," "," ",null,null,{"$f":"IF(ISERROR(X28*100000000/'Calc-Units'!$E$21),\" \",X28*100000000/'Calc-Units'!$E$21)","v":" "},{"$f":"IF(ISERROR(Y28*100000000/'Calc-Units'!$D$21),\" \",Y28*100000000/'Calc-Units'!$D$21)","v":" "},{"$f":"IF(ISERROR(Z28*100000000/'Calc-Units'!$C$21),\" \",Z28*100000000/'Calc-Units'!$C$21)","v":" "},{"$f":"IF(ISERROR(AA28*100000000/'Calc-Units'!$C$21),\" \",AA28*100000000/'Calc-Units'!$C$21)","v":" "},null,0.57699999999999996,7.7317999999999998,5.6682000000000006,null,null," "," "," "," ",null,null,{"$f":"IF(ISERROR(AN28*100000000/'Calc-Units'!$E$21),\" \",AN28*100000000/'Calc-Units'!$E$21)","v":" "},{"$f":"IF(ISERROR(AO28*100000000/'Calc-Units'!$D$21),\" \",AO28*100000000/'Calc-Units'!$D$21)","v":" "},{"$f":"IF(ISERROR(AP28*100000000/'Calc-Units'!$C$21),\" \",AP28*100000000/'Calc-Units'!$C$21)","v":" "},{"$f":"IF(ISERROR(AQ28*100000000/'Calc-Units'!$C$21),\" \",AQ28*100000000/'Calc-Units'!$C$21)","v":" "}]
[null,null,"Metering",{"$f":"'RRP 1.3'!AA$12","v":1.8},0,0,0,0,1.8,null,"Do not allocate",{"$f":"IF(ISERROR(VLOOKUP($K29,'Calc-Drivers'!$B$17:$F$27,L$42,FALSE)),\" \",VLOOKUP($K29,'Calc-Drivers'!$B$17:$F$27,L$42,FALSE))","v":" "},{"$f":"IF(ISERROR(VLOOKUP($K29,'Calc-Drivers'!$B$17:$F$27,M$42,FALSE)),\" \",VLOOKUP($K29,'Calc-Drivers'!$B$17:$F$27,M$42,FALSE))","v":" "},{"$f":"IF(ISERROR(VLOOKUP($K29,'Calc-Drivers'!$B$17:$F$27,N$42,FALSE)),\" \",VLOOKUP($K29,'Calc-Drivers'!$B$17:$F$27,N$42,FALSE))","v":" "},{"$f":"IF(ISERROR(VLOOKUP($K29,'Calc-Drivers'!$B$17:$F$27,O$42,FALSE)),\" \",VLOOKUP($K29,'Calc-Drivers'!$B$17:$F$27,O$42,FALSE))","v":" "},null,null," "," "," "," ",null,null," "," "," "," ",null,null,{"$f":"IF(ISERROR(X29*100000000/'Calc-Units'!$E$21),\" \",X29*100000000/'Calc-Units'!$E$21)","v":" "},{"$f":"IF(ISERROR(Y29*100000000/'Calc-Units'!$D$21),\" \",Y29*100000000/'Calc-Units'!$D$21)","v":" "},{"$f":"IF(ISERROR(Z29*100000000/'Calc-Units'!$C$21),\" \",Z29*100000000/'Calc-Units'!$C$21)","v":" "},{"$f":"IF(ISERROR(AA29*100000000/'Calc-Units'!$C$21),\" \",AA29*100000000/'Calc-Units'!$C$21)","v":" "},null,0,0,1.8,null,null," "," "," "," ",null,null,{"$f":"IF(ISERROR(AN29*100000000/'Calc-Units'!$E$21),\" \",AN29*100000000/'Calc-Units'!$E$21)","v":" "},{"$f":"IF(ISERROR(AO29*100000000/'Calc-Units'!$D$21),\" \",AO29*100000000/'Calc-Units'!$D$21)","v":" "},{"$f":"IF(ISERROR(AP29*100000000/'Calc-Units'!$C$21),\" \",AP29*100000000/'Calc-Units'!$C$21)","v":" "},{"$f":"IF(ISERROR(AQ29*100000000/'Calc-Units'!$C$21),\" \",AQ29*100000000/'Calc-Units'!$C$21)","v":" "}]
[null,null,"Excluded services & de minimis",{"$f":"'RRP 1.3'!AB$12","v":8.9},0,0,0,0,8.9,null,"Do not allocate",{"$f":"IF(ISERROR(VLOOKUP($K30,'Calc-Drivers'!$B$17:$F$27,L$42,FALSE)),\" \",VLOOKUP($K30,'Calc-Drivers'!$B$17:$F$27,L$42,FALSE))","v":" "},{"$f":"IF(ISERROR(VLOOKUP($K30,'Calc-Drivers'!$B$17:$F$27,M$42,FALSE)),\" \",VLOOKUP($K30,'Calc-Drivers'!$B$17:$F$27,M$42,FALSE))","v":" "},{"$f":"IF(ISERROR(VLOOKUP($K30,'Calc-Drivers'!$B$17:$F$27,N$42,FALSE)),\" \",VLOOKUP($K30,'Calc-Drivers'!$B$17:$F$27,N$42,FALSE))","v":" "},{"$f":"IF(ISERROR(VLOOKUP($K30,'Calc-Drivers'!$B$17:$F$27,O$42,FALSE)),\" \",VLOOKUP($K30,'Calc-Drivers'!$B$17:$F$27,O$42,FALSE))","v":" "},null,null," "," "," "," ",null,null," "," "," "," ",null,null,{"$f":"IF(ISERROR(X30*100000000/'Calc-Units'!$E$21),\" \",X30*100000000/'Calc-Units'!$E$21)","v":" "},{"$f":"IF(ISERROR(Y30*100000000/'Calc-Units'!$D$21),\" \",Y30*100000000/'Calc-Units'!$D$21)","v":" "},{"$f":"IF(ISERROR(Z30*100000000/'Calc-Units'!$C$21),\" \",Z30*100000000/'Calc-Units'!$C$21)","v":" "},{"$f":"IF(ISERROR(AA30*100000000/'Calc-Units'!$C$21),\" \",AA30*100000000/'Calc-Units'!$C$21)","v":" "},null,0,0,8.9,null,null," "," "," "," ",null,null,{"$f":"IF(ISERROR(AN30*100000000/'Calc-Units'!$E$21),\" \",AN30*100000000/'Calc-Units'!$E$21)","v":" "},{"$f":"IF(ISERROR(AO30*100000000/'Calc-Units'!$D$21),\" \",AO30*100000000/'Calc-Units'!$D$21)","v":" "},{"$f":"IF(ISERROR(AP30*100000000/'Calc-Units'!$C$21),\" \",AP30*100000000/'Calc-Units'!$C$21)","v":" "},{"$f":"IF(ISERROR(AQ30*100000000/'Calc-Units'!$C$21),\" \",AQ30*100000000/'Calc-Units'!$C$21)","v":" "}]
[null,null,"Relevant distributed generation (less contributions)",{"$f":"'RRP 1.3'!AC$12","v":-0.1},0,0,0,0,-0.1,null,"Do not allocate",{"$f":"IF(ISERROR(VLOOKUP($K31,'Calc-Drivers'!$B$17:$F$27,L$42,FALSE)),\" \",VLOOKUP($K31,'Calc-Drivers'!$B$17:$F$27,L$42,FALSE))","v":" "},{"$f":"IF(ISERROR(VLOOKUP($K31,'Calc-Drivers'!$B$17:$F$27,M$42,FALSE)),\" \",VLOOKUP($K31,'Calc-Drivers'!$B$17:$F$27,M$42,FALSE))","v":" "},{"$f":"IF(ISERROR(VLOOKUP($K31,'Calc-Drivers'!$B$17:$F$27,N$42,FALSE)),\" \",VLOOKUP($K31,'Calc-Drivers'!$B$17:$F$27,N$42,FALSE))","v":" "},{"$f":"IF(ISERROR(VLOOKUP($K31,'Calc-Drivers'!$B$17:$F$27,O$42,FALSE)),\" \",VLOOKUP($K31,'Calc-Drivers'!$B$17:$F$27,O$42,FALSE))","v":" "},null,null," "," "," "," ",null,null," "," "," "," ",null,null,{"$f":"IF(ISERROR(X31*100000000/'Calc-Units'!$E$21),\" \",X31*100000000/'Calc-Units'!$E$21)","v":" "},{"$f":"IF(ISERROR(Y31*100000000/'Calc-Units'!$D$21),\" \",Y31*100000000/'Calc-Units'!$D$21)","v":" "},{"$f":"IF(ISERROR(Z31*100000000/'Calc-Units'!$C$21),\" \",Z31*100000000/'Calc-Units'!$C$21)","v":" "},{"$f":"IF(ISERROR(AA31*100000000/'Calc-Units'!$C$21),\" \",AA31*100000000/'Calc-Units'!$C$21)","v":" "},null,0,0,-0.1,null,null," "," "," "," ",null,null,{"$f":"IF(ISERROR(AN31*100000000/'Calc-Units'!$E$21),\" \",AN31*100000000/'Calc-Units'!$E$21)","v":" "},{"$f":"IF(ISERROR(AO31*100000000/'Calc-Units'!$D$21),\" \",AO31*100000000/'Calc-Units'!$D$21)","v":" "},{"$f":"IF(ISERROR(AP31*100000000/'Calc-Units'!$C$21),\" \",AP31*100000000/'Calc-Units'!$C$21)","v":" "},{"$f":"IF(ISERROR(AQ31*100000000/'Calc-Units'!$C$21),\" \",AQ31*100000000/'Calc-Units'!$C$21)","v":" "}]
[null,null,"IFI",{"$f":"'RRP 1.3'!AD$12","v":0.1},0,0,0,0,0.1,null,"Do not allocate",{"$f":"IF(ISERROR(VLOOKUP($K32,'Calc-Drivers'!$B$17:$F$27,L$42,FALSE)),\" \",VLOOKUP($K32,'Calc-Drivers'!$B$17:$F$27,L$42,FALSE))","v":" "},{"$f":"IF(ISERROR(VLOOKUP($K32,'Calc-Drivers'!$B$17:$F$27,M$42,FALSE)),\" \",VLOOKUP($K32,'Calc-Drivers'!$B$17:$F$27,M$42,FALSE))","v":" "},{"$f":"IF(ISERROR(VLOOKUP($K32,'Calc-Drivers'!$B$17:$F$27,N$42,FALSE)),\" \",VLOOKUP($K32,'Calc-Drivers'!$B$17:$F$27,N$42,FALSE))","v":" "},{"$f":"IF(ISERROR(VLOOKUP($K32,'Calc-Drivers'!$B$17:$F$27,O$42,FALSE)),\" \",VLOOKUP($K32,'Calc-Drivers'!$B$17:$F$27,O$42,FALSE))","v":" "},null,null," "," "," "," ",null,null," "," "," "," ",null,null,{"$f":"IF(ISERROR(X32*100000000/'Calc-Units'!$E$21),\" \",X32*100000000/'Calc-Units'!$E$21)","v":" "},{"$f":"IF(ISERROR(Y32*100000000/'Calc-Units'!$D$21),\" \",Y32*100000000/'Calc-Units'!$D$21)","v":" "},{"$f":"IF(ISERROR(Z32*100000000/'Calc-Units'!$C$21),\" \",Z32*100000000/'Calc-Units'!$C$21)","v":" "},{"$f":"IF(ISERROR(AA32*100000000/'Calc-Units'!$C$21),\" \",AA32*100000000/'Calc-Units'!$C$21)","v":" "},null,0,0,0.1,null,null," "," "," "," ",null,null,{"$f":"IF(ISERROR(AN32*100000000/'Calc-Units'!$E$21),\" \",AN32*100000000/'Calc-Units'!$E$21)","v":" "},{"$f":"IF(ISERROR(AO32*100000000/'Calc-Units'!$D$21),\" \",AO32*100000000/'Calc-Units'!$D$21)","v":" "},{"$f":"IF(ISERROR(AP32*100000000/'Calc-Units'!$C$21),\" \",AP32*100000000/'Calc-Units'!$C$21)","v":" "},{"$f":"IF(ISERROR(AQ32*100000000/'Calc-Units'!$C$21),\" \",AQ32*100000000/'Calc-Units'!$C$21)","v":" "}]
[null,null,"Disallowed Related Party Margins",{"$f":"'RRP 1.3'!AE$12","v":-2.7755575615628914E-17},0,0,0,0,-2.7755575615628914E-17,null,"Do not allocate",{"$f":"IF(ISERROR(VLOOKUP($K33,'Calc-Drivers'!$B$17:$F$27,L$42,FALSE)),\" \",VLOOKUP($K33,'Calc-Drivers'!$B$17:$F$27,L$42,FALSE))","v":" "},{"$f":"IF(ISERROR(VLOOKUP($K33,'Calc-Drivers'!$B$17:$F$27,M$42,FALSE)),\" \",VLOOKUP($K33,'Calc-Drivers'!$B$17:$F$27,M$42,FALSE))","v":" "},{"$f":"IF(ISERROR(VLOOKUP($K33,'Calc-Drivers'!$B$17:$F$27,N$42,FALSE)),\" \",VLOOKUP($K33,'Calc-Drivers'!$B$17:$F$27,N$42,FALSE))","v":" "},{"$f":"IF(ISERROR(VLOOKUP($K33,'Calc-Drivers'!$B$17:$F$27,O$42,FALSE)),\" \",VLOOKUP($K33,'Calc-Drivers'!$B$17:$F$27,O$42,FALSE))","v":" "},null,null," "," "," "," ",null,null," "," "," "," ",null,null,{"$f":"IF(ISERROR(X33*100000000/'Calc-Units'!$E$21),\" \",X33*100000000/'Calc-Units'!$E$21)","v":" "},{"$f":"IF(ISERROR(Y33*100000000/'Calc-Units'!$D$21),\" \",Y33*100000000/'Calc-Units'!$D$21)","v":" "},{"$f":"IF(ISERROR(Z33*100000000/'Calc-Units'!$C$21),\" \",Z33*100000000/'Calc-Units'!$C$21)","v":" "},{"$f":"IF(ISERROR(AA33*100000000/'Calc-Units'!$C$21),\" \",AA33*100000000/'Calc-Units'!$C$21)","v":" "},null,0,0,-2.7755575615628914E-17,null,null," "," "," "," ",null,null,{"$f":"IF(ISERROR(AN33*100000000/'Calc-Units'!$E$21),\" \",AN33*100000000/'Calc-Units'!$E$21)","v":" "},{"$f":"IF(ISERROR(AO33*100000000/'Calc-Units'!$D$21),\" \",AO33*100000000/'Calc-Units'!$D$21)","v":" "},{"$f":"IF(ISERROR(AP33*100000000/'Calc-Units'!$C$21),\" \",AP33*100000000/'Calc-Units'!$C$21)","v":" "},{"$f":"IF(ISERROR(AQ33*100000000/'Calc-Units'!$C$21),\" \",AQ33*100000000/'Calc-Units'!$C$21)","v":" "}]
[null,null,"Statutory Depreciation",{"$f":"'RRP 1.3'!AF$12","v":25.3},0,0,0,0,25.3,null,"Do not allocate",{"$f":"IF(ISERROR(VLOOKUP($K34,'Calc-Drivers'!$B$17:$F$27,L$42,FALSE)),\" \",VLOOKUP($K34,'Calc-Drivers'!$B$17:$F$27,L$42,FALSE))","v":" "},{"$f":"IF(ISERROR(VLOOKUP($K34,'Calc-Drivers'!$B$17:$F$27,M$42,FALSE)),\" \",VLOOKUP($K34,'Calc-Drivers'!$B$17:$F$27,M$42,FALSE))","v":" "},{"$f":"IF(ISERROR(VLOOKUP($K34,'Calc-Drivers'!$B$17:$F$27,N$42,FALSE)),\" \",VLOOKUP($K34,'Calc-Drivers'!$B$17:$F$27,N$42,FALSE))","v":" "},{"$f":"IF(ISERROR(VLOOKUP($K34,'Calc-Drivers'!$B$17:$F$27,O$42,FALSE)),\" \",VLOOKUP($K34,'Calc-Drivers'!$B$17:$F$27,O$42,FALSE))","v":" "},null,null," "," "," "," ",null,null," "," "," "," ",null,null,{"$f":"IF(ISERROR(X34*100000000/'Calc-Units'!$E$21),\" \",X34*100000000/'Calc-Units'!$E$21)","v":" "},{"$f":"IF(ISERROR(Y34*100000000/'Calc-Units'!$D$21),\" \",Y34*100000000/'Calc-Units'!$D$21)","v":" "},{"$f":"IF(ISERROR(Z34*100000000/'Calc-Units'!$C$21),\" \",Z34*100000000/'Calc-Units'!$C$21)","v":" "},{"$f":"IF(ISERROR(AA34*100000000/'Calc-Units'!$C$21),\" \",AA34*100000000/'Calc-Units'!$C$21)","v":" "},null,0,0,25.3,null,null," "," "," "," ",null,null,{"$f":"IF(ISERROR(AN34*100000000/'Calc-Units'!$E$21),\" \",AN34*100000000/'Calc-Units'!$E$21)","v":" "},{"$f":"IF(ISERROR(AO34*100000000/'Calc-Units'!$D$21),\" \",AO34*100000000/'Calc-Units'!$D$21)","v":" "},{"$f":"IF(ISERROR(AP34*100000000/'Calc-Units'!$C$21),\" \",AP34*100000000/'Calc-Units'!$C$21)","v":" "},{"$f":"IF(ISERROR(AQ34*100000000/'Calc-Units'!$C$21),\" \",AQ34*100000000/'Calc-Units'!$C$21)","v":" "}]
[null,null,"Network Rates",{"$f":"'RRP 1.3'!AG$12","v":15.1},0,0,0,0,15.1,null,"Do not allocate",{"$f":"IF(ISERROR(VLOOKUP($K35,'Calc-Drivers'!$B$17:$F$27,L$42,FALSE)),\" \",VLOOKUP($K35,'Calc-Drivers'!$B$17:$F$27,L$42,FALSE))","v":" "},{"$f":"IF(ISERROR(VLOOKUP($K35,'Calc-Drivers'!$B$17:$F$27,M$42,FALSE)),\" \",VLOOKUP($K35,'Calc-Drivers'!$B$17:$F$27,M$42,FALSE))","v":" "},{"$f":"IF(ISERROR(VLOOKUP($K35,'Calc-Drivers'!$B$17:$F$27,N$42,FALSE)),\" \",VLOOKUP($K35,'Calc-Drivers'!$B$17:$F$27,N$42,FALSE))","v":" "},{"$f":"IF(ISERROR(VLOOKUP($K35,'Calc-Drivers'!$B$17:$F$27,O$42,FALSE)),\" \",VLOOKUP($K35,'Calc-Drivers'!$B$17:$F$27,O$42,FALSE))","v":" "},null,null," "," "," "," ",null,null," "," "," "," ",null,null,{"$f":"IF(ISERROR(X35*100000000/'Calc-Units'!$E$21),\" \",X35*100000000/'Calc-Units'!$E$21)","v":" "},{"$f":"IF(ISERROR(Y35*100000000/'Calc-Units'!$D$21),\" \",Y35*100000000/'Calc-Units'!$D$21)","v":" "},{"$f":"IF(ISERROR(Z35*100000000/'Calc-Units'!$C$21),\" \",Z35*100000000/'Calc-Units'!$C$21)","v":" "},{"$f":"IF(ISERROR(AA35*100000000/'Calc-Units'!$C$21),\" \",AA35*100000000/'Calc-Units'!$C$21)","v":" "},null,0,0,15.1,null,null," "," "," "," ",null,null,{"$f":"IF(ISERROR(AN35*100000000/'Calc-Units'!$E$21),\" \",AN35*100000000/'Calc-Units'!$E$21)","v":" "},{"$f":"IF(ISERROR(AO35*100000000/'Calc-Units'!$D$21),\" \",AO35*100000000/'Calc-Units'!$D$21)","v":" "},{"$f":"IF(ISERROR(AP35*100000000/'Calc-Units'!$C$21),\" \",AP35*100000000/'Calc-Units'!$C$21)","v":" "},{"$f":"IF(ISERROR(AQ35*100000000/'Calc-Units'!$C$21),\" \",AQ35*100000000/'Calc-Units'!$C$21)","v":" "}]
[null,null,"Transmission Exit Charges",{"$f":"'RRP 1.3'!AH$12","v":4.2},0,0,0,0,4.2,null,"Do not allocate",{"$f":"IF(ISERROR(VLOOKUP($K36,'Calc-Drivers'!$B$17:$F$27,L$42,FALSE)),\" \",VLOOKUP($K36,'Calc-Drivers'!$B$17:$F$27,L$42,FALSE))","v":" "},{"$f":"IF(ISERROR(VLOOKUP($K36,'Calc-Drivers'!$B$17:$F$27,M$42,FALSE)),\" \",VLOOKUP($K36,'Calc-Drivers'!$B$17:$F$27,M$42,FALSE))","v":" "},{"$f":"IF(ISERROR(VLOOKUP($K36,'Calc-Drivers'!$B$17:$F$27,N$42,FALSE)),\" \",VLOOKUP($K36,'Calc-Drivers'!$B$17:$F$27,N$42,FALSE))","v":" "},{"$f":"IF(ISERROR(VLOOKUP($K36,'Calc-Drivers'!$B$17:$F$27,O$42,FALSE)),\" \",VLOOKUP($K36,'Calc-Drivers'!$B$17:$F$27,O$42,FALSE))","v":" "},null,null," "," "," "," ",null,null," "," "," "," ",null,null,{"$f":"IF(ISERROR(X36*100000000/'Calc-Units'!$E$21),\" \",X36*100000000/'Calc-Units'!$E$21)","v":" "},{"$f":"IF(ISERROR(Y36*100000000/'Calc-Units'!$D$21),\" \",Y36*100000000/'Calc-Units'!$D$21)","v":" "},{"$f":"IF(ISERROR(Z36*100000000/'Calc-Units'!$C$21),\" \",Z36*100000000/'Calc-Units'!$C$21)","v":" "},{"$f":"IF(ISERROR(AA36*100000000/'Calc-Units'!$C$21),\" \",AA36*100000000/'Calc-Units'!$C$21)","v":" "},null,0,0,4.2,null,null," "," "," "," ",null,null,{"$f":"IF(ISERROR(AN36*100000000/'Calc-Units'!$E$21),\" \",AN36*100000000/'Calc-Units'!$E$21)","v":" "},{"$f":"IF(ISERROR(AO36*100000000/'Calc-Units'!$D$21),\" \",AO36*100000000/'Calc-Units'!$D$21)","v":" "},{"$f":"IF(ISERROR(AP36*100000000/'Calc-Units'!$C$21),\" \",AP36*100000000/'Calc-Units'!$C$21)","v":" "},{"$f":"IF(ISERROR(AQ36*100000000/'Calc-Units'!$C$21),\" \",AQ36*100000000/'Calc-Units'!$C$21)","v":" "}]
[null,null,"Pension deficit repair payments by related parties (note 2)",{"$f":"'RRP 1.3'!AI$12","v":0},0,0,0,0,0,null,"Do not allocate",{"$f":"IF(ISERROR(VLOOKUP($K37,'Calc-Drivers'!$B$17:$F$27,L$42,FALSE)),\" \",VLOOKUP($K37,'Calc-Drivers'!$B$17:$F$27,L$42,FALSE))","v":" "},{"$f":"IF(ISERROR(VLOOKUP($K37,'Calc-Drivers'!$B$17:$F$27,M$42,FALSE)),\" \",VLOOKUP($K37,'Calc-Drivers'!$B$17:$F$27,M$42,FALSE))","v":" "},{"$f":"IF(ISERROR(VLOOKUP($K37,'Calc-Drivers'!$B$17:$F$27,N$42,FALSE)),\" \",VLOOKUP($K37,'Calc-Drivers'!$B$17:$F$27,N$42,FALSE))","v":" "},{"$f":"IF(ISERROR(VLOOKUP($K37,'Calc-Drivers'!$B$17:$F$27,O$42,FALSE)),\" \",VLOOKUP($K37,'Calc-Drivers'!$B$17:$F$27,O$42,FALSE))","v":" "},null,null," "," "," "," ",null,null," "," "," "," ",null,null,{"$f":"IF(ISERROR(X37*100000000/'Calc-Units'!$E$21),\" \",X37*100000000/'Calc-Units'!$E$21)","v":" "},{"$f":"IF(ISERROR(Y37*100000000/'Calc-Units'!$D$21),\" \",Y37*100000000/'Calc-Units'!$D$21)","v":" "},{"$f":"IF(ISERROR(Z37*100000000/'Calc-Units'!$C$21),\" \",Z37*100000000/'Calc-Units'!$C$21)","v":" "},{"$f":"IF(ISERROR(AA37*100000000/'Calc-Units'!$C$21),\" \",AA37*100000000/'Calc-Units'!$C$21)","v":" "},null,0,0,0,null,null," "," "," "," ",null,null,{"$f":"IF(ISERROR(AN37*100000000/'Calc-Units'!$E$21),\" \",AN37*100000000/'Calc-Units'!$E$21)","v":" "},{"$f":"IF(ISERROR(AO37*100000000/'Calc-Units'!$D$21),\" \",AO37*100000000/'Calc-Units'!$D$21)","v":" "},{"$f":"IF(ISERROR(AP37*100000000/'Calc-Units'!$C$21),\" \",AP37*100000000/'Calc-Units'!$C$21)","v":" "},{"$f":"IF(ISERROR(AQ37*100000000/'Calc-Units'!$C$21),\" \",AQ37*100000000/'Calc-Units'!$C$21)","v":" "}]
[null,null,"Non activity costs and reconciling amounts (note 3)",{"$f":"'RRP 1.3'!AJ$12","v":-2.9000000000000057},0,0,0,0,-2.9000000000000057,null,"Do not allocate",{"$f":"IF(ISERROR(VLOOKUP($K38,'Calc-Drivers'!$B$17:$F$27,L$42,FALSE)),\" \",VLOOKUP($K38,'Calc-Drivers'!$B$17:$F$27,L$42,FALSE))","v":" "},{"$f":"IF(ISERROR(VLOOKUP($K38,'Calc-Drivers'!$B$17:$F$27,M$42,FALSE)),\" \",VLOOKUP($K38,'Calc-Drivers'!$B$17:$F$27,M$42,FALSE))","v":" "},{"$f":"IF(ISERROR(VLOOKUP($K38,'Calc-Drivers'!$B$17:$F$27,N$42,FALSE)),\" \",VLOOKUP($K38,'Calc-Drivers'!$B$17:$F$27,N$42,FALSE))","v":" "},{"$f":"IF(ISERROR(VLOOKUP($K38,'Calc-Drivers'!$B$17:$F$27,O$42,FALSE)),\" \",VLOOKUP($K38,'Calc-Drivers'!$B$17:$F$27,O$42,FALSE))","v":" "},null,null," "," "," "," ",null,null," "," "," "," ",null,null,{"$f":"IF(ISERROR(X38*100000000/'Calc-Units'!$E$21),\" \",X38*100000000/'Calc-Units'!$E$21)","v":" "},{"$f":"IF(ISERROR(Y38*100000000/'Calc-Units'!$D$21),\" \",Y38*100000000/'Calc-Units'!$D$21)","v":" "},{"$f":"IF(ISERROR(Z38*100000000/'Calc-Units'!$C$21),\" \",Z38*100000000/'Calc-Units'!$C$21)","v":" "},{"$f":"IF(ISERROR(AA38*100000000/'Calc-Units'!$C$21),\" \",AA38*100000000/'Calc-Units'!$C$21)","v":" "},null,0,0,-2.9000000000000057,null,null," "," "," "," ",null,null,{"$f":"IF(ISERROR(AN38*100000000/'Calc-Units'!$E$21),\" \",AN38*100000000/'Calc-Units'!$E$21)","v":" "},{"$f":"IF(ISERROR(AO38*100000000/'Calc-Units'!$D$21),\" \",AO38*100000000/'Calc-Units'!$D$21)","v":" "},{"$f":"IF(ISERROR(AP38*100000000/'Calc-Units'!$C$21),\" \",AP38*100000000/'Calc-Units'!$C$21)","v":" "},{"$f":"IF(ISERROR(AQ38*100000000/'Calc-Units'!$C$21),\" \",AQ38*100000000/'Calc-Units'!$C$21)","v":" "}]
[null,null,"Total Annual Operating & Capital Expenditure per Regulatory Accounts",{"$f":"SUM(D6:D38)","v":162.69999999999999},{"$f":"SUM(E6:E38)","v":16.729777089160976},{"$f":"SUM(F6:F38)","v":23.363069336375059},{"$f":"SUM(G6:G38)","v":6},{"$f":"SUM(H6:H38)","v":2.96551811705667},113.64163545740729,null,null,null,null,null,null,null,"Total",{"$f":"SUM(R6:R38)","v":7.6431165286597826},{"$f":"SUM(S6:S38)","v":9.6394432319902954},{"$f":"SUM(T6:T38)","v":2.3591840690974473},{"$f":"SUM(U6:U38)","v":14.999891627659771},null,"Total all network tiers",{"$f":"SUM(X40:AA40)","v":83.7},null,null,null,null,"Total all network tiers",{"$f":"SUM(AD40:AG40)","v":0.90438649385117564},null,null,null,null,"Total",{"$f":"SUM(AJ6:AJ38)","v":65.418729999999982},{"$f":"SUM(AK6:AK38)","v":97.281269999999992},null,"Total all network tiers",{"$f":"SUM(AN40:AQ40)","v":30.691800000000008},null,null,null,null,"Total all network tiers",{"$f":"SUM(AT40:AW40)","v":0.35669118906628633}]
[null,null,null,null,null,null,null,null,null,null,null,null,null,null,null,null,null,null,null,null,null,null,"Total by network tiers",{"$f":"SUM(X6:X38)","v":24.37289361782075},{"$f":"SUM(Y6:Y38)","v":33.002512568365361},{"$f":"SUM(Z6:Z38)","v":8.3591840690974468},{"$f":"SUM(AA6:AA38)","v":17.965409744716442},null,"Total by network tiers",{"$f":"SUM(AD6:AD38)","v":0.19629182058293787},{"$f":"SUM(AE6:AE38)","v":0.34329632355028217},{"$f":"SUM(AF6:AF38)","v":0.11583907333814912},{"$f":"SUM(AG6:AG38)","v":0.2489592763798065},null,null,null,null,null,"Total by network tiers",{"$f":"SUM(AN6:AN38)","v":6.5420992909898397},{"$f":"SUM(AO6:AO38)","v":8.8715233828476858},{"$f":"SUM(AP6:AP38)","v":2.5628461239557625},{"$f":"SUM(AQ6:AQ38)","v":12.715331202206718},null,"Total by network tiers",{"$f":"SUM(AT6:AT38)","v":5.2688064059976912E-2},{"$f":"SUM(AU6:AU38)","v":9.2282711969673054E-2},{"$f":"SUM(AV6:AV38)","v":3.5515155265549388E-2},{"$f":"SUM(AW6:AW38)","v":0.17620525777108698}]
[null,null,null,null,null,null,null,null,null,null,null,null,null,null,null,null,null,null,null,null,null,null,"% ",{"$f":"X40/$X$39","v":0.29119347213644864},{"$f":"Y40/$X$39","v":0.39429525171284779},{"$f":"Z40/$X$39","v":9.9870777408571643E-2},{"$f":"AA40/$X$39","v":0.21464049874213192},null,"% ",{"$f":"AD40/$AD$39","v":0.21704417515907676},{"$f":"AE40/$AD$39","v":0.37959028123962057},{"$f":"AF40/$AD$39","v":0.12808580637341033},{"$f":"AG40/$AD$39","v":0.27527973722789234},null,null,null,null,null,"% ",{"$f":"AN40/$AN$39","v":0.21315463058503697},{"$f":"AO40/$AN$39","v":0.28905190907172873},{"$f":"AP40/$AN$39","v":8.3502633405527271E-2},{"$f":"AQ40/$AN$39","v":0.41429082693770697},null,"% ",{"$f":"AT40/$AT$39","v":0.14771338814928095},{"$f":"AU40/$AT$39","v":0.25871878756310834},{"$f":"AV40/$AT$39","v":9.9568355917390952E-2},{"$f":"AW40/$AT$39","v":0.49399946837021974}]
[null,null,null,null,null,null,null,null,null,null,"Vlookup Values:",5,4,3,2,null,null,null,null,null,null,null,null,null,null,null,null,null,null,null,null,null,null,null,null,null,null,null,"THESE % ARE USED TO ALLOCATE PRICE CONTROL OPEX"]
[]
[null,null,null,null,null,null,null,null,null,null,null,null,null,null,null,null,null,null,null,null,null,null,"Step 4.a. calculate proportion of cost classified as direct costs"]
[]
[null,null,null,null,null,null,null,null,null,null,null,null,null,null,null,null,null,null,null,null,null,null,"Total direct+other",{"$f":"SUMIF(X6:X11,\">0\",X6:X11)+SUMIF(X27:X38,\">0\",X27:X38)","v":17.533245048694383},{"$f":"SUMIF(Y6:Y11,\">0\",Y6:Y11)+SUMIF(Y27:Y38,\">0\",Y27:Y38)","v":24.376397310062703},{"$f":"SUMIF(Z6:Z11,\">0\",Z6:Z11)+SUMIF(Z27:Z38,\">0\",Z27:Z38)","v":6.251979473266875},{"$f":"SUMIF(AA6:AA11,\">0\",AA6:AA11)+SUMIF(AA27:AA38,\">0\",AA27:AA38)","v":13.542352942759813},"Max of zero or total from each catergory"]
[null,null,null,null,null,null,null,null,null,null,null,null,null,null,null,null,null,null,null,null,null,null,"Total indirect",{"$f":"SUMIF(X12:X27,\">0\",X12:X27)","v":6.839648569126374},{"$f":"SUMIF(Y12:Y27,\">0\",Y12:Y27)","v":8.6261152583026508},{"$f":"SUMIF(Z12:Z27,\">0\",Z12:Z27)","v":2.1111793706143493},{"$f":"SUMIF(AA12:AA27,\">0\",AA12:AA27)","v":13.42305680195663},"Max of zero or total from each catergory"]
[null,null,null,null,null,null,null,null,null,null,null,null,null,null,null,null,null,null,null,null,null,null,"% direct+other",{"$f":"X46/(X47+X46)","v":0.71937478264273791},{"$f":"Y46/(Y47+Y46)","v":0.73862246880647398},{"$f":"Z46/(Z47+Z46)","v":0.74756196671321606},{"$f":"AA46/(AA47+AA46)","v":0.50221202165909151}]
[null,null,null,null,null,null,null,null,null,null,null,null,null,null,null,null,null,null,null,null,null,null,"% indirect",{"$f":"X47/(X46+X47)","v":0.28062521735726198},{"$f":"Y47/(Y46+Y47)","v":0.26137753119352602},{"$f":"Z47/(Z46+Z47)","v":0.25243803328678383},{"$f":"AA47/(AA46+AA47)","v":0.49778797834090843}]

{"sheet":"Calc-Units","index":6,"n_rows":21,"n_cols":6,"rows_kept":21,"cut":false,"hidden":false,"merged":[]}
["103. Units distributed (GWh) from RRP table 5.1",null,null,"Index"]
[null,"Units distributed (GWh) from RRP table 5.1"]
["Units distributed at LV",{"$f":"'RRP 5.1'!G36","v":7216.2041944999992}]
["Units distributed at HV",{"$f":"'RRP 5.1'!G35","v":2482.1083529999996}]
["Units distributed at EHV+",{"$f":"'RRP 5.1'!G34","v":2954.8379382999997}]
["Losses",{"$f":"'RRP 5.1'!G40","v":675.23700000000008}]
[]
["104. Estimated line loss adjustment factors relative to LV"]
[null,"LV services","LV","HV","EHV","132kV"]
["Units distributed at LV",1,1,1,1,1]
["Units distributed at HV",0,0,{"$f":"(1+$B$6/($B$3+$B$4/2+$B$5/4)/2)/(1+$B$6/($B$3+$B$4/2+$B$5/4))","v":0.96579764021315795},{"$f":"(1+$B$6/($B$3+$B$4/2+$B$5/4)/2)/(1+$B$6/($B$3+$B$4/2+$B$5/4))","v":0.96579764021315795},{"$f":"(1+$B$6/($B$3+$B$4/2+$B$5/4)/2)/(1+$B$6/($B$3+$B$4/2+$B$5/4))","v":0.96579764021315795}]
["Units distributed at EHV+",0,0,0,{"$f":"(1+$B$6/($B$3+$B$4/2+$B$5/4)/4)/(1+$B$6/($B$3+$B$4/2+$B$5/4))","v":0.94869646031973676},{"$f":"(1+$B$6/($B$3+$B$4/2+$B$5/4)/4)/(1+$B$6/($B$3+$B$4/2+$B$5/4))","v":0.94869646031973676}]
[]
[]
[]
[]
[]
[]
[null,"LV services","LV","HV","EHV","132kV"]
["Units (GWh) flowing through each level, loss-adjusted to LV",{"$f":"SUMPRODUCT(B$10:B$12,$B$3:$B$5)","v":7216.2041944999992},{"$f":"SUMPRODUCT(C$10:C$12,$B$3:$B$5)","v":7216.2041944999992},{"$f":"SUMPRODUCT(D$10:D$12,$B$3:$B$5)","v":9613.418584580766},{"$f":"SUMPRODUCT(E$10:E$12,$B$3:$B$5)","v":12416.662877464445},{"$f":"SUMPRODUCT(F$10:F$12,$B$3:$B$5)","v":12416.662877464445}]
["Units (kWh) flowing through each level, loss-adjusted to LV",{"$f":"B20*1000000","v":7216204194.499999},{"$f":"C20*1000000","v":7216204194.499999},{"$f":"D20*1000000","v":9613418584.5807667},{"$f":"E20*1000000","v":12416662877.464445},{"$f":"F20*1000000","v":12416662877.464445}]

{"sheet":"Calc-Drivers","index":7,"n_rows":27,"n_cols":8,"rows_kept":27,"cut":false,"hidden":false,"merged":[]}
["Drivers - LV, HV, EHV split",null,null,null,null,null,null,"Index"]
[]
[null,"Category","LV","HV","EHV",null,"Source"]
[null,"Net Capex",{"$f":"'Calc-Net capex'!$D$6","v":0.18558934458027707},{"$f":"'Calc-Net capex'!$D$7","v":0.43718110477041494},{"$f":"'Calc-Net capex'!$D$8+'Calc-Net capex'!$D$9","v":0.37722955064930797},null,"FBPQ capex - see \"Calc Net capex\""]
[null,"Customers",1,0,0,null,"Assumption"]
[null,"Network Length",{"$f":"'RRP 5.1'!$G$64/'RRP 5.1'!$G$65","v":0.40074253917647679},{"$f":"'RRP 5.1'!$G$63/'RRP 5.1'!$G$65","v":0.50561680405020537},{"$f":"('RRP 5.1'!$G$61+'RRP 5.1'!$G$62)/'RRP 5.1'!$G$65","v":9.3640656773317954E-2},null,"RRP table 5.1"]
[null,"Substations",{"$f":"0/'RRP 5.1'!$G$73","v":0},{"$f":"('RRP 5.1'!$G$71+'RRP 5.1'!$G$72)/'RRP 5.1'!$G$73","v":0.99313034725717164},{"$f":"('RRP 5.1'!$G$68+'RRP 5.1'!$G$69+'RRP 5.1'!$G$70)/'RRP 5.1'!$G$73","v":6.8696527428283843E-3},null,"RRP table 5.1"]
[null,"Transmission Exit Charges",0,0,1,null,"Assumption"]
[null,"MEAV",{"$f":"'Calc-MEAV'!D6","v":0.43300183232118161},{"$f":"'Calc-MEAV'!D7","v":0.34636434286829032},{"$f":"'Calc-MEAV'!D8+'Calc-MEAV'!D9","v":0.22063382481052818},null,"FBPQ capex - see \"Calc MEAV\""]
[null,"EHV only",0,0,1,null,"Assumption"]
[null,"LV only",1,0,0,null,"Assumption"]
[null,"HV only",0,1,0,null,"Assumption"]
[]
["Drivers - LV, LV/HV, HV, EHV split"]
[]
[null,"Category","LV","LV/HV","HV","EHV","Source"]
[null,"Net Capex",{"$f":"'Calc-Net capex'!H6","v":0.18558934458027709},{"$f":"'Calc-Net capex'!H7","v":8.6838733515246375E-2},{"$f":"'Calc-Net capex'!H8","v":0.35034237125516859},{"$f":"'Calc-Net capex'!$D$8+'Calc-Net capex'!$D$9","v":0.37722955064930797},"FBPQ capex - see \"Calc Net capex\""]
[null,"No. of Customers",1,0,0,0,"Assumption"]
[null,"Network Length",{"$f":"'RRP 5.1'!$G$64/'RRP 5.1'!$G$65","v":0.40074253917647679},0,{"$f":"'RRP 5.1'!$G$63/'RRP 5.1'!$G$65","v":0.50561680405020537},{"$f":"('RRP 5.1'!$G$61+'RRP 5.1'!$G$62)/'RRP 5.1'!$G$65","v":9.3640656773317954E-2},"RRP table 5.1"]
[null,"No. of Substations",{"$f":"0/'RRP 5.1'!$G$73","v":0},0,{"$f":"('RRP 5.1'!$G$71+'RRP 5.1'!$G$72)/'RRP 5.1'!$G$73","v":0.99313034725717164},{"$f":"('RRP 5.1'!$G$68+'RRP 5.1'!$G$69+'RRP 5.1'!$G$70)/'RRP 5.1'!$G$73","v":6.8696527428283843E-3},"RRP table 5.1"]
[null,"Transmission Exit Charges",0,0,0,1,"Assumption"]
[null,"MEAV",{"$f":"'Calc-MEAV'!H6","v":0.43300183232118161},{"$f":"'Calc-MEAV'!H7","v":6.8102560342398366E-2},{"$f":"'Calc-MEAV'!H8","v":0.27826178252589195},{"$f":"'Calc-MEAV'!H9+'Calc-MEAV'!H10","v":0.22063382481052818},"FBPQ capex - see \"Calc MEAV\""]
[null,"MEAV excl services",{"$f":"'Calc-MEAV'!L6","v":0.32445753799232402},{"$f":"'Calc-MEAV'!L7","v":0.10529097103799183},{"$f":"'Calc-MEAV'!L8","v":0.30738024074175768},{"$f":"'Calc-MEAV'!L9+'Calc-MEAV'!L10","v":0.2628712502279264},"FBPQ capex - see \"Calc MEAV\""]
[null,"MEAV excl services and 50% LV network",{"$f":"'Calc-MEAV'!Q3","v":0},{"$f":"'Calc-MEAV'!Q4","v":0},{"$f":"'Calc-MEAV'!Q5","v":"% of Total"},{"$f":"'Calc-MEAV'!Q6+'Calc-MEAV'!Q7","v":0.31932313993833994},"FBPQ capex - see \"Calc MEAV\""]
[null,"EHV only",0,0,0,1,"Assumption"]
[null,"LV only",1,0,0,0,"Assumption"]
[null,"HV only",0,0,1,0,"Assumption"]

{"sheet":"Calc-MEAV","index":8,"n_rows":164,"n_cols":18,"rows_kept":164,"cut":false,"hidden":false,"merged":[[2,14,2,16],[3,14,3,16],[2,1,2,3],[3,1,3,3],[2,5,2,7],[3,5,3,7],[2,9,2,11],[3,9,3,11]]}
["MEAV by Voltage Level",null,null,null,null,"Index"]
[]
[null,"MEAV  - LV, HV, EHV, 132kV split",null,null,null,"MEAV  - LV, LV/HV, HV, EHV, 132kV split",null,null,null,"MEAV  - LV (excl. services), LV/HV, HV, EHV, 132kV split",null,null,null,null,"MEAV  - LV (excl. services + 50%LV), LV/HV, HV, EHV, 132kV split"]
[null,"Sum of MEAV of asset classified in voltage tier (as calculated below)",null,null,null,"Sum of MEAV of asset classified in voltage tier",null,null,null,"Sum of MEAV of asset classified in voltage tier (as calculated below)",null,null,null,null,"Sum of MEAV of asset classified in voltage tier (as calculated below)"]
[null,null,"£m","% of Total",null,null,"£m","% of Total",null,null,"£m","% of Total",null,null,null,"£m","% of Total"]
[null,"LV",{"$f":"SUM(I20:I39)","v":1763568.7248},{"$f":"C6/$C$10","v":0.43300183232118161},null,"LV",{"$f":"SUM(I20:I39)","v":1763568.7248},{"$f":"G6/$G$11","v":0.43300183232118161},null,"LV",{"$f":"SUM(I20:I39)-I21-I30","v":1109148.0648000001},{"$f":"K6/$K$11","v":0.32445753799232402},null,null,"LV",{"$f":"(SUM(I20:I39)-I21-I30)*0.5","v":554574.03240000003},{"$f":"P6/P$11","v":0.19364327992234293}]
[null,"HV",{"$f":"SUM(I42:I79)+SUM(I158:I163)+SUM(I153:I154)","v":1410703.7819999999},{"$f":"C7/$C$10","v":0.34636434286829032},null,"LV/HV",{"$f":"SUM(I62:I63)+SUM(I69:I70)+SUM(I75:I78)","v":277374.21999999997},{"$f":"G7/$G$11","v":6.8102560342398366E-2},null,"LV/HV",{"$f":"SUM(I59:I72)+SUM(I75:I78)","v":359933.93},{"$f":"K7/$K$11","v":0.10529097103799183},null,null,"LV/HV",{"$f":"SUM(I59:I72)+SUM(I75:I78)","v":359933.93},{"$f":"P7/P$11","v":0.12567986001599699}]
[null,"EHV",{"$f":"SUM(I81:I120)+SUM(I149:I150)","v":323753.89367999998},{"$f":"C8/$C$10","v":7.9489972357303512E-2},null,"HV",{"$f":"SUM(I42:I56)+SUM(I59:I61)+SUM(I64:I68)+SUM(I71:I72)+SUM(I158:I163)+SUM(I153:I154)","v":1133329.5619999999},{"$f":"G8/$G$11","v":0.27826178252589195},null,"HV",{"$f":"SUM(I42:I56)+SUM(I158:I163)+SUM(I153:I154)","v":1050769.852},{"$f":"K8/$K$11","v":0.30738024074175768},null,null,"HV",{"$f":"SUM(I42:I56)+SUM(I158:I163)+SUM(I153:I154)","v":1050769.852},{"$f":"P8/P$11","v":0.36690235874231103}]
[null,"132 kV",{"$f":"SUM(I121:I146)","v":574863.35000000009},{"$f":"C9/$C$10","v":0.14114385245322467},"Check","EHV",{"$f":"SUM(I81:I120)+SUM(I149:I150)","v":323753.89367999998},{"$f":"G9/$G$11","v":7.9489972357303512E-2},null,"EHV",{"$f":"SUM(I81:I120)+SUM(I149:I150)","v":323753.89367999998},{"$f":"K9/$K$11","v":9.4707275423847839E-2},null,null,"EHV",{"$f":"SUM(I81:I120)+SUM(I149:I150)","v":323753.89367999998},{"$f":"P9/P$11","v":0.11304670286943042}]
[null,"Total",{"$f":"SUM(C6:C9)","v":4072889.7504799995},{"$f":"SUM(D6:D9)","v":1},{"$f":"IF(C10=$I$164,\"OK\", \"error\")","v":"OK"},"132 kV",{"$f":"SUM(I121:I146)","v":574863.35000000009},{"$f":"G10/$G$11","v":0.14114385245322467},"Check","132 kV",{"$f":"SUM(I121:I146)","v":574863.35000000009},{"$f":"K10/$K$11","v":0.16816397480407855},"Check",null,"132 kV",{"$f":"SUM(I121:I146)","v":574863.35000000009},{"$f":"P10/P$11","v":0.20072779844991856},"Check"]
[null,null,null,null,null,"Total",{"$f":"SUM(G6:G10)","v":4072889.7504799995},{"$f":"SUM(H6:H10)","v":1},{"$f":"IF(G11=$I$164,\"OK\", \"error\")","v":"OK"},"Total",{"$f":"SUM(K6:K10)","v":3418469.0904800002},{"$f":"SUM(L6:L10)","v":0.99999999999999989},{"$f":"IF(K11=($I$164-I21-I30),\"OK\", \"error\")","v":"OK"},null,"Total",{"$f":"SUM(P6:P10)","v":2863895.0580800003},{"$f":"SUM(Q6:Q10)","v":1},{"$f":"IF(P11=($I$164-I21-I30-(SUM(I20:I39)-I21-I30)*0.5),\"OK\", \"error\")","v":"OK"}]
[]
[]
["MEAV Calculation = Replacement unit cost*FBPQ closing asset balance"]
[]
[null,null,"Asset categories","Units","DNO reported Unit Cost (£)",null,"Unit cost used in MEAV calculation (£)","Closing DCPR asset Balance (units)","MEAV (£)"]
[null,null,null,null,"Sum of direct and indriect replacement unit cost from FBPQ C2","PB power numbers, if available","Is DNO Unit cost if avaliable, otherwise PB power unit cost","Closing asset balannce from FBPQ V4","Unit cost used in MEAV calculation*Closing DCPR asset Balance (units)","Classification"]
["LV Network",null,null,null,null,null,null,null,null,null,null,"LV",{"$f":"SUMIF(J:J,L18,I:I)","v":1763568.7248},{"$f":"M18/M$25","v":0.43300183232118161}]
[null,"Overhead lines",null,null,null,null,null,null,null,"LV",null,"HV/LV",{"$f":"SUMIF(J:J,L19,I:I)","v":277374.22000000003},{"$f":"M19/M$25","v":6.810256034239838E-2}]
[null,null,"LV Main (OHL)","km",{"$f":"IF(ISNUMBER('FBPQ C2'!J12),'FBPQ C2'!J12,IF(ISNUMBER('FBPQ C2'!I12),'FBPQ C2'!I12,\"\"))","v":19.989999999999998},"DATA",{"$f":"IF(ISNUMBER(E20),E20,IF(H20>0,F20,\" \"))","v":19.989999999999998},{"$f":"IF(ISBLANK('FBPQ T4'!E12),\" \",'FBPQ T4'!AE12)","v":3192},{"$f":"IF(ISERROR(G20*H20),\" \",G20*H20)","v":63808.079999999994},"LV",null,"HV",1051814.7319999998,0.25824777895744444]
[null,null,"LV Service (OHL)","Each",{"$f":"IF(ISNUMBER('FBPQ C2'!J13),'FBPQ C2'!J13,IF(ISNUMBER('FBPQ C2'!I13),'FBPQ C2'!I13,\"\"))","v":0.32},"DATA",0.32,{"$f":"IF(ISBLANK('FBPQ T4'!E13),\" \",'FBPQ T4'!AE13)","v":317000},{"$f":"IF(ISERROR(G21*H21),\" \",G21*H21)","v":101440},"LV",null,"EHV/HV",160146.74000000002,3.9320175553764096E-2]
[null,null,null,null,{"$f":"IF(ISNUMBER('FBPQ C2'!J14),'FBPQ C2'!J14,IF(ISNUMBER('FBPQ C2'!I14),'FBPQ C2'!I14,\"\"))","v":""},null,0,{"$f":"IF(ISBLANK('FBPQ T4'!E14),\" \",'FBPQ T4'!AE14)","v":" "}," ","LV",null,"EHV",205131.45367999998,5.0365088732349003E-2]
[null,"Overhead lines - Support",null,null,{"$f":"IF(ISNUMBER('FBPQ C2'!J15),'FBPQ C2'!J15,IF(ISNUMBER('FBPQ C2'!I15),'FBPQ C2'!I15,\"\"))","v":""},null,0,{"$f":"IF(ISBLANK('FBPQ T4'!E15),\" \",'FBPQ T4'!AE15)","v":" "}," ","LV",null,"132kV/EHV",189323.98,4.6483944226009981E-2]
[null,null,"LV Support","Each",{"$f":"IF(ISNUMBER('FBPQ C2'!J16),'FBPQ C2'!J16,IF(ISNUMBER('FBPQ C2'!I16),'FBPQ C2'!I16,\"\"))","v":1.92},"DATA",1.92,{"$f":"IF(ISBLANK('FBPQ T4'!E16),\" \",'FBPQ T4'!AE16)","v":97546},187288.32000000001,"LV",null,"132kV",425529.9,0.10447861986685261]
[null,null,null,null,{"$f":"IF(ISNUMBER('FBPQ C2'!J17),'FBPQ C2'!J17,IF(ISNUMBER('FBPQ C2'!I17),'FBPQ C2'!I17,\"\"))","v":""},null,0,{"$f":"IF(ISBLANK('FBPQ T4'!E17),\" \",'FBPQ T4'!AE17)","v":" "}," ","LV",null,"All",{"$f":"SUM(M18:M24)","v":4072889.7504799995},1]
[null,"Underground cables",null,null,{"$f":"IF(ISNUMBER('FBPQ C2'!J18),'FBPQ C2'!J18,IF(ISNUMBER('FBPQ C2'!I18),'FBPQ C2'!I18,\"\"))","v":""},null,0,{"$f":"IF(ISBLANK('FBPQ T4'!E18),\" \",'FBPQ T4'!AE18)","v":" "}," ","LV"]
[null,null,"LV Main (UG Consac)","km",{"$f":"IF(ISNUMBER('FBPQ C2'!J19),'FBPQ C2'!J19,IF(ISNUMBER('FBPQ C2'!I19),'FBPQ C2'!I19,\"\"))","v":""},"DATA"," ",{"$f":"IF(ISBLANK('FBPQ T4'!E19),\" \",'FBPQ T4'!AE19)","v":0}," ","LV"]
[null,null,"LV Main (UG Plastic)","km",{"$f":"IF(ISNUMBER('FBPQ C2'!J20),'FBPQ C2'!J20,IF(ISNUMBER('FBPQ C2'!I20),'FBPQ C2'!I20,\"\"))","v":67.22},"DATA",67.22,{"$f":"IF(ISBLANK('FBPQ T4'!E20),\" \",'FBPQ T4'!AE20)","v":4772.09},320779.8898,"LV",null,"EHV/HV",{"$f":"M21","v":160146.74000000002},{"$f":"M28/M$32","v":0.16339302049234417}]
[null,null,"LV Main (UG Paper)","km",{"$f":"IF(ISNUMBER('FBPQ C2'!J21),'FBPQ C2'!J21,IF(ISNUMBER('FBPQ C2'!I21),'FBPQ C2'!I21,\"\"))","v":75.91},"DATA",75.91,{"$f":"IF(ISBLANK('FBPQ T4'!E21),\" \",'FBPQ T4'!AE21)","v":6194.5},470224.495,"LV",null,"EHV",{"$f":"M22","v":205131.45367999998},{"$f":"M29/M$32","v":0.20928960411408049}]
[null,null,"LV Service (UG)","Each",{"$f":"IF(ISNUMBER('FBPQ C2'!J22),'FBPQ C2'!J22,IF(ISNUMBER('FBPQ C2'!I22),'FBPQ C2'!I22,\"\"))","v":0.71},"DATA",0.71,{"$f":"IF(ISBLANK('FBPQ T4'!E22),\" \",'FBPQ T4'!AE22)","v":778846},552980.65999999992,"LV",null,"132kV/EHV",{"$f":"M23","v":189323.98},{"$f":"M30/M$32","v":0.19316170247257081}]
[null,null,null,null,{"$f":"IF(ISNUMBER('FBPQ C2'!J23),'FBPQ C2'!J23,IF(ISNUMBER('FBPQ C2'!I23),'FBPQ C2'!I23,\"\"))","v":""},null,0,{"$f":"IF(ISBLANK('FBPQ T4'!E23),\" \",'FBPQ T4'!AE23)","v":" "}," ","LV",null,"132kV",{"$f":"M24","v":425529.9},{"$f":"M31/M$32","v":0.43415567292100454}]
[null,"Switchgear ",null,null,{"$f":"IF(ISNUMBER('FBPQ C2'!J24),'FBPQ C2'!J24,IF(ISNUMBER('FBPQ C2'!I24),'FBPQ C2'!I24,\"\"))","v":""},null,0,{"$f":"IF(ISBLANK('FBPQ T4'!E24),\" \",'FBPQ T4'!AE24)","v":" "}," ","LV",null,"All EHV",{"$f":"SUM(M28:M31)","v":980132.07368000003},{"$f":"M32/M$32","v":1}]
[null,null,"LV Pillar (ID)","Each",{"$f":"IF(ISNUMBER('FBPQ C2'!J25),'FBPQ C2'!J25,IF(ISNUMBER('FBPQ C2'!I25),'FBPQ C2'!I25,\"\"))","v":8.06},"DATA",8.06,{"$f":"IF(ISBLANK('FBPQ T4'!E25),\" \",'FBPQ T4'!AE25)","v":4081},32892.86,"LV"]
[null,null,"LV Pillar (OD)","Each",{"$f":"IF(ISNUMBER('FBPQ C2'!J26),'FBPQ C2'!J26,IF(ISNUMBER('FBPQ C2'!I26),'FBPQ C2'!I26,\"\"))","v":8.4700000000000006},"DATA",8.4700000000000006,{"$f":"IF(ISBLANK('FBPQ T4'!E26),\" \",'FBPQ T4'!AE26)","v":3785},32058.95,"LV"]
[null,null,"LV Board (WM)","Each",{"$f":"IF(ISNUMBER('FBPQ C2'!J27),'FBPQ C2'!J27,IF(ISNUMBER('FBPQ C2'!I27),'FBPQ C2'!I27,\"\"))","v":10.53},"DATA",10.53,{"$f":"IF(ISBLANK('FBPQ T4'!E27),\" \",'FBPQ T4'!AE27)","v":199},2095.4699999999998,"LV"]
[null,null,"LV UGB","Each",{"$f":"IF(ISNUMBER('FBPQ C2'!J28),'FBPQ C2'!J28,IF(ISNUMBER('FBPQ C2'!I28),'FBPQ C2'!I28,\"\"))","v":""},"DATA","DATA",{"$f":"IF(ISBLANK('FBPQ T4'!E28),\" \",'FBPQ T4'!AE28)","v":3645}," ","LV"]
[null,null,"LV Fuses (PM)","Each",{"$f":"IF(ISNUMBER('FBPQ C2'!J29),'FBPQ C2'!J29,IF(ISNUMBER('FBPQ C2'!I29),'FBPQ C2'!I29,\"\"))","v":""},"DATA","DATA",{"$f":"IF(ISBLANK('FBPQ T4'!E29),\" \",'FBPQ T4'!AE29)","v":31376}," ","LV"]
[null,null,"LV Fuses (TM)","Each",{"$f":"IF(ISNUMBER('FBPQ C2'!J30),'FBPQ C2'!J30,IF(ISNUMBER('FBPQ C2'!I30),'FBPQ C2'!I30,\"\"))","v":""},"DATA","DATA",{"$f":"IF(ISBLANK('FBPQ T4'!E30),\" \",'FBPQ T4'!AE30)","v":2653}," ","LV"]
[null,null,null,null,{"$f":"IF(ISNUMBER('FBPQ C2'!J31),'FBPQ C2'!J31,IF(ISNUMBER('FBPQ C2'!I31),'FBPQ C2'!I31,\"\"))","v":""},null,0,{"$f":"IF(ISBLANK('FBPQ T4'!E31),\" \",'FBPQ T4'!AE31)","v":" "}," ","LV"]
["HV network",null,null,null,{"$f":"IF(ISNUMBER('FBPQ C2'!J32),'FBPQ C2'!J32,IF(ISNUMBER('FBPQ C2'!I32),'FBPQ C2'!I32,\"\"))","v":""},null,0,{"$f":"IF(ISBLANK('FBPQ T4'!E32),\" \",'FBPQ T4'!AE32)","v":" "}," "]
[null,"Overhead lines",null,null,{"$f":"IF(ISNUMBER('FBPQ C2'!J33),'FBPQ C2'!J33,IF(ISNUMBER('FBPQ C2'!I33),'FBPQ C2'!I33,\"\"))","v":""},null,0,{"$f":"IF(ISBLANK('FBPQ T4'!E33),\" \",'FBPQ T4'!AE33)","v":" "}," ","HV"]
[null,null,"6.6/11 kV OHL (Open)","km",{"$f":"IF(ISNUMBER('FBPQ C2'!J34),'FBPQ C2'!J34,IF(ISNUMBER('FBPQ C2'!I34),'FBPQ C2'!I34,\"\"))","v":20.82},"DATA",20.82,{"$f":"IF(ISBLANK('FBPQ T4'!E34),\" \",'FBPQ T4'!AE34)","v":12207},254149.74,"HV"]
[null,null,"6.6/11 kV OHL (Covered)","km",{"$f":"IF(ISNUMBER('FBPQ C2'!J35),'FBPQ C2'!J35,IF(ISNUMBER('FBPQ C2'!I35),'FBPQ C2'!I35,\"\"))","v":""},"DATA"," ",{"$f":"IF(ISBLANK('FBPQ T4'!E35),\" \",'FBPQ T4'!AE35)","v":0}," ","HV"]
[null,null,"20 kV OHL (Open)","km",{"$f":"IF(ISNUMBER('FBPQ C2'!J36),'FBPQ C2'!J36,IF(ISNUMBER('FBPQ C2'!I36),'FBPQ C2'!I36,\"\"))","v":""},"DATA"," ",{"$f":"IF(ISBLANK('FBPQ T4'!E36),\" \",'FBPQ T4'!AE36)","v":0}," ","HV"]
[null,null,"20 kV OHL (Covered)","km",{"$f":"IF(ISNUMBER('FBPQ C2'!J37),'FBPQ C2'!J37,IF(ISNUMBER('FBPQ C2'!I37),'FBPQ C2'!I37,\"\"))","v":""},"DATA"," ",{"$f":"IF(ISBLANK('FBPQ T4'!E37),\" \",'FBPQ T4'!AE37)","v":0}," ","HV"]
[null,null,null,null,{"$f":"IF(ISNUMBER('FBPQ C2'!J38),'FBPQ C2'!J38,IF(ISNUMBER('FBPQ C2'!I38),'FBPQ C2'!I38,\"\"))","v":""},null,0,{"$f":"IF(ISBLANK('FBPQ T4'!E38),\" \",'FBPQ T4'!AE38)","v":" "}," ","HV"]
[null,"Overhead lines - Support",null,null,{"$f":"IF(ISNUMBER('FBPQ C2'!J39),'FBPQ C2'!J39,IF(ISNUMBER('FBPQ C2'!I39),'FBPQ C2'!I39,\"\"))","v":""},null,0,{"$f":"IF(ISBLANK('FBPQ T4'!E39),\" \",'FBPQ T4'!AE39)","v":" "}," ","HV"]
[null,null,"6.6/11 kV Support","Each",{"$f":"IF(ISNUMBER('FBPQ C2'!J40),'FBPQ C2'!J40,IF(ISNUMBER('FBPQ C2'!I40),'FBPQ C2'!I40,\"\"))","v":2.0499999999999998},"DATA",2.0499999999999998,{"$f":"IF(ISBLANK('FBPQ T4'!E40),\" \",'FBPQ T4'!AE40)","v":162533},333192.64999999997,"HV"]
[null,null,"20 kV Support","Each",{"$f":"IF(ISNUMBER('FBPQ C2'!J41),'FBPQ C2'!J41,IF(ISNUMBER('FBPQ C2'!I41),'FBPQ C2'!I41,\"\"))","v":""},"DATA"," ",{"$f":"IF(ISBLANK('FBPQ T4'!E41),\" \",'FBPQ T4'!AE41)","v":0}," ","HV"]
[null,null,null,null,{"$f":"IF(ISNUMBER('FBPQ C2'!J42),'FBPQ C2'!J42,IF(ISNUMBER('FBPQ C2'!I42),'FBPQ C2'!I42,\"\"))","v":""},"DATA","DATA",{"$f":"IF(ISBLANK('FBPQ T4'!E42),\" \",'FBPQ T4'!AE42)","v":" "}," ","HV"]
[null,"Underground cables (kms)",null,null,{"$f":"IF(ISNUMBER('FBPQ C2'!J43),'FBPQ C2'!J43,IF(ISNUMBER('FBPQ C2'!I43),'FBPQ C2'!I43,\"\"))","v":""},null,0,{"$f":"IF(ISBLANK('FBPQ T4'!E43),\" \",'FBPQ T4'!AE43)","v":" "}," ","HV"]
[null,null,"6.6/11kV UG Cable","km",{"$f":"IF(ISNUMBER('FBPQ C2'!J44),'FBPQ C2'!J44,IF(ISNUMBER('FBPQ C2'!I44),'FBPQ C2'!I44,\"\"))","v":84.36},"DATA",{"$f":"IF(ISNUMBER(E52),E52,IF(H52>0,F52,\" \"))","v":84.36},{"$f":"IF(ISBLANK('FBPQ T4'!E44),\" \",'FBPQ T4'!AE44)","v":5461.7},460749.01199999999,"HV"]
[null,null,"20kV UG Cable","km",{"$f":"IF(ISNUMBER('FBPQ C2'!J45),'FBPQ C2'!J45,IF(ISNUMBER('FBPQ C2'!I45),'FBPQ C2'!I45,\"\"))","v":""},"DATA"," ",{"$f":"IF(ISBLANK('FBPQ T4'!E45),\" \",'FBPQ T4'!AE45)","v":0}," ","HV"]
[null,null,null,null,{"$f":"IF(ISNUMBER('FBPQ C2'!J46),'FBPQ C2'!J46,IF(ISNUMBER('FBPQ C2'!I46),'FBPQ C2'!I46,\"\"))","v":""},null,0,{"$f":"IF(ISBLANK('FBPQ T4'!E46),\" \",'FBPQ T4'!AE46)","v":" "}," ","HV"]
[null,"Submarine cables (kms)",null,null,{"$f":"IF(ISNUMBER('FBPQ C2'!J47),'FBPQ C2'!J47,IF(ISNUMBER('FBPQ C2'!I47),'FBPQ C2'!I47,\"\"))","v":""},null,0,{"$f":"IF(ISBLANK('FBPQ T4'!E47),\" \",'FBPQ T4'!AE47)","v":" "}," ","HV"]
[null,null,"HV Sub Cable","km",{"$f":"IF(ISNUMBER('FBPQ C2'!J48),'FBPQ C2'!J48,IF(ISNUMBER('FBPQ C2'!I48),'FBPQ C2'!I48,\"\"))","v":535.69000000000005},"DATA",535.69000000000005,{"$f":"IF(ISBLANK('FBPQ T4'!E48),\" \",'FBPQ T4'!AE48)","v":5},2678.4500000000003,"HV"]
[null,null,null,null,{"$f":"IF(ISNUMBER('FBPQ C2'!J49),'FBPQ C2'!J49,IF(ISNUMBER('FBPQ C2'!I49),'FBPQ C2'!I49,\"\"))","v":""},"DATA","DATA",{"$f":"IF(ISBLANK('FBPQ T4'!E49),\" \",'FBPQ T4'!AE49)","v":" "}," ","HV"]
[null,"Switchgear ",null,null,{"$f":"IF(ISNUMBER('FBPQ C2'!J50),'FBPQ C2'!J50,IF(ISNUMBER('FBPQ C2'!I50),'FBPQ C2'!I50,\"\"))","v":""},null,0,{"$f":"IF(ISBLANK('FBPQ T4'!E50),\" \",'FBPQ T4'!AE50)","v":" "}," ","HV"]
[null,null,"6.6/11 kV CB (PM)","Each",{"$f":"IF(ISNUMBER('FBPQ C2'!J51),'FBPQ C2'!J51,IF(ISNUMBER('FBPQ C2'!I51),'FBPQ C2'!I51,\"\"))","v":8.31},"DATA",8.31,{"$f":"IF(ISBLANK('FBPQ T4'!E51),\" \",'FBPQ T4'!AE51)","v":913},7587.0300000000007,"EHV/HV"]
[null,null,"6.6/11 kV CB (GM)","Each",{"$f":"IF(ISNUMBER('FBPQ C2'!J52),'FBPQ C2'!J52,IF(ISNUMBER('FBPQ C2'!I52),'FBPQ C2'!I52,\"\"))","v":24.52},"DATA",24.52,{"$f":"IF(ISBLANK('FBPQ T4'!E52),\" \",'FBPQ T4'!AE52)","v":3015},73927.8,"EHV/HV"]
[null,null,"6.6/11 kV Switch (PM)","Each",{"$f":"IF(ISNUMBER('FBPQ C2'!J53),'FBPQ C2'!J53,IF(ISNUMBER('FBPQ C2'!I53),'FBPQ C2'!I53,\"\"))","v":7.06},"DATA",7.06,{"$f":"IF(ISBLANK('FBPQ T4'!E53),\" \",'FBPQ T4'!AE53)","v":148},1044.8799999999999,"HV"]
[null,null,"6.6/11 kV Switch (GM)","Each",{"$f":"IF(ISNUMBER('FBPQ C2'!J54),'FBPQ C2'!J54,IF(ISNUMBER('FBPQ C2'!I54),'FBPQ C2'!I54,\"\"))","v":10.15},"DATA",10.15,{"$f":"IF(ISBLANK('FBPQ T4'!E54),\" \",'FBPQ T4'!AE54)","v":2330},23649.5,"HV/LV"]
[null,null,"6.6/11 kV RMU","Each",{"$f":"IF(ISNUMBER('FBPQ C2'!J55),'FBPQ C2'!J55,IF(ISNUMBER('FBPQ C2'!I55),'FBPQ C2'!I55,\"\"))","v":12.28},"DATA",12.28,{"$f":"IF(ISBLANK('FBPQ T4'!E55),\" \",'FBPQ T4'!AE55)","v":7526},92419.28,"HV/LV"]
[null,null,"6.6/11 kV Switchgear - Other (PM)","Each",{"$f":"IF(ISNUMBER('FBPQ C2'!J56),'FBPQ C2'!J56,IF(ISNUMBER('FBPQ C2'!I56),'FBPQ C2'!I56,\"\"))","v":""},"DATA","DATA",{"$f":"IF(ISBLANK('FBPQ T4'!E56),\" \",'FBPQ T4'!AE56)","v":5702}," ","HV"]
[null,null,"6.6/11 kV Switchgear - Other (GM)","Each",{"$f":"IF(ISNUMBER('FBPQ C2'!J57),'FBPQ C2'!J57,IF(ISNUMBER('FBPQ C2'!I57),'FBPQ C2'!I57,\"\"))","v":""},"DATA","DATA",{"$f":"IF(ISBLANK('FBPQ T4'!E57),\" \",'FBPQ T4'!AE57)","v":1}," ","HV"]
[null,null,"20 kV CB (PM)","Each",{"$f":"IF(ISNUMBER('FBPQ C2'!J58),'FBPQ C2'!J58,IF(ISNUMBER('FBPQ C2'!I58),'FBPQ C2'!I58,\"\"))","v":""},"DATA"," ",{"$f":"IF(ISBLANK('FBPQ T4'!E58),\" \",'FBPQ T4'!AE58)","v":0}," ","EHV/HV"]
[null,null,"20 kV CB (GM)","Each",{"$f":"IF(ISNUMBER('FBPQ C2'!J59),'FBPQ C2'!J59,IF(ISNUMBER('FBPQ C2'!I59),'FBPQ C2'!I59,\"\"))","v":""},"DATA"," ",{"$f":"IF(ISBLANK('FBPQ T4'!E59),\" \",'FBPQ T4'!AE59)","v":0}," ","EHV/HV"]
[null,null,"20 kV Switch (PM)","Each",{"$f":"IF(ISNUMBER('FBPQ C2'!J60),'FBPQ C2'!J60,IF(ISNUMBER('FBPQ C2'!I60),'FBPQ C2'!I60,\"\"))","v":""},"DATA"," ",{"$f":"IF(ISBLANK('FBPQ T4'!E60),\" \",'FBPQ T4'!AE60)","v":0}," ","HV"]
[null,null,"20 kV Switch (GM)","Each",{"$f":"IF(ISNUMBER('FBPQ C2'!J61),'FBPQ C2'!J61,IF(ISNUMBER('FBPQ C2'!I61),'FBPQ C2'!I61,\"\"))","v":""},"DATA"," ",{"$f":"IF(ISBLANK('FBPQ T4'!E61),\" \",'FBPQ T4'!AE61)","v":0}," ","HV/LV"]
[null,null,"20 kV RMU","Each",{"$f":"IF(ISNUMBER('FBPQ C2'!J62),'FBPQ C2'!J62,IF(ISNUMBER('FBPQ C2'!I62),'FBPQ C2'!I62,\"\"))","v":""},"DATA"," ",{"$f":"IF(ISBLANK('FBPQ T4'!E62),\" \",'FBPQ T4'!AE62)","v":0}," ","HV/LV"]
[null,null,"20 kV Switchgear - Other (PM)","Each",{"$f":"IF(ISNUMBER('FBPQ C2'!J63),'FBPQ C2'!J63,IF(ISNUMBER('FBPQ C2'!I63),'FBPQ C2'!I63,\"\"))","v":""},"DATA"," ",{"$f":"IF(ISBLANK('FBPQ T4'!E63),\" \",'FBPQ T4'!AE63)","v":0}," ","HV"]
[null,null,"20 kV Switchgear - Other (GM)","Each",{"$f":"IF(ISNUMBER('FBPQ C2'!J64),'FBPQ C2'!J64,IF(ISNUMBER('FBPQ C2'!I64),'FBPQ C2'!I64,\"\"))","v":""},"DATA"," ",{"$f":"IF(ISBLANK('FBPQ T4'!E64),\" \",'FBPQ T4'!AE64)","v":0}," ","HV"]
[null,null,null,null,{"$f":"IF(ISNUMBER('FBPQ C2'!J65),'FBPQ C2'!J65,IF(ISNUMBER('FBPQ C2'!I65),'FBPQ C2'!I65,\"\"))","v":""},null,0,{"$f":"IF(ISBLANK('FBPQ T4'!E65),\" \",'FBPQ T4'!AE65)","v":" "}," "]
[null,"Transformers  ",null,null,{"$f":"IF(ISNUMBER('FBPQ C2'!J66),'FBPQ C2'!J66,IF(ISNUMBER('FBPQ C2'!I66),'FBPQ C2'!I66,\"\"))","v":""},null,0,{"$f":"IF(ISBLANK('FBPQ T4'!E66),\" \",'FBPQ T4'!AE66)","v":" "}," "]
[null,null,"6.6/11 kV Transformer (PM)","Each",{"$f":"IF(ISNUMBER('FBPQ C2'!J67),'FBPQ C2'!J67,IF(ISNUMBER('FBPQ C2'!I67),'FBPQ C2'!I67,\"\"))","v":1.78},"DATA",1.78,{"$f":"IF(ISBLANK('FBPQ T4'!E67),\" \",'FBPQ T4'!AE67)","v":31541},56142.98,"HV/LV"]
[null,null,"6.6/11 kV Transformer (GM)","Each",{"$f":"IF(ISNUMBER('FBPQ C2'!J68),'FBPQ C2'!J68,IF(ISNUMBER('FBPQ C2'!I68),'FBPQ C2'!I68,\"\"))","v":12.82},"DATA",12.82,{"$f":"IF(ISBLANK('FBPQ T4'!E68),\" \",'FBPQ T4'!AE68)","v":8203},105162.46,"HV/LV"]
[null,null,"20 kV Transformer (PM)","Each",{"$f":"IF(ISNUMBER('FBPQ C2'!J69),'FBPQ C2'!J69,IF(ISNUMBER('FBPQ C2'!I69),'FBPQ C2'!I69,\"\"))","v":""},"DATA"," ",{"$f":"IF(ISBLANK('FBPQ T4'!E69),\" \",'FBPQ T4'!AE69)","v":0}," ","HV/LV"]
[null,null,"20 kV Transformer (GM)","Each",{"$f":"IF(ISNUMBER('FBPQ C2'!J70),'FBPQ C2'!J70,IF(ISNUMBER('FBPQ C2'!I70),'FBPQ C2'!I70,\"\"))","v":""},"DATA"," ",{"$f":"IF(ISBLANK('FBPQ T4'!E70),\" \",'FBPQ T4'!AE70)","v":0}," ","HV/LV"]
[null,null,null,null,{"$f":"IF(ISNUMBER('FBPQ C2'!J71),'FBPQ C2'!J71,IF(ISNUMBER('FBPQ C2'!I71),'FBPQ C2'!I71,\"\"))","v":""},null,0,{"$f":"IF(ISBLANK('FBPQ T4'!E71),\" \",'FBPQ T4'!AE71)","v":" "}," "]
["EHV Network",null,null,null,{"$f":"IF(ISNUMBER('FBPQ C2'!J72),'FBPQ C2'!J72,IF(ISNUMBER('FBPQ C2'!I72),'FBPQ C2'!I72,\"\"))","v":""},null,0,{"$f":"IF(ISBLANK('FBPQ T4'!E72),\" \",'FBPQ T4'!AE72)","v":" "}," "]
[null,"Overhead lines",null,null,{"$f":"IF(ISNUMBER('FBPQ C2'!J73),'FBPQ C2'!J73,IF(ISNUMBER('FBPQ C2'!I73),'FBPQ C2'!I73,\"\"))","v":""},null,0,{"$f":"IF(ISBLANK('FBPQ T4'!E73),\" \",'FBPQ T4'!AE73)","v":" "}," "]
[null,null,"33kV OHL (Pole Line)","km",{"$f":"IF(ISNUMBER('FBPQ C2'!J74),'FBPQ C2'!J74,IF(ISNUMBER('FBPQ C2'!I74),'FBPQ C2'!I74,\"\"))","v":26.88},"DATA",26.88,{"$f":"IF(ISBLANK('FBPQ T4'!E74),\" \",'FBPQ T4'!AE74)","v":1186},31879.68,"EHV"]
[null,null,"33kV OHL (Tower Line)","km",{"$f":"IF(ISNUMBER('FBPQ C2'!J75),'FBPQ C2'!J75,IF(ISNUMBER('FBPQ C2'!I75),'FBPQ C2'!I75,\"\"))","v":33.67},"DATA",33.67,{"$f":"IF(ISBLANK('FBPQ T4'!E75),\" \",'FBPQ T4'!AE75)","v":41},1380.47,"EHV"]
[null,null,"66kV OHL (Pole Line)","km",{"$f":"IF(ISNUMBER('FBPQ C2'!J76),'FBPQ C2'!J76,IF(ISNUMBER('FBPQ C2'!I76),'FBPQ C2'!I76,\"\"))","v":41.55},"DATA",{"$f":"IF(ISNUMBER(E84),E84,IF(H84>0,F84,\" \"))","v":41.55},{"$f":"IF(ISBLANK('FBPQ T4'!E76),\" \",'FBPQ T4'!AE76)","v":329},13669.949999999999,"EHV"]
[null,null,"66kV OHL (Tower Line)","km",{"$f":"IF(ISNUMBER('FBPQ C2'!J77),'FBPQ C2'!J77,IF(ISNUMBER('FBPQ C2'!I77),'FBPQ C2'!I77,\"\"))","v":52.49},"DATA",52.49,{"$f":"IF(ISBLANK('FBPQ T4'!E77),\" \",'FBPQ T4'!AE77)","v":28},{"$f":"IF(ISERROR(G85*H85),\" \",G85*H85)","v":1469.72},"EHV"]
[null,null,null,null,{"$f":"IF(ISNUMBER('FBPQ C2'!J78),'FBPQ C2'!J78,IF(ISNUMBER('FBPQ C2'!I78),'FBPQ C2'!I78,\"\"))","v":""},null,0,{"$f":"IF(ISBLANK('FBPQ T4'!E78),\" \",'FBPQ T4'!AE78)","v":" "}," "]
[null,"Overhead lines - Support",null,null,{"$f":"IF(ISNUMBER('FBPQ C2'!J79),'FBPQ C2'!J79,IF(ISNUMBER('FBPQ C2'!I79),'FBPQ C2'!I79,\"\"))","v":""},null,0,{"$f":"IF(ISBLANK('FBPQ T4'!E79),\" \",'FBPQ T4'!AE79)","v":" "}," "]
[null,null,"33kV Pole","Each",{"$f":"IF(ISNUMBER('FBPQ C2'!J80),'FBPQ C2'!J80,IF(ISNUMBER('FBPQ C2'!I80),'FBPQ C2'!I80,\"\"))","v":2.61},"DATA",2.61,{"$f":"IF(ISBLANK('FBPQ T4'!E80),\" \",'FBPQ T4'!AE80)","v":15324},39995.64,"EHV"]
[null,null,"33kV Tower","Each",{"$f":"IF(ISNUMBER('FBPQ C2'!J81),'FBPQ C2'!J81,IF(ISNUMBER('FBPQ C2'!I81),'FBPQ C2'!I81,\"\"))","v":45.36},"DATA",45.36,{"$f":"IF(ISBLANK('FBPQ T4'!E81),\" \",'FBPQ T4'!AE81)","v":190},8618.4,"EHV"]
[null,null,"66kV Pole","Each",{"$f":"IF(ISNUMBER('FBPQ C2'!J82),'FBPQ C2'!J82,IF(ISNUMBER('FBPQ C2'!I82),'FBPQ C2'!I82,\"\"))","v":3.61},"DATA",3.61,{"$f":"IF(ISBLANK('FBPQ T4'!E82),\" \",'FBPQ T4'!AE82)","v":4318},15587.98,"EHV"]
[null,null,"66kV Tower","Each",{"$f":"IF(ISNUMBER('FBPQ C2'!J83),'FBPQ C2'!J83,IF(ISNUMBER('FBPQ C2'!I83),'FBPQ C2'!I83,\"\"))","v":74.53},"DATA",74.53,{"$f":"IF(ISBLANK('FBPQ T4'!E83),\" \",'FBPQ T4'!AE83)","v":251},18707.03,"EHV"]
[null,null,null,null,{"$f":"IF(ISNUMBER('FBPQ C2'!J84),'FBPQ C2'!J84,IF(ISNUMBER('FBPQ C2'!I84),'FBPQ C2'!I84,\"\"))","v":""},null,0,{"$f":"IF(ISBLANK('FBPQ T4'!E84),\" \",'FBPQ T4'!AE84)","v":" "}," "]
[null,"Underground cables (kms)",null,null,{"$f":"IF(ISNUMBER('FBPQ C2'!J85),'FBPQ C2'!J85,IF(ISNUMBER('FBPQ C2'!I85),'FBPQ C2'!I85,\"\"))","v":""},null,0,{"$f":"IF(ISBLANK('FBPQ T4'!E85),\" \",'FBPQ T4'!AE85)","v":" "}," "]
[null,null,"33kV UG Cable (Non Pressurised)","km",{"$f":"IF(ISNUMBER('FBPQ C2'!J86),'FBPQ C2'!J86,IF(ISNUMBER('FBPQ C2'!I86),'FBPQ C2'!I86,\"\"))","v":173.04},"DATA",173.04,{"$f":"IF(ISBLANK('FBPQ T4'!E86),\" \",'FBPQ T4'!AE86)","v":386.84},66938.79359999999,"EHV"]
[null,null,"33kV UG Cable (Oil)","km",{"$f":"IF(ISNUMBER('FBPQ C2'!J87),'FBPQ C2'!J87,IF(ISNUMBER('FBPQ C2'!I87),'FBPQ C2'!I87,\"\"))","v":152.88999999999999},"DATA",152.88999999999999,{"$f":"IF(ISBLANK('FBPQ T4'!E87),\" \",'FBPQ T4'!AE87)","v":0},0,"EHV"]
[null,null,"33kV UG Cable (Gas)","km",{"$f":"IF(ISNUMBER('FBPQ C2'!J88),'FBPQ C2'!J88,IF(ISNUMBER('FBPQ C2'!I88),'FBPQ C2'!I88,\"\"))","v":173.42},"DATA",173.42,{"$f":"IF(ISBLANK('FBPQ T4'!E88),\" \",'FBPQ T4'!AE88)","v":8.1240000000000006},1408.8640800000001,"EHV"]
[null,null,"66kV UG Cable (Non Pressurised)","km",{"$f":"IF(ISNUMBER('FBPQ C2'!J89),'FBPQ C2'!J89,IF(ISNUMBER('FBPQ C2'!I89),'FBPQ C2'!I89,\"\"))","v":444.45},"DATA",444.45,{"$f":"IF(ISBLANK('FBPQ T4'!E89),\" \",'FBPQ T4'!AE89)","v":6},2666.7,"EHV"]
[null,null,"66kV UG Cable (Oil)","km",{"$f":"IF(ISNUMBER('FBPQ C2'!J90),'FBPQ C2'!J90,IF(ISNUMBER('FBPQ C2'!I90),'FBPQ C2'!I90,\"\"))","v":444.45},"DATA",444.45,{"$f":"IF(ISBLANK('FBPQ T4'!E90),\" \",'FBPQ T4'!AE90)","v":2},888.9,"EHV"]
[null,null,"66kV UG Cable (Gas)","km",{"$f":"IF(ISNUMBER('FBPQ C2'!J91),'FBPQ C2'!J91,IF(ISNUMBER('FBPQ C2'!I91),'FBPQ C2'!I91,\"\"))","v":444.45},"DATA",444.45,{"$f":"IF(ISBLANK('FBPQ T4'!E91),\" \",'FBPQ T4'!AE91)","v":1},444.45,"EHV"]
[null,null,null,null,{"$f":"IF(ISNUMBER('FBPQ C2'!J92),'FBPQ C2'!J92,IF(ISNUMBER('FBPQ C2'!I92),'FBPQ C2'!I92,\"\"))","v":""},null,0,{"$f":"IF(ISBLANK('FBPQ T4'!E92),\" \",'FBPQ T4'!AE92)","v":" "}," "]
[null,"Submarine cables (kms)",null,null,{"$f":"IF(ISNUMBER('FBPQ C2'!J93),'FBPQ C2'!J93,IF(ISNUMBER('FBPQ C2'!I93),'FBPQ C2'!I93,\"\"))","v":""},null,0,{"$f":"IF(ISBLANK('FBPQ T4'!E93),\" \",'FBPQ T4'!AE93)","v":" "}," "]
[null,null,"EHV Sub Cable","km",{"$f":"IF(ISNUMBER('FBPQ C2'!J94),'FBPQ C2'!J94,IF(ISNUMBER('FBPQ C2'!I94),'FBPQ C2'!I94,\"\"))","v":1134.52},"DATA",1134.52,{"$f":"IF(ISBLANK('FBPQ T4'!E94),\" \",'FBPQ T4'!AE94)","v":1.3},1474.876,"EHV"]
[null,null,null,null,{"$f":"IF(ISNUMBER('FBPQ C2'!J95),'FBPQ C2'!J95,IF(ISNUMBER('FBPQ C2'!I95),'FBPQ C2'!I95,\"\"))","v":""},null,0,{"$f":"IF(ISBLANK('FBPQ T4'!E95),\" \",'FBPQ T4'!AE95)","v":" "}," "]
[null,"Switchgear ",null,null,{"$f":"IF(ISNUMBER('FBPQ C2'!J96),'FBPQ C2'!J96,IF(ISNUMBER('FBPQ C2'!I96),'FBPQ C2'!I96,\"\"))","v":""},null,0,{"$f":"IF(ISBLANK('FBPQ T4'!E96),\" \",'FBPQ T4'!AE96)","v":" "}," "]
[null,null,"33 KV CB (ID)","Each",{"$f":"IF(ISNUMBER('FBPQ C2'!J97),'FBPQ C2'!J97,IF(ISNUMBER('FBPQ C2'!I97),'FBPQ C2'!I97,\"\"))","v":66.58},"DATA",66.58,{"$f":"IF(ISBLANK('FBPQ T4'!E97),\" \",'FBPQ T4'!AE97)","v":311},20706.38,"132kV/EHV"]
[null,null,"33 kV CB (OD)","Each",{"$f":"IF(ISNUMBER('FBPQ C2'!J98),'FBPQ C2'!J98,IF(ISNUMBER('FBPQ C2'!I98),'FBPQ C2'!I98,\"\"))","v":51.4},"DATA",51.4,{"$f":"IF(ISBLANK('FBPQ T4'!E98),\" \",'FBPQ T4'!AE98)","v":274},14083.6,"132kV/EHV"]
[null,null,"33 kV Switch (GM)","Each",{"$f":"IF(ISNUMBER('FBPQ C2'!J99),'FBPQ C2'!J99,IF(ISNUMBER('FBPQ C2'!I99),'FBPQ C2'!I99,\"\"))","v":33.17},"DATA",33.17,{"$f":"IF(ISBLANK('FBPQ T4'!E99),\" \",'FBPQ T4'!AE99)","v":16},530.72,"132kV/EHV"]
[null,null,"33 kV Switch (PM)","Each",{"$f":"IF(ISNUMBER('FBPQ C2'!J100),'FBPQ C2'!J100,IF(ISNUMBER('FBPQ C2'!I100),'FBPQ C2'!I100,\"\"))","v":""},"DATA"," ",{"$f":"IF(ISBLANK('FBPQ T4'!E100),\" \",'FBPQ T4'!AE100)","v":0}," ","132kV/EHV"]
[null,null,"33 kV RMU","Each",{"$f":"IF(ISNUMBER('FBPQ C2'!J101),'FBPQ C2'!J101,IF(ISNUMBER('FBPQ C2'!I101),'FBPQ C2'!I101,\"\"))","v":""},"DATA"," ",{"$f":"IF(ISBLANK('FBPQ T4'!E101),\" \",'FBPQ T4'!AE101)","v":0}," ","132kV/EHV"]
[null,null,"33 kV Switchgear - Other","Each",{"$f":"IF(ISNUMBER('FBPQ C2'!J102),'FBPQ C2'!J102,IF(ISNUMBER('FBPQ C2'!I102),'FBPQ C2'!I102,\"\"))","v":""},"DATA","DATA",{"$f":"IF(ISBLANK('FBPQ T4'!E102),\" \",'FBPQ T4'!AE102)","v":1074}," ","EHV/HV"]
[null,null,"66 KV CB (ID & OD)","Each",{"$f":"IF(ISNUMBER('FBPQ C2'!J103),'FBPQ C2'!J103,IF(ISNUMBER('FBPQ C2'!I103),'FBPQ C2'!I103,\"\"))","v":88.11},"DATA",88.11,{"$f":"IF(ISBLANK('FBPQ T4'!E103),\" \",'FBPQ T4'!AE103)","v":53},4669.83,"132kV/EHV"]
[null,null,"66 KV Switchgear - Other","Each",{"$f":"IF(ISNUMBER('FBPQ C2'!J104),'FBPQ C2'!J104,IF(ISNUMBER('FBPQ C2'!I104),'FBPQ C2'!I104,\"\"))","v":""},"DATA","DATA",{"$f":"IF(ISBLANK('FBPQ T4'!E104),\" \",'FBPQ T4'!AE104)","v":233}," ","EHV/HV"]
[null,null,null,null,{"$f":"IF(ISNUMBER('FBPQ C2'!J105),'FBPQ C2'!J105,IF(ISNUMBER('FBPQ C2'!I105),'FBPQ C2'!I105,\"\"))","v":""},null,0,{"$f":"IF(ISBLANK('FBPQ T4'!E105),\" \",'FBPQ T4'!AE105)","v":" "}," "]
[null,"Transformers  ",null,null,{"$f":"IF(ISNUMBER('FBPQ C2'!J106),'FBPQ C2'!J106,IF(ISNUMBER('FBPQ C2'!I106),'FBPQ C2'!I106,\"\"))","v":""},null,0,{"$f":"IF(ISBLANK('FBPQ T4'!E106),\" \",'FBPQ T4'!AE106)","v":" "}," "]
[null,null,"33 kV Transformer (PM)","Each",{"$f":"IF(ISNUMBER('FBPQ C2'!J107),'FBPQ C2'!J107,IF(ISNUMBER('FBPQ C2'!I107),'FBPQ C2'!I107,\"\"))","v":""},"DATA"," ",{"$f":"IF(ISBLANK('FBPQ T4'!E107),\" \",'FBPQ T4'!AE107)","v":0}," ","EHV/HV"]
[null,null,"33 kV Transformer (GM)","Each",{"$f":"IF(ISNUMBER('FBPQ C2'!J108),'FBPQ C2'!J108,IF(ISNUMBER('FBPQ C2'!I108),'FBPQ C2'!I108,\"\"))","v":262.73},"DATA",{"$f":"IF(ISNUMBER(E116),E116,IF(H116>0,F116,\" \"))","v":262.73},{"$f":"IF(ISBLANK('FBPQ T4'!E108),\" \",'FBPQ T4'!AE108)","v":247},64894.310000000005,"EHV/HV"]
[null,null,"33 kV AuxiliaryTransfomer","Each",{"$f":"IF(ISNUMBER('FBPQ C2'!J109),'FBPQ C2'!J109,IF(ISNUMBER('FBPQ C2'!I109),'FBPQ C2'!I109,\"\"))","v":""},"DATA","DATA",{"$f":"IF(ISBLANK('FBPQ T4'!E109),\" \",'FBPQ T4'!AE109)","v":244}," ","EHV/HV"]
[null,null,"66 kV Transformer","Each",{"$f":"IF(ISNUMBER('FBPQ C2'!J110),'FBPQ C2'!J110,IF(ISNUMBER('FBPQ C2'!I110),'FBPQ C2'!I110,\"\"))","v":457.92},"DATA",457.92,{"$f":"IF(ISBLANK('FBPQ T4'!E110),\" \",'FBPQ T4'!AE110)","v":30},13737.6,"EHV/HV"]
[null,null,"66 kV AuxiliaryTransfomer","Each",{"$f":"IF(ISNUMBER('FBPQ C2'!J111),'FBPQ C2'!J111,IF(ISNUMBER('FBPQ C2'!I111),'FBPQ C2'!I111,\"\"))","v":""},"DATA"," ",{"$f":"IF(ISBLANK('FBPQ T4'!E111),\" \",'FBPQ T4'!AE111)","v":0}," ","EHV/HV"]
[null,null,null,null,{"$f":"IF(ISNUMBER('FBPQ C2'!J112),'FBPQ C2'!J112,IF(ISNUMBER('FBPQ C2'!I112),'FBPQ C2'!I112,\"\"))","v":""},null,0,{"$f":"IF(ISBLANK('FBPQ T4'!E112),\" \",'FBPQ T4'!AE112)","v":" "}," "]
["132kV Network",null,null,null,{"$f":"IF(ISNUMBER('FBPQ C2'!J113),'FBPQ C2'!J113,IF(ISNUMBER('FBPQ C2'!I113),'FBPQ C2'!I113,\"\"))","v":""},null,0,{"$f":"IF(ISBLANK('FBPQ T4'!E113),\" \",'FBPQ T4'!AE113)","v":" "}," "]
[null,"Overhead lines",null,null,{"$f":"IF(ISNUMBER('FBPQ C2'!J114),'FBPQ C2'!J114,IF(ISNUMBER('FBPQ C2'!I114),'FBPQ C2'!I114,\"\"))","v":""},null,0,{"$f":"IF(ISBLANK('FBPQ T4'!E114),\" \",'FBPQ T4'!AE114)","v":" "}," "]
[null,null,"132kV OHL Conductor (Pole Line)","km",{"$f":"IF(ISNUMBER('FBPQ C2'!J115),'FBPQ C2'!J115,IF(ISNUMBER('FBPQ C2'!I115),'FBPQ C2'!I115,\"\"))","v":52.85},"DATA",52.85,{"$f":"IF(ISBLANK('FBPQ T4'!E115),\" \",'FBPQ T4'!AE115)","v":91},4809.3500000000004,"132kV"]
[null,null,"132kV OHL Conductor (Tower Line)","km",{"$f":"IF(ISNUMBER('FBPQ C2'!J116),'FBPQ C2'!J116,IF(ISNUMBER('FBPQ C2'!I116),'FBPQ C2'!I116,\"\"))","v":53.51},"DATA",53.51,{"$f":"IF(ISBLANK('FBPQ T4'!E116),\" \",'FBPQ T4'!AE116)","v":1089},58272.39,"132kV"]
[null,null,null,null,{"$f":"IF(ISNUMBER('FBPQ C2'!J117),'FBPQ C2'!J117,IF(ISNUMBER('FBPQ C2'!I117),'FBPQ C2'!I117,\"\"))","v":""},null,0,{"$f":"IF(ISBLANK('FBPQ T4'!E117),\" \",'FBPQ T4'!AE117)","v":" "}," "]
[null,"Overhead lines - Support",null,null,{"$f":"IF(ISNUMBER('FBPQ C2'!J118),'FBPQ C2'!J118,IF(ISNUMBER('FBPQ C2'!I118),'FBPQ C2'!I118,\"\"))","v":""},null,0,{"$f":"IF(ISBLANK('FBPQ T4'!E118),\" \",'FBPQ T4'!AE118)","v":" "}," "]
[null,null,"132kV Pole","Each",{"$f":"IF(ISNUMBER('FBPQ C2'!J119),'FBPQ C2'!J119,IF(ISNUMBER('FBPQ C2'!I119),'FBPQ C2'!I119,\"\"))","v":3.64},"DATA",3.64,{"$f":"IF(ISBLANK('FBPQ T4'!E119),\" \",'FBPQ T4'!AE119)","v":835},3039.4,"132kV"]
[null,null,"132kV Tower","Each",{"$f":"IF(ISNUMBER('FBPQ C2'!J120),'FBPQ C2'!J120,IF(ISNUMBER('FBPQ C2'!I120),'FBPQ C2'!I120,\"\"))","v":98.62},"DATA",98.62,{"$f":"IF(ISBLANK('FBPQ T4'!E120),\" \",'FBPQ T4'!AE120)","v":2354},232151.48,"132kV"]
[null,null,"132kV Fittings (Tower Line)","Each",{"$f":"IF(ISNUMBER('FBPQ C2'!J121),'FBPQ C2'!J121,IF(ISNUMBER('FBPQ C2'!I121),'FBPQ C2'!I121,\"\"))","v":3.8},"DATA",3.8,{"$f":"IF(ISBLANK('FBPQ T4'!E121),\" \",'FBPQ T4'!AE121)","v":4708},17890.399999999998,"132kV"]
[null,null,null,null,{"$f":"IF(ISNUMBER('FBPQ C2'!J122),'FBPQ C2'!J122,IF(ISNUMBER('FBPQ C2'!I122),'FBPQ C2'!I122,\"\"))","v":""},null,0,{"$f":"IF(ISBLANK('FBPQ T4'!E122),\" \",'FBPQ T4'!AE122)","v":" "}," "]
[null,"Underground cables (kms)",null,null,{"$f":"IF(ISNUMBER('FBPQ C2'!J123),'FBPQ C2'!J123,IF(ISNUMBER('FBPQ C2'!I123),'FBPQ C2'!I123,\"\"))","v":""},null,0,{"$f":"IF(ISBLANK('FBPQ T4'!E123),\" \",'FBPQ T4'!AE123)","v":" "}," "]
[null,null,"132kV UG Cable (Non Pressurised)","km",{"$f":"IF(ISNUMBER('FBPQ C2'!J124),'FBPQ C2'!J124,IF(ISNUMBER('FBPQ C2'!I124),'FBPQ C2'!I124,\"\"))","v":0},"DATA",0,{"$f":"IF(ISBLANK('FBPQ T4'!E124),\" \",'FBPQ T4'!AE124)","v":35.4},0,"132kV"]
[null,null,"132kV UG Cable (Oil)","km",{"$f":"IF(ISNUMBER('FBPQ C2'!J125),'FBPQ C2'!J125,IF(ISNUMBER('FBPQ C2'!I125),'FBPQ C2'!I125,\"\"))","v":1323.44},"DATA",1323.44,{"$f":"IF(ISBLANK('FBPQ T4'!E125),\" \",'FBPQ T4'!AE125)","v":58},76759.520000000004,"132kV"]
[null,null,"132kV UG Cable (Gas)","km",{"$f":"IF(ISNUMBER('FBPQ C2'!J126),'FBPQ C2'!J126,IF(ISNUMBER('FBPQ C2'!I126),'FBPQ C2'!I126,\"\"))","v":""},"DATA"," ",{"$f":"IF(ISBLANK('FBPQ T4'!E126),\" \",'FBPQ T4'!AE126)","v":0}," ","132kV"]
[null,null,null,null,{"$f":"IF(ISNUMBER('FBPQ C2'!J127),'FBPQ C2'!J127,IF(ISNUMBER('FBPQ C2'!I127),'FBPQ C2'!I127,\"\"))","v":""},null,0,{"$f":"IF(ISBLANK('FBPQ T4'!E127),\" \",'FBPQ T4'!AE127)","v":" "}," "]
[null,"Submarine cables (kms)",null,null,{"$f":"IF(ISNUMBER('FBPQ C2'!J128),'FBPQ C2'!J128,IF(ISNUMBER('FBPQ C2'!I128),'FBPQ C2'!I128,\"\"))","v":""},null,0,{"$f":"IF(ISBLANK('FBPQ T4'!E128),\" \",'FBPQ T4'!AE128)","v":" "}," "]
[null,null,"132 kV Sub Cable","km",{"$f":"IF(ISNUMBER('FBPQ C2'!J129),'FBPQ C2'!J129,IF(ISNUMBER('FBPQ C2'!I129),'FBPQ C2'!I129,\"\"))","v":""},"DATA"," ",{"$f":"IF(ISBLANK('FBPQ T4'!E129),\" \",'FBPQ T4'!AE129)","v":0}," ","132kV"]
[null,null,null,null,{"$f":"IF(ISNUMBER('FBPQ C2'!J130),'FBPQ C2'!J130,IF(ISNUMBER('FBPQ C2'!I130),'FBPQ C2'!I130,\"\"))","v":""},null,0,{"$f":"IF(ISBLANK('FBPQ T4'!E130),\" \",'FBPQ T4'!AE130)","v":" "}," "]
[null,"Switchgear ",null,null,{"$f":"IF(ISNUMBER('FBPQ C2'!J131),'FBPQ C2'!J131,IF(ISNUMBER('FBPQ C2'!I131),'FBPQ C2'!I131,\"\"))","v":""},null,0,{"$f":"IF(ISBLANK('FBPQ T4'!E131),\" \",'FBPQ T4'!AE131)","v":" "}," "]
[null,null,"132 kV CB (ID & OD)","Each",{"$f":"IF(ISNUMBER('FBPQ C2'!J132),'FBPQ C2'!J132,IF(ISNUMBER('FBPQ C2'!I132),'FBPQ C2'!I132,\"\"))","v":146.88},"DATA",146.88,{"$f":"IF(ISBLANK('FBPQ T4'!E132),\" \",'FBPQ T4'!AE132)","v":222},32607.360000000001,"132kV"]
[null,null,"132 kV Switchgear (other)","Each",{"$f":"IF(ISNUMBER('FBPQ C2'!J133),'FBPQ C2'!J133,IF(ISNUMBER('FBPQ C2'!I133),'FBPQ C2'!I133,\"\"))","v":""},"DATA","DATA",{"$f":"IF(ISBLANK('FBPQ T4'!E133),\" \",'FBPQ T4'!AE133)","v":727}," ","132kV"]
[null,null,null,null,{"$f":"IF(ISNUMBER('FBPQ C2'!J134),'FBPQ C2'!J134,IF(ISNUMBER('FBPQ C2'!I134),'FBPQ C2'!I134,\"\"))","v":""},null,0,{"$f":"IF(ISBLANK('FBPQ T4'!E134),\" \",'FBPQ T4'!AE134)","v":" "}," "]
[null,"Transformers  ",null,null,{"$f":"IF(ISNUMBER('FBPQ C2'!J135),'FBPQ C2'!J135,IF(ISNUMBER('FBPQ C2'!I135),'FBPQ C2'!I135,\"\"))","v":""},null,0,{"$f":"IF(ISBLANK('FBPQ T4'!E135),\" \",'FBPQ T4'!AE135)","v":" "}," "]
[null,null,"132 kV Transformer","Each",{"$f":"IF(ISNUMBER('FBPQ C2'!J136),'FBPQ C2'!J136,IF(ISNUMBER('FBPQ C2'!I136),'FBPQ C2'!I136,\"\"))","v":1139.95},"DATA",1139.95,{"$f":"IF(ISBLANK('FBPQ T4'!E136),\" \",'FBPQ T4'!AE136)","v":131},149333.45000000001,"132kV/EHV"]
[null,null,"132 kV AuxiliaryTransfomer","Each",{"$f":"IF(ISNUMBER('FBPQ C2'!J137),'FBPQ C2'!J137,IF(ISNUMBER('FBPQ C2'!I137),'FBPQ C2'!I137,\"\"))","v":""},"DATA","DATA",{"$f":"IF(ISBLANK('FBPQ T4'!E137),\" \",'FBPQ T4'!AE137)","v":140}," ","132kV/EHV"]
[null,null,null,null,{"$f":"IF(ISNUMBER('FBPQ C2'!J138),'FBPQ C2'!J138,IF(ISNUMBER('FBPQ C2'!I138),'FBPQ C2'!I138,\"\"))","v":""},null,0,{"$f":"IF(ISBLANK('FBPQ T4'!E138),\" \",'FBPQ T4'!AE138)","v":" "}," "]
["Tele-control / SCADA",null,null,null,{"$f":"IF(ISNUMBER('FBPQ C2'!J139),'FBPQ C2'!J139,IF(ISNUMBER('FBPQ C2'!I139),'FBPQ C2'!I139,\"\"))","v":""},null,0,{"$f":"IF(ISBLANK('FBPQ T4'!E139),\" \",'FBPQ T4'!AE139)","v":" "}," "]
[null,"Primary substation",null,null,{"$f":"IF(ISNUMBER('FBPQ C2'!J140),'FBPQ C2'!J140,IF(ISNUMBER('FBPQ C2'!I140),'FBPQ C2'!I140,\"\"))","v":""},null,{"$f":"IF(ISNUMBER(E148),E148,IF(H148>0,F148,\" \"))","v":0},{"$f":"IF(ISBLANK('FBPQ T4'!E140),\" \",'FBPQ T4'!AE140)","v":" "}," "]
[null,null,"132 kV/EHV RTU (PM)","Each",{"$f":"IF(ISNUMBER('FBPQ C2'!J141),'FBPQ C2'!J141,IF(ISNUMBER('FBPQ C2'!I141),'FBPQ C2'!I141,\"\"))","v":""},"DATA","DATA",{"$f":"IF(ISBLANK('FBPQ T4'!E141),\" \",'FBPQ T4'!AE141)","v":1},{"$f":"IF(ISERROR(G149*H149),\" \",G149*H149)","v":" "},"EHV/HV"]
[null,null,"132 kV/EHV RTU (GM)","Each",{"$f":"IF(ISNUMBER('FBPQ C2'!J142),'FBPQ C2'!J142,IF(ISNUMBER('FBPQ C2'!I142),'FBPQ C2'!I142,\"\"))","v":""},"DATA","DATA",{"$f":"IF(ISBLANK('FBPQ T4'!E142),\" \",'FBPQ T4'!AE142)","v":272}," ","EHV/HV"]
[null,null,null,null,{"$f":"IF(ISNUMBER('FBPQ C2'!J143),'FBPQ C2'!J143,IF(ISNUMBER('FBPQ C2'!I143),'FBPQ C2'!I143,\"\"))","v":""},null,0,{"$f":"IF(ISBLANK('FBPQ T4'!E143),\" \",'FBPQ T4'!AE143)","v":" "}," "]
[null,"Secondary substation",null,null,{"$f":"IF(ISNUMBER('FBPQ C2'!J144),'FBPQ C2'!J144,IF(ISNUMBER('FBPQ C2'!I144),'FBPQ C2'!I144,\"\"))","v":""},null,0,{"$f":"IF(ISBLANK('FBPQ T4'!E144),\" \",'FBPQ T4'!AE144)","v":" "}," "]
[null,null,"HV RTU (PM)","Each",{"$f":"IF(ISNUMBER('FBPQ C2'!J145),'FBPQ C2'!J145,IF(ISNUMBER('FBPQ C2'!I145),'FBPQ C2'!I145,\"\"))","v":""},"DATA","DATA",{"$f":"IF(ISBLANK('FBPQ T4'!E145),\" \",'FBPQ T4'!AE145)","v":1246},{"$f":"IF(ISERROR(G153*H153),\" \",G153*H153)","v":" "},"HV/LV"]
[null,null,"HV RTU (GM)","Each",{"$f":"IF(ISNUMBER('FBPQ C2'!J146),'FBPQ C2'!J146,IF(ISNUMBER('FBPQ C2'!I146),'FBPQ C2'!I146,\"\"))","v":""},"DATA","DATA",{"$f":"IF(ISBLANK('FBPQ T4'!E146),\" \",'FBPQ T4'!AE146)","v":143}," ","HV/LV"]
[null,null,null,null,{"$f":"IF(ISNUMBER('FBPQ C2'!J147),'FBPQ C2'!J147,IF(ISNUMBER('FBPQ C2'!I147),'FBPQ C2'!I147,\"\"))","v":""},null,0,{"$f":"IF(ISBLANK('FBPQ T4'!E147),\" \",'FBPQ T4'!AE147)","v":" "}," "]
[null,null,null,null,{"$f":"IF(ISNUMBER('FBPQ C2'!J148),'FBPQ C2'!J148,IF(ISNUMBER('FBPQ C2'!I148),'FBPQ C2'!I148,\"\"))","v":""},null,0,{"$f":"IF(ISBLANK('FBPQ T4'!E148),\" \",'FBPQ T4'!AE148)","v":" "}," "]
["HV network switchgear",null,null,null,{"$f":"IF(ISNUMBER('FBPQ C2'!J149),'FBPQ C2'!J149,IF(ISNUMBER('FBPQ C2'!I149),'FBPQ C2'!I149,\"\"))","v":""},null,0,{"$f":"IF(ISBLANK('FBPQ T4'!E149),\" \",'FBPQ T4'!AE149)","v":" "}," "]
[null,null,"6.6/11 kV CB (GM)",null,{"$f":"IF(ISNUMBER('FBPQ C2'!J150),'FBPQ C2'!J150,IF(ISNUMBER('FBPQ C2'!I150),'FBPQ C2'!I150,\"\"))","v":""},null,0,{"$f":"IF(ISBLANK('FBPQ T4'!E150),\" \",'FBPQ T4'!AE150)","v":" "}," "]
[null,null,"Primary","Each",{"$f":"IF(ISNUMBER('FBPQ C2'!J151),'FBPQ C2'!J151,IF(ISNUMBER('FBPQ C2'!I151),'FBPQ C2'!I151,\"\"))","v":24.52},"DATA",24.52,{"$f":"IF(ISBLANK('FBPQ T4'!E151),\" \",'FBPQ T4'!AE151)","v":" "}," "]
[null,null,"Distribution","Each",{"$f":"IF(ISNUMBER('FBPQ C2'!J152),'FBPQ C2'!J152,IF(ISNUMBER('FBPQ C2'!I152),'FBPQ C2'!I152,\"\"))","v":24.52},"DATA",24.52,{"$f":"IF(ISBLANK('FBPQ T4'!E152),\" \",'FBPQ T4'!AE152)","v":" "}," "]
[null,null,"20 kV Switch (GM)",null,{"$f":"IF(ISNUMBER('FBPQ C2'!J153),'FBPQ C2'!J153,IF(ISNUMBER('FBPQ C2'!I153),'FBPQ C2'!I153,\"\"))","v":""},"DATA","DATA",{"$f":"IF(ISBLANK('FBPQ T4'!E153),\" \",'FBPQ T4'!AE153)","v":" "}," "]
[null,null,"Primary","Each",{"$f":"IF(ISNUMBER('FBPQ C2'!J154),'FBPQ C2'!J154,IF(ISNUMBER('FBPQ C2'!I154),'FBPQ C2'!I154,\"\"))","v":""},"DATA","DATA",{"$f":"IF(ISBLANK('FBPQ T4'!E154),\" \",'FBPQ T4'!AE154)","v":" "}," "]
[null,null,"Distribution","Each",{"$f":"IF(ISNUMBER('FBPQ C2'!J155),'FBPQ C2'!J155,IF(ISNUMBER('FBPQ C2'!I155),'FBPQ C2'!I155,\"\"))","v":""},"DATA","DATA",{"$f":"IF(ISBLANK('FBPQ T4'!E155),\" \",'FBPQ T4'!AE155)","v":" "}," "]
[null,null,null,null,null,null,null,"Total MEAV",{"$f":"SUM(I18:I163)","v":4072889.7504800013}]

{"sheet":"Calc-Net capex","index":9,"n_rows":55,"n_cols":15,"rows_kept":55,"cut":false,"hidden":false,"merged":[[24,1,24,2],[16,4,16,5],[45,1,45,2],[46,1,46,2],[25,1,25,2],[36,4,36,5],[46,4,46,5],[35,1,35,2],[35,4,35,5],[36,1,36,2],[25,4,25,5],[45,4,45,5],[3,1,3,3],[2,1,2,3],[15,4,15,5],[15,1,15,2],[16,1,16,2],[46,7,46,8],[36,7,36,8],[2,9,2,11],[2,13,2,15],[3,9,3,11],[3,13,3,15],[45,7,45,8],[2,5,2,7],[3,5,3,7],[16,7,16,8],[15,7,15,8],[24,4,24,5],[35,7,35,8]]}
["Total Net Capex",null,null,null,null,"Index"]
[]
[null,"Total Net Capex 2005/06 -2014/15 LV, HV, EHV, 132kV split",null,null,null,"Total Net Capex 2005/06 -2014/15 LV, LV/HV, HV, EHV, 132kV split",null,null,null,"IP Appendix 6 Table 5 Reductions to EHV",null,null,null,"IP Appendix 7 Reductions to EHV"]
[null,"Sum connecions/reinforcement/replacement capex -see below",null,null,null,"Sum connecions/reinforcement/replacement capex -see below",null,null,null,"Appendix 6 Table 5 EHV & 132",null,null,null,"Appendix 7 Table 18"]
[null,null,"£m","% of Total",null,null,"£m","% of Total",null,"EHV",null,{"$f":"K5*(F21/(F21+F22))","v":0},null,null,"£m"]
[null,"LV",{"$f":"C19+F19+I19+C28+F28-O6","v":49.299918108546755},{"$f":"C6/SUM($C$6:$C$9)","v":0.18558934458027707},null,"LV",{"$f":"+C39+F39+I39+C49+F49-O6","v":49.299918108546755},{"$f":"G6/SUM($G$6:$G$10)","v":0.18558934458027709},null,"132kV",null,{"$f":"K5*(F22/(F21+F22))","v":0},null,"LV"]
[null,"HV",{"$f":"C20+F20+I20+C29+F29-O7-O8","v":116.13270531521633},{"$f":"C7/SUM($C$6:$C$9)","v":0.43718110477041494},null,"LV/HV",{"$f":"+C40+F40+I40+C50+F50-O7","v":23.067824613711821},{"$f":"G7/SUM($G$6:$G$10)","v":8.6838733515246375E-2},null,null,null,null,null,"LV/HV"]
[null,"EHV",{"$f":"C21+F21+I21+C30+F30-L5-O9","v":58.049577218071228},{"$f":"C8/SUM($C$6:$C$9)","v":0.21852740131015191},null,"HV",{"$f":"+C41+F41+I41+C51+F51-O8","v":93.064880701504492},{"$f":"G8/SUM($G$6:$G$10)","v":0.35034237125516859},null,null,null,null,null,"HV"]
[null,"132 kV",{"$f":"C22+F22+I22+C31+F31-L6-O10","v":42.157608691195435},{"$f":"C9/SUM($C$6:$C$9)","v":0.15870214933915608},null,"EHV",{"$f":"+C42+F42+I42+C52+F52-L5-O9","v":58.049577218071228},{"$f":"G9/SUM($G$6:$G$10)","v":0.21852740131015197},null,null,null,null,null,"EHV"]
[null,null,null,null,null,"132 kV",{"$f":"+C43+F43+I43+C53+F53-L6-O10","v":42.157608691195435},{"$f":"G10/SUM($G$6:$G$10)","v":0.15870214933915611},null,null,null,null,null,"132 kV"]
[]
[]
["Connection/Reinforcement/Replacement Capex LV, HV, EHV, 132kV split"]
[]
[]
[null,"Connections Capex 2005/06 -2014/15 (£m)",null,null,"General reinforcement Capex 2005/06 -2014/15 (£m)",null,null,"Fault reinforcement Capex 2005/06 -2014/15 (£m)"]
[null,"Connections spend minus customer contributions (from FBPQ LR1)",null,null,"(from FBPQ LR4)",null,null,"(from FBPQ LR6)"]
[]
["c32","LV",3.0999999999999943,null,"LV",{"$f":"SUM('FBPQ LR4'!D11:M11)","v":1.8999999999999997},null,"LV",{"$f":"SUM('FBPQ LR6'!C28:L28)","v":0}]
["c33","HV",1.1999999999999993,null,"HV",{"$f":"SUM('FBPQ LR4'!D12:M12)","v":12.600000000000003},null,"HV",{"$f":"SUM('FBPQ LR6'!C29:L29)","v":0}]
["c34","EHV",1.5500000000000016,null,"EHV",{"$f":"SUM('FBPQ LR4'!D13:M13)","v":17.700000000000003},null,"EHV",{"$f":"SUM('FBPQ LR6'!C30:L30)","v":0.7}]
["c35","132 kV",0,null,"132 kV",{"$f":"SUM('FBPQ LR4'!D14:M14)","v":9.3000000000000007},null,"132 kV",{"$f":"SUM('FBPQ LR6'!C31:L31)","v":0}]
[]
[]
[null,"Replacement Capex 2005/06 -2014/15 (£m)",null,null,"ESQCR 2005/06 -2014/15 (£m)"]
[null," (from FBPQ NL1)",null,null,"(from FBPQ NL9)"]
[]
[null,"LV",{"$f":"SUM('FBPQ NL1 0309'!D10:M16)","v":44.299918108546763},null,"LV",{"$f":"SUM('NL9 - Legal & Safety'!D33:M33,'NL9 - Legal & Safety'!D42:M42)","v":0}]
[null,"HV",{"$f":"SUM('FBPQ NL1 0309'!D17:M22)","v":102.33270531521633},null,"HV",{"$f":"SUM('NL9 - Legal & Safety'!D34:M34,'NL9 - Legal & Safety'!D43:M43)","v":0}]
[null,"EHV",{"$f":"SUM('FBPQ NL1 0309'!D23:M28)","v":38.099577218071225},null,"EHV",{"$f":"SUM('NL9 - Legal & Safety'!D35:M35,'NL9 - Legal & Safety'!D44:M44)","v":0}]
[null,"132 kV",{"$f":"SUM('FBPQ NL1 0309'!D29:M34)","v":32.857608691195438},null,"132 kV",{"$f":"SUM('NL9 - Legal & Safety'!D36:M36,'NL9 - Legal & Safety'!D45:M45)","v":0}]
[]
["Connection/Reinforcement/Replacement Capex LV, LV/HV, HV, EHV, 132kV split"]
[]
[]
[null,"Connections Capex 2005/06 -2014/15 (£m)",null,null,"General reinforcement Capex 2005/06 -2014/15 (£m)",null,null,"Fault reinforcement Capex 2005/06 -2014/15 (£m)"]
[null,"Connections spend minus customer contributions (from FBPQ LR1)",null,null,"(from FBPQ LR4)",null,null,"(from FBPQ LR6)"]
[]
["c20","LV",3.0999999999999943,null,"LV",{"$f":"SUM('FBPQ LR4'!D11:M11)","v":1.8999999999999997},null,"LV",{"$f":"SUM('FBPQ LR6'!C28:L28)","v":0}]
["c21","LV/HV",0.28724606794854218,"allocated in proportion to repex","LV/HV",{"$f":"SUM('FBPQ LR4'!D12:M12)*(C55)","v":3.0160837134596958},"allocated in proportion to repex","LV/HV",{"$f":"SUM('FBPQ LR6'!C29:L29)*(C55)","v":0},"allocated in proportion to repex"]
["c22","HV",0.91275393205145705,null,"HV",{"$f":"SUM('FBPQ LR4'!D12:M12)*(1-C55)","v":9.5839162865403082},null,"HV",{"$f":"SUM('FBPQ LR6'!C29:L29)*(1-C55)","v":0}]
["c23","EHV",1.5500000000000016,null,"EHV",{"$f":"SUM('FBPQ LR4'!D13:M13)","v":17.700000000000003},null,"EHV",{"$f":"SUM('FBPQ LR6'!C30:L30)","v":0.7}]
["c24","132 kV",0,null,"132 kV",{"$f":"SUM('FBPQ LR4'!D14:M14)","v":9.3000000000000007},null,"132 kV",{"$f":"SUM('FBPQ LR6'!C31:L31)","v":0}]
[]
[]
[null,"Replacement Capex 2005/06 -2014/15 (£m)",null,null,"ESQCR 2005/06 -2014/15 (£m)",null,null,"ESQCR 2005/06 -2014/15 (£m)"]
[null," (from FBPQ NL1)",null,null,"(from FBPQ NL9)",null,null,"NL1 + NL9"]
[]
[null,"LV",{"$f":"SUM('FBPQ NL1 0309'!D10:M16)","v":44.299918108546763},null,"LV",{"$f":"SUM('NL9 - Legal & Safety'!D33:M33,'NL9 - Legal & Safety'!D42:M42)","v":0},null,"LV",{"$f":"F49+C49","v":44.299918108546763}]
[null,"LV/HV",{"$f":"SUM('FBPQ NL1 0309'!D21:M22)","v":19.764494832303583},"HV/LV sub/trans costs","LV/HV",{"$f":"SUM('NL9 - Legal & Safety'!D34:M34,'NL9 - Legal & Safety'!D43:M43)*C55","v":0},null,"LV/HV",{"$f":"F50+C50","v":19.764494832303583}]
[null,"HV",{"$f":"SUM('FBPQ NL1 0309'!D17:M20)","v":82.568210482912733},null,"HV",{"$f":"SUM('NL9 - Legal & Safety'!D34:M34,'NL9 - Legal & Safety'!D43:M43)*(1-C55)","v":0},null,"HV",{"$f":"F51+C51","v":82.568210482912733}]
[null,"EHV",{"$f":"SUM('FBPQ NL1 0309'!D23:M28)","v":38.099577218071225},null,"EHV",{"$f":"SUM('NL9 - Legal & Safety'!D35:M35,'NL9 - Legal & Safety'!D44:M44)","v":0},null,"EHV",{"$f":"F52+C52","v":38.099577218071225}]
[null,"132 kV",{"$f":"SUM('FBPQ NL1 0309'!D29:M34)","v":32.857608691195438},null,"132 kV",{"$f":"SUM('NL9 - Legal & Safety'!D36:M36,'NL9 - Legal & Safety'!D45:M45)","v":0},null,"132 kV",{"$f":"F53+C53","v":32.857608691195438}]
[]
[null,"LV/HV/(LV/HV+HV) %",{"$f":"C50/C51","v":0.23937172329045198}]

{"sheet":"Summary of revenue","index":10,"n_rows":49,"n_cols":12,"rows_kept":49,"cut":false,"hidden":false,"merged":[[46,1,46,4],[31,1,31,4],[33,1,33,4],[37,1,37,4],[38,1,38,4],[44,1,44,4],[45,1,45,4],[29,1,29,4],[10,1,10,4],[11,1,11,4],[12,1,12,4],[13,1,13,4],[15,1,15,4],[17,1,17,4],[18,1,18,4],[20,1,20,4],[25,1,25,4],[26,1,26,4],[27,1,27,4]]}
[null,null,"Summary of Revenue",null,null,null,null,null,null,"Index"]
[]
[]
[]
[]
[]
[]
["Allowed Demand Revenue (ADt)",null,null,null,null,null,null,"2005/06","2006/07","2007/08","2008/09","2009/10"]
[null,null,null,null,null,null,null,16,17,18,19,20]
[]
[null,"Base Demand Revenue  (BRt)",null,null,null,"£m",null,155.30000000000001,158.46221499999999,164.61900800000001,7.529388,{"$error":"#DIV/0!"}]
[null,"Pass through Items (PTt)",null,null,null,"£m",null,2.4392900000000002,0.36506899999999998,-0.91199699999999995,-17.267285000000001,-17.267285000000001]
[null,"Incentive Revenue (Ipt)",null,null,null,"£m",null,3.081448,-1.9054739999999999,2.5028890000000001,0,0]
[null,"Correction Factor (KDt)",null,null,null,"£m",null,0.58791199999999999,1.2090430000000001,4.7731960000000004,2.5712950000000001,12.493830000000001]
[]
[null,"Allowed Demand Revenue (Adt)",null,null,null,"£m",null,160.23282599999999,155.71276700000001,161.43670399999999,-12.309191999999999,{"$error":"#DIV/0!"}]
[]
[null,"Regulated Demand Revenue (RDt)",null,null,null,"£m",null,161.37,160.11000000000001,163.97,0,0]
[null,"Net Movement on Revenue Provisions",null,null,null,"£m",null,0,0,0,0,0]
[]
[null,"Over/Under Recovery",null,null,null,"£m",null,1.1371739999999999,4.3972329999999999,2.533296,12.309191999999999,{"$error":"#DIV/0!"}]
[]
[]
["Allowed Network Generation Revenue (AGt)"]
[]
[null,"Incentivised Generation (IGt)",null,null,null,"£m",null,0,1.5387E-2,2.3938999999999998E-2,0,0]
[null,"Registered Power Zones (RPZt)",null,null,null,"£m",null,0,0,0,0,0]
[null,"Correction Factor (KGt)",null,null,null,"£m",null,0,0,-5.8479999999999999E-3,-8.0984E-2,-8.2198999999999994E-2]
[]
[null,"Allowed Network Generation Revenue (AGt)",null,null,null,"£m",null,0,1.5387E-2,2.9787000000000001E-2,8.0984E-2,8.2198999999999994E-2]
[]
[null,"Network Generation Revenue (RGt)",null,null,null,"£m",null,0,0.01,-0.05,0,0]
[]
[null,"Over/Under Recovery",null,null,null,"£m",null,0,-5.3870000000000003E-3,-7.9786999999999997E-2,-8.0984E-2,-8.2198999999999994E-2]
[]
[]
["Metering Revenue"]
[null,"Legacy Basic Meter Asset Provision Revenue",null,null,null,"£m",null,2.81,3.06,3.63,0,0]
[null,"Basic Meter Operation Revenue",null,null,null,"£m",null,3.6498080000000002,4.2580520000000002,0,0,0]
[]
[null,null,null,null,null,null,null,6.4598079999999998,7.3180519999999998,3.63,0,0]
[]
[]
["Excluded Services and Revenue Outside of Price Control"]
[null,"Excluded Services",null,null,null,"£m",null,25.34,34.46,36.6,0,0]
[null,"Revenue Outside of Price Control",null,null,null,"£m",null,4.01,4.32,4.3099999999999996,0,0]
[null,"De-Minimis Revenue",null,null,null,"£m",null,0.14000000000000001,0.87,1.28,0,0]
[]
[null,null,null,null,null,null,null,29.49,39.65,42.19,0,0]

{"sheet":"Allowed revenue -DPCR4","index":11,"n_rows":33,"n_cols":10,"rows_kept":33,"cut":false,"hidden":false,"merged":[]}
[null,null,"2004/05","2005/6","2006/7","2007/8","2008/9","2009/10",null,"Index"]
[null,null,"(£M)","(£M)","(£M)","(£M)","(£M)","(£M)"]
[1,"Opening asset value",null,573.6,577.79999999999995,579.29999999999995,578.4,575," "]
[2,"Total capex",null,49.9,49.7,49.7,49.7,49.7," "]
[3,"Depreciation",null,-45.7,-48.2,-50.6,-53.1,-55.6," "]
[4,"Closing asset value",null,577.79999999999995,579.29999999999995,578.4,575,569.1," "]
[5,"Present value of opening / closing RAV",null,null,null," ",null,434.51048876277451]
[6,"5 Year movement in closing RAV",null,null," ",null,null,139.08951123722551]
["ALLOWED ITEMS"]
[7,"Operating costs (excluding pensions)",null,43,44.5,45.1,44.7,44.3," "]
[8,"Capital expenditure (excluding pensions)",null,44.1,44,43.8,43.7,43.6," "]
[9,"Pensions allowance",null,10,9.9,10.199999999999999,10.4,10.5," "]
[10,"Tax allowance",null,13.1,14.2,15,15.9,16.7," "]
[11,"Capex incentive scheme",null,-1.7,-1.1000000000000001,-0.9,-0.3,-0.1," "]
[12,"Sliding scale additional income",null,1.2,1.2,1.2,1.2,1.1000000000000001," "]
[13,"Opex incentive / Other adjustments",null,null,null,null,null,null," "]
[14,"Quality award",null,1.6,1.6,1.6,1.3,1.3," "]
[15,"DPCR3 costs",null,0.9,null,null,null,null," "]
[16,"Total allowed items",null,112.2,114.3,116,116.9,117.4," "]
[17,"Present value of allowed items",null,109.21292148782669,105.41192249868327,101.35935275953834,96.779346753468715,92.087060022660708," "]
[18,"5 year movement in closing RAV",null,null," ",null,null,139.08951123722551]
[19,"TOTAL PRESENT VALUE OVER 5 YEARS",null,null,null,null,null,643.94011475940329]
["REVENUE"]
[20,"Revenue index",null,1,1.0129999999999999,1.026,1.0369999999999999,1.05," "]
[21,"Discounted revenue index",null,0.97337719686120061,0.93422814952901245,0.89650599940764086,0.85851311020827237,0.82360658452975932," "]
[22,"Price control revenue",null,140.70458227880613,142.53374184843059,144.36290141805509,145.91065182312195,147.73981139274645," "]
[23,"Excluded service revenue",null,2.9,2.9,2.9,2.9,2.9," "]
[24,"Total revenue",null,143.60458227880613,145.4337418484306,147.26290141805509,148.81065182312196,150.63981139274645," "]
[25,"Present value of total revenue",null,139.78142575496796,134.12467475433311,128.67648597608419,123.19758488793515,118.15994338608289," "]
[26,"TOTAL PRESENT VALUE OVER 5 YEARS",null,null,null,null,null,643.94011475940329]
[]
["Take these data from the February 2005 Ofgem document (link below), not the November 2004 final proposals."]
["http://www.ofgem.gov.uk/Markets/RetMkts/Metrng/Metering/Documents1/9745-5405.pdf"]

{"sheet":"FBPQ T4","index":12,"n_rows":146,"n_cols":31,"rows_kept":146,"cut":false,"hidden":false,"merged":[[6,11,6,15],[6,16,6,20],[6,21,6,25],[6,1,8,4],[6,5,8,5],[7,28,7,29],[6,26,6,30],[7,6,7,7],[7,8,7,9],[7,11,7,12],[7,13,7,14],[7,16,7,17],[7,18,7,19],[7,21,7,22],[7,23,7,24],[7,26,7,27],[6,6,6,10]]}
["Main Forecast Business Plan DPCR5",null,null,null,null," ","Index",null," ",null," "," ",null," ",null," "," ",null," ",null," "," ",null," ",null," "," ",null," ",null," "]
[]
["T4 - Volume Summary"]
[]
[null,"Total Asset Register Movement"]
[]
[null,"Asset categories",null,null,null,"Opening Balance DCPR4","2005/06",null,null,null,null,"2006/07",null,null,null,null,"2007/08",null,null,null,null,"2008/09",null,null,null,null,"2009/10"]
[null,null,null,null,null,null,"Assets removed ",null,"Assets Installed",null,"Closing Balance","Assets removed ",null,"Assets Installed",null,"Closing Balance","Assets removed ",null,"Assets Installed",null,"Closing Balance","Assets removed ",null,"Assets Installed",null,"Closing Balance","Assets removed ",null,"Assets Installed",null,"Closing Balance DPCR4"]
[null,null,null,null,null,null,"LRE","NLRE","LRE","NLRE","2005/06","LRE","NLRE","LRE","NLRE","2006/07","LRE","NLRE","LRE","NLRE","2007/08","LRE","NLRE","LRE","NLRE","2008/09","LRE","NLRE","LRE","NLRE","2009/10"]
[null,null,"LV Network"]
[null,null,null,"Overhead lines - Conductor"]
[null,null,null,null,"LV Main (OHL)",3215,0,9,0,4,3210,0,61,0,56,3205,0,66,0,54,3193,0,39,0,39,3193,0,43,0,42,3192]
[null,null,null,null,"LV Service (OHL)",317000,0,5256,0,5256,317000,0,5428,0,5428,317000,0,9048,0,9048,317000,0,5000,0,5000,317000,0,2500,0,2500,317000]
[]
[null,null,null,"Overhead lines - Support"]
[null,null,null,null,"LV Support",98008,0,1043,0,961,97926,0,1028,0,833,97731,0,900,0,734,97565,0,840,0,840,97565,0,845,0,826,97546]
[]
[null,null,null,"Underground cables"]
[null,null,null,null,"LV Main (UG Consac)",0,0,0,"-",0,0,0,0,"-",0,0,0,0,"-",0,0,0,0,0,0,0,0,0,0,0,0]
[null,null,null,null,"LV Main (UG Plastic)",3999,0,0,248,4,4251,0,2,134.79,9.4,4393.1899999999996,0,2,143.9,2,4537.09,0,0,117,2,4656.09,0,0,113,3,4772.09]
[null,null,null,null,"LV Main (UG Paper)",6214.9,0,4,"-",0,6210.9,0,7.4,"-",0,6203.5,0,5,"-",0,6198.5,0,2,0,0,6196.5,0,2,0,0,6194.5]
[null,null,null,null,"LV Service (UG)",732157,0,0,10675,0,742832,0,0,11542,0,754374,0,0,8211,0,762585,0,1100,8288,1100,770873,0,750,7973,750,778846]
[]
[null,null,null,"Switchgear "]
[null,null,null,null,"LV Pillar (ID)",3736,0,0,40,65,3841,0,22,38,59,3916,0,53,54,88,4005,0,0,39,0,4044,0,0,37,0,4081]
[null,null,null,null,"LV Pillar (OD)",3893,21,8,1,8,3873,23,14,1,13,3850,29,14,3,14,3824,22,30,2,30,3804,21,40,2,40,3785]
[null,null,null,null,"LV Board (WM)",215,1,0,0,0,214,11,0,0,0,203,0,0,3,0,206,5,0,1,0,202,4,0,1,0,199]
[null,null,null,null,"LV UGB",3635,6,10,14,10,3643,5,8,11,8,3649,18,8,13,8,3644,10,0,10,0,3644,9,0,10,0,3645]
[null,null,null,null,"LV Fuses (PM)",31144,0,511,0,640,31273,0,0,0,0,31273,0,0,0,103,31376,0,0,0,0,31376,0,0,0,0,31376]
[null,null,null,null,"LV Fuses (TM)",2813,20,0,0,0,2793,36,0,0,0,2757,41,0,0,0,2716,32,0,0,0,2684,31,0,0,0,2653]
[]
[null,null,"HV network"]
[null,null,null,"Overhead lines - Conductor"]
[null,null,null,null,"6.6/11 kV OHL (Open)",12254,0,52,0,32,12234,0,89,0,77,12222,0,79,0,64,12207,0,55,0,55,12207,0,55,0,55,12207]
[null,null,null,null,"6.6/11 kV OHL (Covered)",0,0,0,0,0,0,0,0,0,0,0,0,0,0,0,0,0,0,0,0,0,0,0,0,0,0]
[null,null,null,null,"20 kV OHL (Open)",0,0,0,0,0,0,0,0,0,0,0,0,0,0,0,0,0,0,0,0,0,0,0,0,0,0]
[null,null,null,null,"20 kV OHL (Covered)",0,0,0,0,0,0,0,0,0,0,0,0,0,0,0,0,0,0,0,0,0,0,0,0,0,0]
[]
[null,null,null,"Overhead lines - Support"]
[null,null,null,null,"6.6/11 kV Support",163307,0,1809,0,1678,163176,0,2035,0,1912,163053,0,2381,0,1861,162533,0,1582.5,0,1582.5,162533,0,1582.5,0,1582.5,162533]
[null,null,null,null,"20 kV Support",0,0,0,0,0,0,0,0,0,0,0,0,0,0,0,0,0,0,0,0,0,0,0,0,0,0]
[]
[null,null,null,"Underground cables (kms)"]
[null,null,null,null,"6.6/11kV UG Cable",5119.7,0,0,120,0,5239.7,0,11,54.8,11,5294.5,0,4.7,66.900000000000006,5,5361.7,0,0,51,0,5412.7,0,0,49,0,5461.7]
[null,null,null,null,"20kV UG Cable",0,0,0,"-",0,0,0,0,"-",0,0,0,0,"-",0,0,0,0,0,0,0,0,0,0,0,0]
[]
[null,null,null,"Submarine cables (kms)"]
[null,null,null,null,"HV Sub Cable",5,0,0,"-",0,5,0,0,"-",0,5,0,0,"-",0,5,0,0,0,0,5,0,0,0,0,5]
[]
[null,null,null,"Switchgear "]
[null,null,null,null,"6.6/11 kV CB (PM)",615,0,48,0,196,763,0,55,0,119,827,0,64,0,150,913,0,100,0,100,913,0,43,0,43,913]
[null,null,null,null,"6.6/11 kV CB (GM)",2940,0,24,15,36,2967,7,43,22,33,2972,0,43,13,50,2992,3,50,15,50,3004,3,50,14,50,3015]
[null,null,null,null,"6.6/11 kV Switch (PM)",138,0,3,0,15,150,0,2,0,14,162,8,3,0,3,154,3,100,0,100,151,3,43,0,43,148]
[null,null,null,null,"6.6/11 kV Switch (GM)",2496,14,18,4,18,2486,48,26,5,25,2442,50,26,8,26,2400,41,25,6,25,2365,40,50,5,50,2330]
[null,null,null,null,"6.6/11 kV RMU",7060,0,49,83,72,7166,0,72,87,73,7254,5,100,114,100,7363,2,225,85,225,7446,2,160,82,160,7526]
[null,null,null,null,"6.6/11 kV Switchgear - Other (PM)",5011,0,93,21,252,5191,0,36,24,305,5484,0,65,20,227,5666,0,0,18,0,5684,0,0,18,0,5702]
[null,null,null,null,"6.6/11 kV Switchgear - Other (GM)",1,0,0,0,0,1,0,0,0,0,1,0,0,0,0,1,0,0,0,0,1,0,0,0,0,1]
[null,null,null,null,"20 kV CB (PM)",0,0,0,0,0,0,0,0,0,0,0,0,0,0,0,0,0,0,0,0,0,0,0,0,0,0]
[null,null,null,null,"20 kV CB (GM)",0,0,0,0,0,0,0,0,0,0,0,0,0,0,0,0,0,0,0,0,0,0,0,0,0,0]
[null,null,null,null,"20 kV Switch (PM)",0,0,0,0,0,0,0,0,0,0,0,0,0,0,0,0,0,0,0,0,0,0,0,0,0,0]
[null,null,null,null,"20 kV Switch (GM)",0,0,0,0,0,0,0,0,0,0,0,0,0,0,0,0,0,0,0,0,0,0,0,0,0,0]
[null,null,null,null,"20 kV RMU",0,0,0,0,0,0,0,0,0,0,0,0,0,0,0,0,0,0,0,0,0,0,0,0,0,0]
[null,null,null,null,"20 kV Switchgear - Other (PM)",0,0,0,0,0,0,0,0,0,0,0,0,0,0,0,0,0,0,0,0,0,0,0,0,0,0]
[null,null,null,null,"20 kV Switchgear - Other (GM)",0,0,0,0,0,0,0,0,0,0,0,0,0,0,0,0,0,0,0,0,0,0,0,0,0,0]
[]
[null,null,null,"Transformers  "]
[null,null,null,null,"6.6/11 kV Transformer (PM)",31144,0,511,127,513,31273,60,559,140,537,31331,51,559,130,559,31410,47,182,114,182,31477,45,343,109,343,31541]
[null,null,null,null,"6.6/11 kV Transformer (GM)",7770,0,46,95,69,7888,16,87,104,72,7961,21,87,114,87,8054,16,22,92,22,8130,15,42,88,42,8203]
[null,null,null,null,"20 kV Transformer (PM)",0,0,0,0,0,0,0,0,0,0,0,0,0,0,0,0,0,0,0,0,0,0,0,0,0,0]
[null,null,null,null,"20 kV Transformer (GM)",0,0,0,0,0,0,0,0,0,0,0,0,0,0,0,0,0,0,0,0,0,0,0,0,0,0]
[]
[null,null,"EHV Network"]
[null,null,null,"Overhead lines - Conductor"]
[null,null,null,null,"33kV OHL (Pole Line)",1196,0,5,0,5,1196,0,20,0,14,1190,0,25,0,21,1186,0,0,0,0,1186,0,0,0,0,1186]
[null,null,null,null,"33kV OHL (Tower Line)",41,0,0,0,0,41,0,0,0,0,41,0,0,0,0,41,0,0,0,0,41,0,0,0,0,41]
[null,null,null,null,"66kV OHL (Pole Line)",329,0,0,0,0,329,0,0,0,0,329,0,0,0,0,329,0,0,0,0,329,0,0,0,0,329]
[null,null,null,null,"66kV OHL (Tower Line)",28,0,0,0,0,28,0,0,0,0,28,0,0,0,0,28,0,0,0,0,28,0,0,0,0,28]
[]
[null,null,null,"Overhead lines - Support"]
[null,null,null,null,"33kV Pole",15348,0,138,0,138,15348,0,285,0,261,15324,0,366,0,366,15324,0,350,0,350,15324,0,350,0,350,15324]
[null,null,null,null,"33kV Tower",190,0,0,0,0,190,0,0,0,0,190,0,0,0,0,190,0,0,0,0,190,0,0,0,0,190]
[null,null,null,null,"66kV Pole",4318,0,0,0,0,4318,0,0,0,0,4318,0,0,0,0,4318,0,0,0,0,4318,0,0,0,0,4318]
[null,null,null,null,"66kV Tower",251,0,0,0,0,251,0,0,0,0,251,0,0,0,0,251,0,0,0,0,251,0,0,0,0,251]
[]
[null,null,null,"Underground cables (kms)"]
[null,null,null,null,"33kV UG Cable (Non Pressurised)",364.14,0,0,1,0,365.14,0,0,12.9,0,378.04,0,0,0.4,0.4,378.84,0,0,2,0,380.84,0,0,6,0,386.84]
[null,null,null,null,"33kV UG Cable (Oil)",0,0,0,0,0,0,0,0,0,0,0,0,0,0,0,0,0,0,0,0,0,0,0,0,0,0]
[null,null,null,null,"33kV UG Cable (Gas)",8.1240000000000006,0,0,0,0,8.1240000000000006,0,0,0,0,8.1240000000000006,0,0,0,0,8.1240000000000006,0,0,0,0,8.1240000000000006,0,0,0,0,8.1240000000000006]
[null,null,null,null,"66kV UG Cable (Non Pressurised)",6,0,0,0,0,6,0,0,0,0,6,0,0,0,0,6,0,0,0,0,6,0,0,0,0,6]
[null,null,null,null,"66kV UG Cable (Oil)",2,0,0,0,0,2,0,0,0,0,2,0,0,0,0,2,0,0,0,0,2,0,0,0,0,2]
[null,null,null,null,"66kV UG Cable (Gas)",1,0,0,0,0,1,0,0,0,0,1,0,0,0,0,1,0,0,0,0,1,0,0,0,0,1]
[]
[null,null,null,"Submarine cables (kms)"]
[null,null,null,null,"EHV Sub Cable",1.3,0,0,"-",0,1.3,0,0,"-",0,1.3,0,0,"-",0,1.3,0,0,0,0,1.3,0,0,0,0,1.3]
[]
[null,null,null,"Switchgear "]
[null,null,null,null,"33 KV CB (ID)",295,0,0,0,0,295,0,0,0,7,302,0,0,1,6,309,0,6,1,6,310,0,6,1,6,311]
[null,null,null,null,"33 kV CB (OD)",294,10,5,0,5,284,2,2,0,2,282,6,30,0,30,276,2,4,1,4,275,2,4,1,4,274]
[null,null,null,null,"33 kV Switch (GM)",16,0,0,0,0,16,0,0,0,0,16,0,0,0,0,16,0,0,0,0,16,0,0,0,0,16]
[null,null,null,null,"33 kV Switch (PM)",0,0,0,0,0,0,0,0,0,0,0,0,0,0,0,0,0,0,0,0,0,0,0,0,0,0]
[null,null,null,null,"33 kV RMU",0,0,0,0,0,0,0,0,0,0,0,0,0,0,0,0,0,0,0,0,0,0,0,0,0,0]
[null,null,null,null,"33 kV Switchgear - Other",1117,9,10,0,10,1108,26,1,0,1,1082,4,8,0,8,1078,4,0,2,0,1076,4,0,2,0,1074]
[null,null,null,null,"66 KV CB (ID & OD)",53,0,0,0,0,53,0,0,0,0,53,0,0,0,0,53,0,1,0,1,53,0,1,0,1,53]
[null,null,null,null,"66 KV Switchgear - Other",233,0,0,0,0,233,0,0,0,0,233,2,0,0,0,231,0,0,2,0,233,0,0,0,0,233]
[]
[null,null,null,"Transformers  "]
[null,null,null,null,"33 kV Transformer (PM)",0,0,0,0,0,0,0,0,0,0,0,0,0,0,0,0,0,0,0,0,0,0,0,0,0,0]
[null,null,null,null,"33 kV Transformer (GM)",247,2,0,3,0,248,0,0,3,0,251,5,0,1,0,247,2,2,2,2,247,2,2,2,2,247]
[null,null,null,null,"33 kV AuxiliaryTransfomer",242,0,0,0,0,242,0,0,2,0,244,0,0,0,0,244,0,0,0,0,244,0,0,0,0,244]
[null,null,null,null,"66 kV Transformer",30,0,0,0,0,30,0,0,0,0,30,0,0,0,0,30,0,2,0,2,30,0,2,0,2,30]
[null,null,null,null,"66 kV AuxiliaryTransfomer",0,0,0,0,0,0,0,0,0,0,0,0,0,0,0,0,0,0,0,0,0,0,0,0,0,0]
[]
[null,null,"132kV Network"]
[null,null,null,"Overhead lines - Conductor"]
[null,null,null,null,"132kV OHL Conductor (Pole Line)",91,0,0,0,0,91,0,0,0,0,91,0,0,0,0,91,0,0,0,0,91,0,0,0,0,91]
[null,null,null,null,"132kV OHL Conductor (Tower Line)",1089,0,0,0,0,1089,0,0,0,0,1089,0,0,0,0,1089,0,0,0,0,1089,0,0,0,0,1089]
[]
[null,null,null,"Overhead lines - Support"]
[null,null,null,null,"132kV Pole",835,0,0,0,0,835,0,0,0,0,835,0,0,0,0,835,0,10,0,10,835,0,10,0,10,835]
[null,null,null,null,"132kV Tower",2354,0,0,0,0,2354,0,0,0,0,2354,0,0,0,0,2354,0,1,0,1,2354,0,1,0,1,2354]
[null,null,null,null,"132kV Fittings (Tower Line)",4708,0,0,0,0,4708,0,0,0,0,4708,0,0,0,0,4708,0,0,0,0,4708,0,0,0,0,4708]
[]
[null,null,null,"Underground cables (kms)"]
[null,null,null,null,"132kV UG Cable (Non Pressurised)",35,0,0,0,0,35,0,0,0.4,0,35.4,0,0,0,0,35.4,0,0,0,0,35.4,0,0,0,0,35.4]
[null,null,null,null,"132kV UG Cable (Oil)",58,0,0,0,0,58,0,0,0,0,58,0,0,0,0,58,0,0.1,0,0.1,58,0,0.1,0,0.1,58]
[null,null,null,null,"132kV UG Cable (Gas)",0,0,0,0,0,0,0,0,0,0,0,0,0,0,0,0,0,0,0,0,0,0,0,0,0,0]
[]
[null,null,null,"Submarine cables (kms)"]
[null,null,null,null,"132 kV Sub Cable",0,0,0,0,0,0,0,0,0,0,0,0,0,0,0,0,0,0,0,0,0,0,0,0,0,0]
[]
[null,null,null,"Switchgear "]
[null,null,null,null,"132 kV CB (ID & OD)",214,2,1,2,1,214,0,0,2,1,217,0,0,3,2,222,0,2,0,2,222,0,2,0,2,222]
[null,null,null,null,"132 kV Switchgear (other)",730,0,0,0,0,730,7,4,0,4,723,0,0,2,2,727,0,0,0,0,727,0,0,0,0,727]
[]
[null,null,null,"Transformers  "]
[null,null,null,null,"132 kV Transformer",128,0,0,0,0,128,1,0,2,0,129,3,4,2,4,128,1,2,1,2,128,0,2,3,2,131]
[null,null,null,null,"132 kV AuxiliaryTransfomer",133,0,0,0,0,133,1,0,2,0,134,0,0,0,4,138,0,0,0,0,138,0,0,2,0,140]
[]
[null,null,"Tele-control / SCADA"]
[null,null,null,"Primary substation"]
[null,null,null,null,"132 kV/EHV RTU (PM)",0,0,0,0,0,0,0,0,0,0,0,0,0,0,0,0,0,0,0,0,0,0,0,1,0,1]
[null,null,null,null,"132 kV/EHV RTU (GM)",272,0,0,0,0,272,0,0,0,0,272,0,0,0,0,272,0,0,0,0,272,0,0,0,0,272]
[]
[null,null,null,"Secondary substation"]
[null,null,null,null,"HV RTU (PM)",1244,0,0,0,0,1244,0,0,0,0,1244,0,0,0,0,1244,0,0,1,0,1245,0,0,1,0,1246]
[null,null,null,null,"HV RTU (GM)",143,0,0,0,0,143,0,0,0,0,143,0,0,0,0,143,0,0,0,0,143,0,0,0,0,143]

{"sheet":"FBPQ LR1","index":13,"n_rows":136,"n_cols":20,"rows_kept":136,"cut":false,"hidden":false,"merged":[[104,1,105,1],[104,2,105,2],[130,1,131,1],[130,2,131,2],[7,1,8,1],[7,2,8,2],[17,2,18,2],[50,2,51,2],[75,1,76,1],[75,2,76,2],[50,1,51,1],[17,1,18,1]]}
["Main Forecast Business Plan DPCR5",null,null,null,null,"Index"]
[]
["LR1 - Demand"]
[]
[]
[null,"Demand Totals"]
[]
[null,null,"Units","DPCR4",null,null,null,null,"DPCR5",null,null,null,null,null,"DPCR4",null,null,null,"DPCR5"]
[null,null,null,"2005/06","2006/07","2007/08","2008/09","2009/10","2010/11","2011/12","2012/13","2013/14","2014/15",null,"Actuals","Forecast","Total",null,"Forecast","% change"]
[null,"Gross direct costs","£m",17.600000000000001,18.100000000000001,20.7,15.3,14.6,13.4,14.1,13.1,13.1,13.8,null,56.4,29.9,86.3,null,67.5,-0.2178447276940905]
[null,"Customer contributions directs","£m",17,17.100000000000001,19,14.15,13.5,12.7,13.15,12.3,12.3,12.85,null,53.1,27.65,80.75,null,63.3,-0.21609907120743044]
[null,"Net (gross directs - customer contributions directs)","£m",0.59999999999999787,1,1.7,1.1499999999999999,1.1000000000000001,0.70000000000000107,0.94999999999999929,0.80000000000000071,0.80000000000000071,0.94999999999999929,null,3.2999999999999936,2.25,5.5499999999999936,null,4.2,-0.24324324324324217]
[null,"Customer contributions indirects","£m",-0.7,3.8,5.8,5.4,5.0999999999999996,4.8,5,4.7,4.7,4.9000000000000004,null,8.9,10.5,19.399999999999999,null,24.1,0.24226804123711357]
[null,"Net (gross directs - customer contributions directs and indirects)","£m",1.3,-2.8,-4.0999999999999996,-4.25,-4,-4.0999999999999996,-4.05,-3.9,-3.9,-3.95,null,-5.6000000000000059,-8.25,-13.85,null,-19.899999999999999,0.43682310469314001]
[]
[null,"Demand trends"]
[]
[null,null,"Units","DPCR4",null,null,null,null,"DPCR5"]
[null,null,null,"2005/06","2006/07","2007/08","2008/09","2009/10","2010/11","2011/12","2012/13","2013/14","2014/15"]
[]
[null,"Estimated system maximum demand","MW",2248.9503331799997,2150.7974694199997,2179.2925999999998,2157.856080333333,2157.856080333333,2179.4346411366664,2201.2289875480333,2223.2412774235136,2245.4736901977485,2267.9284270997259]
[null,"Increase/Reduction in max demand","MW",14.9925,-98.152863759999931,28.495130580000023,-21.436519666666754,0,21.578560803333403,21.79434641136686,22.012289875480292,22.232412774234945,22.454736901977412]
[null,"Incremental increase in max demand due to new connections","MW",14.9925,13.302100000000001,18.3856,14.914999999999999,14.75,15.8,17.100000000000001,18.100000000000001,18.100000000000001,18.100000000000001]
[null,"Incremental reduction in max demand due to disconnections","MW",0,-0.42820000000000003,-0.84540000000000004,-0.47,-0.44800000000000006,-0.72,-0.77500000000000002,-0.77500000000000002,-0.77500000000000002,-0.77500000000000002]
[null,"Net change in max demand (not due to connections/disconnections)","MW",0,-111.02676375999994,10.954930580000022,-35.881519666666755,-14.302,6.4985608033334019,5.4693464113668586,4.6872898754802907,4.9074127742349436,5.1297369019774113]
[]
[null,"Estimated units distributed","GWh",13175.31223220985,12752.515874775498,12653.150485799997,12355.350485799998,12355.350485799998,12478.904140633249,12603.693332014831,12729.730415310229,12857.027869438582,12985.598298108218]
[null,"Increase/Reduction in units distributed","GWh",56.017452167050578,-422.7963574343521,-99.365388975500537,-297.8,0,123.55365483325113,124.78919138158199,126.03708329539768,127.29745412835291,128.57042866963639]
[null,"Increase in units distributed due to generic background demand growth","GWh",56.017452167050578,-422.7963574343521,-99.365388975500537,-171.3,123.6,123.55365483325113,124.78919138158199,126.03708329539768,127.29745412835291,128.57042866963639]
[null,"Reduction in units distributed due to energy efficiency ","GWh",0,0,0,0,0,0,0,0,0,0]
[null,"Units distributed offset by DG","GWh",0,0,0,0,0,0,0,0,0,0]
[null,"Units distributed offset by DSM","GWh",0,0,0,0,0,0,0,0,0,0]
[null,"Price impact on units distributed ","GWh",0,0,0,0,0,0,0,0,0,0]
[null,"Economic downturn effect on units distributed ","GWh",0,0,0,-126.5,-123.6,0,0,0,0,0]
[]
[null,"Estimated units distributed"]
[null,"LV","GWh",7428.8729010000015,7245.3084919999992,7216.2041944999992,7288.3662364449992,7288.3662364449992,7361.2498988094494,7434.862397797544,7509.2110217755198,7584.3031319932752,7660.1461633132076]
[null,"HV","GWh",2674.8896592833335,2491.1796430000004,2482.1083529999996,2407.6451024099997,2407.6451024099997,2431.7215534340999,2456.0387689684408,2480.5991566581251,2505.4051482247064,2530.4591997069533]
[null,"EHV (inc. 132kV)","GWh",3071.5496719265129,3016.0277397754976,2954.8379382999997,2659.3541444699999,2659.3541444699999,2685.9476859146998,2712.8071627738468,2739.9352344015851,2767.334586745601,2795.0079326130572]
[null,"Total units distributed","GWh",13175.31223220985,12752.515874775498,12653.150485799997,12355.365483324998,12355.365483324998,12478.91913815825,12603.708329539832,12729.745412835229,12857.042866963582,12985.613295633219]
[]
[null,"Incremental increase in units distributed attributable to new connections"]
[null,"LV","MWh",37362.5,38496.5,42462,31500,30345,28000,27125,24675,24675,24675]
[null,"HV","MWh",28470,5255,37230,30660,30660,32850,39420,48180,48180,48180]
[null,"EHV (inc. 132kV)","MWh",0,0,30000,89000,0,0,20000,20000,0,20000]
[null,"Total increase in units distributed due to new connections","MWh",65832.5,43751.5,109692,151160,61005,60850,86545,92855,72855,92855]
[]
[]
[null,"Connections/disconnections volume"]
[]
[null,null,"Units","DPCR4",null,null,null,null,"DPCR5"]
[null,null,null,"2005/06","2006/07","2007/08","2008/09","2009/10","2010/11","2011/12","2012/13","2013/14","2014/15"]
[null,"Connections/Disconnections"]
[null,"Estimated number demand connections/disconnections at LV"]
[null,"IDNO connections","#",0,0,7,2,4,8,10,12,12,12]
[null,"Connections (excluding IDNOs)","#",10675,11161,10696,9200,8850,8200,8000,7300,7300,7300]
[null,"Disconnections","#","N/A",162,314,200,180,200,250,250,250,250]
[null,"Estimated number demand connections/disconnections at HV"]
[null,"IDNO connections","#",0,1,4,3,3,6,8,10,10,10]
[null,"Connections (excluding IDNOs)","#",13,3,19,15,15,17,20,24,24,24]
[null,"Disconnections","#","N/A",1,2,1,1,2,2,2,2,2]
[null,"Estimated number demand connections/disconnections at EHV"]
[null,"IDNO connections","#",0,0,1,0,0,0,0,0,0,0]
[null,"Connections (excluding IDNOs)","#",0,0,1,1,0,0,1,0,0,1]
[null,"Disconnections","#","N/A",0,0,0,0,0,0,0,0,0]
[null,"Estimated number demand connections/disconnections at 132kV"]
[null,"IDNO connections","#",0,0,0,0,0,0,0,0,0,0]
[null,"Connections (excluding IDNOs)","#",0,0,0,0,0,0,0,0,0,0]
[null,"Disconnections","#","N/A",0,0,0,0,0,0,0,0,0]
[null,"Total number of demand connections","#",10688,11165,10728,9221,8872,8231,8039,7346,7346,7347]
[null,"Total number of demand disconnections","#",0,163,316,201,181,202,252,252,252,252]
[]
[]
[null,"Customer specific demand investment"]
[]
[null,null,"Units","DPCR4",null,null,null,null,"DPCR5",null,null,null,null,null,"DPCR4",null,null,null,"DPCR5"]
[null,null,null,"2005/06","2006/07","2007/08","2008/09","2009/10","2010/11","2011/12","2012/13","2013/14","2014/15",null,"Actuals","Forecast","Total",null,"Forecast","% change"]
[null,"New connections & customer specific reinforcement:"]
[null,"Connections provided at LV"]
[null,"Sole use","£m",14.1,12,13.8,11.3,10.9,10,9.8000000000000007,9,9,9,null,39.9,22.2,62.1,null,46.9,-0.24476650563607089]
[null,"Shared","£m",0.7,1,1.7,1,0.9,1.3,1.3,1.1000000000000001,1.1000000000000001,1.1000000000000001,null,3.4,1.9,5.3,null,4.0999999999999996,-0.22641509433962281]
[null,"LV total","£m",14.8,13,15.5,12.3,11.8,11.3,11.1,10.1,10.1,10.1,null,43.3,24.1,67.400000000000006,null,51,-0.24332344213649842]
[null,"Connections provided at HV"]
[null,"Sole use","£m",2.2000000000000002,3.2,2.5,1.7,1.9,1.1000000000000001,1,1,1,1,null,7.9,3.6,11.5,null,11.9,3.4782608695652049E-2]
[null,"Shared","£m",0,0,0.5,0.6,0.7,1.3,1.3,1.3,1.3,1.3,null,0.5,1.3,1.8,null,3.2,0.77777777777777779]
[null,"HV total","£m",2.2000000000000002,3.2,3,2.2999999999999998,2.6,2.4,2.2999999999999998,2.2999999999999998,2.2999999999999998,2.2999999999999998,null,8.4,4.9000000000000004,13.3,null,15.1,0.13533834586466184]
[null,"Connections provided at EHV"]
[null,"Sole use","£m",0.6,1.2,0.5,0.4,0,0,0,0,0,0,null,2.2999999999999998,0.4,2.7,null,0.8,-0.70370370370370361]
[null,"Shared","£m",0,0.7,1.7,0.3,0.2,0,0,0,0,0,null,2.4,0.5,2.9,null,0.6,-0.79310344827586199]
[null,"EHV total","£m",0.6,1.9,2.2000000000000002,0.7,0.2,0,0.7,0,0,0.7,null,4.7,0.9,5.6,null,1.4,-0.75]
[null,"Connections provided at 132kV"]
[null,"Sole use","£m",0,0,0,0,0,0,0,0,0,0,null,0,0,0,null,0,"0"]
[null,"Shared","£m",0,0,0,0,0,0,0,0,0,0,null,0,0,0,null,0,"0"]
[null,"132kV total","£m",0,0,0,0,0,0,0,0,0,0,null,0,0,0,null,0,"0"]
[]
[null,"Expenditure on DSM to avoid customer spec investment","£m",null,null,null,0,0,0,0,0,0,0,null,0,0,0,null,0,"0"]
[null,"Total inc. expenditure on DSM to avoid customer spec investment","£m",17.600000000000001,18.100000000000001,20.7,15.3,14.6,13.7,13.4,12.4,12.4,12.4,null,56.4,29.9,86.3,null,67.5,-0.2178447276940905]
[]
[null,"Expenditure avoided due to DG","£m",null,null,null,0,0,0,0,0,0,0,null,0,0,0,null,0,"0"]
[null,"Expenditure avoided due to DSM","£m",null,null,null,0,0,0,0,0,0,0,null,0,0,0,null,0,"0"]
[]
[]
[null,"Customer contributions - customer specific demand investment"]
[]
[null,null,"Units","DPCR4",null,null,null,null,"DPCR5",null,null,null,null,null,"DPCR4",null,null,null,"DPCR5"]
[null,null,null,"2005/06","2006/07","2007/08","2008/09","2009/10","2010/11","2011/12","2012/13","2013/14","2014/15",null,"Actuals","Forecast","Total",null,"Forecast","% change"]
[null,"Customer contributions (directs) for connections at LV"]
[null,"Sole use","£m",14.1,12,13.8,11.3,10.9,10,9.8000000000000007,9,9,9,null,39.9,22.2,62.1,null,46.9,-0.24476650563607089]
[null,"Shared ","£m",0.1,0.4,0.9,0.4,0.4,1.3,1.3,1.1000000000000001,1.1000000000000001,1.1000000000000001,null,1.4,0.8,2.2000000000000002,null,1.6,-0.2727272727272726]
[null,"LV total","£m",14.2,12.4,14.7,11.7,11.3,11.3,11.1,10.1,10.1,10.1,null,41.3,23,64.3,null,48.5,-0.24572317262830495]
[null,"Customer contributions (directs) for connections at HV"]
[null,"Sole use","£m",2.2000000000000002,3.2,2.5,1.7,1.9,1.1000000000000001,1,1,1,1,null,7.9,3.6,11.5,null,11.9,3.4782608695652049E-2]
[null,"Shared ","£m",0,0,0.2,0.2,0.2,1.3,1.3,1.3,1.3,1.3,null,0.2,0.4,0.6,null,1.8,2]
[null,"HV total","£m",2.2000000000000002,3.2,2.7,1.9,2.1,2.4,2.2999999999999998,2.2999999999999998,2.2999999999999998,2.2999999999999998,null,8.1,4,12.1,null,13.7,0.1322314049586775]
[null,"Customer contributions (directs) for connections at EHV"]
[null,"Sole use","£m",0.6,1.2,0.5,0.4,0,0,0,0,0,0,null,2.2999999999999998,0.4,2.7,null,0.8,-0.70370370370370361]
[null,"Shared ","£m",0,0.3,1.1000000000000001,0.15,0.1,0,0,0,0,0,null,1.4,0.25,1.65,null,0.3,-0.81818181818181812]
[null,"EHV total","£m",0.6,1.5,1.6,0.55000000000000004,0.1,0,0.55000000000000004,0,0,0.55000000000000004,null,3.7,0.65,4.3499999999999996,null,1.1000000000000001,-0.74712643678160917]
[null,"Customer contributions (directs) for connections at 132kV"]
[null,"Sole use","£m",0,0,0,0,0,0,0,0,0,0,null,0,0,0,null,0,"0"]
[null,"Shared ","£m",0,0,0,0,0,0,0,0,0,0,null,0,0,0,null,0,"0"]
[null,"132kV total","£m",0,0,0,0,0,0,0,0,0,0,null,0,0,0,null,0,"0"]
[]
[null,"Customer contributions (directs) total","£m",17,17.100000000000001,19,14.15,13.5,13.7,13.4,12.4,12.4,12.4,null,53.1,27.65,80.75,null,63.3,-0.21609907120743044]
[null,"Customer contributions (indirects)","£m",-0.7,3.8,5.8,5.4,5.0999999999999996,4.8,5,4.7,4.7,4.9000000000000004,null,8.9,10.5,19.399999999999999,null,24.1,0.24226804123711357]
[null,"Customer contributions total","£m",16.3,20.9,24.8,19.55,18.600000000000001,{"$f":"+I125+I124","v":18.5},{"$f":"+J125+J124","v":18.399999999999999},{"$f":"+K125+K124","v":17.100000000000001},{"$f":"+L125+L124","v":17.100000000000001},{"$f":"+M125+M124","v":17.3},null,62,38.15,100.15,null,87.4,-0.12730903644533201]
[]
[null,"Total inc. exp on DSM to avoid customer spec investment (net of cust cont)","£m",1.3,-2.8,-4.100000000000005,-4.25,-4,-4.0999999999999996,-4.05,-3.9,-3.9,-3.95,null,-5.6000000000000085,-8.25,-13.85,null,-19.899999999999999,0.43682310469313945]
[]
[]
[null,null,"Units","DPCR4",null,null,null,null,"DPCR5",null,null,null,null,null,"DPCR4",null,null,null,"DPCR5"]
[null,null,null,"2005/06","2006/07","2007/08","2008/09","2009/10","2010/11","2011/12","2012/13","2013/14","2014/15",null,"Actuals","Forecast","Total",null,"Forecast","% change"]
[null,"Unapportioned part of shared LV","£m",0.6,0.6,0.8,0.6,0.5,0.5,0.5,0.5,0.5,0.5,null,2,1.1000000000000001,3.1,null,2.5,-0.19354838709677422]
[null,"Unapportioned part of shared HV","£m",0,0,0.3,0.4,0.5,0.2,0.3,0.3,0.3,0.3,null,0.3,0.9,1.2,null,1.4,0.16666666666666663]
[null,"Unapportioned part of shared EHV","£m",0,0.4,0.6,0.15,0.1,0,0.15,0,0,0.15,null,1,0.25,1.25,null,0.3,-0.76]
[null,"Unapportioned part of shared 132kV","£m",0,0,0,0,0,0,0,0,0,0,null,0,0,0,null,0,"0"]

{"sheet":"FBPQ LR1 - V5 opt3","index":14,"n_rows":266,"n_cols":20,"rows_kept":266,"cut":false,"hidden":false,"merged":[[7,1,8,1],[7,2,8,2],[25,2,26,2],[25,1,26,1],[47,1,48,1],[47,2,48,2],[78,1,79,1],[78,2,79,2],[109,1,110,1],[109,2,110,2],[142,1,143,1],[142,2,143,2]]}
["Main Forecast Business Plan DPCR5"]
[]
["LR1a - Demand - metered connections"]
[]
[]
[null,"Demand Totals - Table 1"]
[]
[null,null,"Units","DPCR4",null,null,null,null,"DPCR5",null,null,null,null,null,"DPCR4",null,null,null,"DPCR5"]
[null,null,null,"2005/06","2006/07","2007/08","2008/09","2009/10","2010/11","2011/12","2012/13","2013/14","2014/15",null,"Actuals","Forecast","Total",null,"Forecast","% change"]
[null,"Gross all connections costs","£m",{"$f":"SUM(D178,D217,D240)","v":0},0,0,0,0,0,0,0,0,0,null,{"$f":"SUM(D10:G10)","v":0},{"$f":"SUM(H10)","v":0},{"$f":"SUM(D10:H10)","v":0},null,{"$f":"SUM(I10:M10)","v":0},{"$f":"IF(Q10<>0,(S10-Q10)/Q10,\"0\")","v":"0"}]
[null,"Gross direct connections costs subject to apportionment rule","£m",{"$f":"D240","v":0},0,0,0,0,0,0,0,0,0,null,0,0,0,null,0,"0"]
[null,"Customer contributions excluding margins","£m",{"$f":"D263","v":0},0,0,0,0,0,0,0,0,0,null,0,0,0,null,0,"0"]
[null,"Net (gross directs subject to apportionment rule - customer contributions directs)","£m",{"$f":"D11-D12","v":0},0,0,0,0,0,0,0,0,0,null,0,0,0,null,0,"0"]
[null,"DUOS funded related party margin","£m",null,null,null,null,null,null,null,null,null,0.3,null,0,0,0,null,0.3,"0"]
[null,"Net (gross directs subject to apportionment rule - customer contributions directs + DUOS funded related party margin)","£m",{"$f":"D13+D14","v":0},0,0,0,0,0,0,0,0,0.3,null,0,0,0,null,0.3,"0"]
[null,"Check",null,{"$f":"IF(D13-SUM(D31,D35,D39,D43)=0,\"OK\",\"ERROR\")","v":"OK"},"OK","OK","OK","OK","OK","OK","OK","OK","OK"]
[]
[null,null,null,"DPCR4",null,null,null,null,"DPCR5",null,null,null,null,null,"DPCR4",null,null,null,"DPCR5"]
[null,null,"Units","2005/06","2006/07","2007/08","2008/09","2009/10","2010/11","2011/12","2012/13","2013/14","2014/15",null,"Actuals","Forecast","Total",null,"Forecast","% change"]
[null,"Pensions with total gross direct connections costs","£m",null,null,null,null,null,null,null,null,null,null,null,{"$f":"SUM(D20:G20)","v":0},{"$f":"SUM(H20)","v":0},{"$f":"SUM(D20:H20)","v":0},null,{"$f":"SUM(I20:M20)","v":0},{"$f":"IF(Q20<>0,(S20-Q20)/Q20,\"0\")","v":"0"}]
[null,"Pensions with direct connections costs subject to apportionment rule","£m",null,null,null,null,null,null,null,null,null,null,null,{"$f":"SUM(D21:G21)","v":0},{"$f":"SUM(H21)","v":0},{"$f":"SUM(D21:H21)","v":0},null,{"$f":"SUM(I21:M21)","v":0},{"$f":"IF(Q21<>0,(S21-Q21)/Q21,\"0\")","v":"0"}]
[null,"Total","£m",{"$f":"D20+D21","v":0},0,0,0,0,0,0,0,0,0,null,{"$f":"SUM(D22:G22)","v":0},{"$f":"SUM(H22)","v":0},{"$f":"SUM(D22:H22)","v":0},null,{"$f":"SUM(I22:M22)","v":0},{"$f":"IF(Q22<>0,(S22-Q22)/Q22,\"0\")","v":"0"}]
[]
[null,"Connections expenditure recovered via DUoS - Table 2"]
[]
[null,null,"Units","DPCR4",null,null,null,null,"DPCR5",null,null,null,null,null,"DPCR4",null,null,null,"DPCR5"]
[null,null,null,"2005/06","2006/07","2007/08","2008/09","2009/10","2010/11","2011/12","2012/13","2013/14","2014/15",null,"Actuals","Forecast","Total",null,"Forecast","% change"]
[null,"Customer contributions (directs) for connections at LV"]
[null,"Small scale LV domestic and one-off commercial","£m",null,null,null,null,null,{"$f":"I225-I248","v":0},0,0,0,0]
[null,"All other LV (with only LV work)","£m",null,null,null,null,null,0,0,0,0,0]
[null,"LV total","£m",{"$f":"D227-D250","v":0},{"$f":"E227-E250","v":0},{"$f":"F227-F250","v":0},{"$f":"G227-G250","v":0},{"$f":"H227-H250","v":0},{"$f":"SUM(I29:I30)","v":0},{"$f":"SUM(J29:J30)","v":0},{"$f":"SUM(K29:K30)","v":0},{"$f":"SUM(L29:L30)","v":0},{"$f":"SUM(M29:M30)","v":0},null,{"$f":"SUM(D31:G31)","v":0},{"$f":"SUM(H31)","v":0},{"$f":"SUM(D31:H31)","v":0},null,{"$f":"SUM(I31:M31)","v":0},{"$f":"IF(Q31<>0,(S31-Q31)/Q31,\"0\")","v":"0"}]
[null,"Customer contributions (directs) for connections at HV"]
[null,"LV end connections involving HV work","£m",null,null,null,null,null,{"$f":"I229-I252","v":0},0,0,0,0]
[null,"HV end connections involving only HV work","£m",null,null,null,null,null,0,0,0,0,0]
[null,"HV total","£m",{"$f":"D231-D254","v":0},{"$f":"E231-E254","v":0},{"$f":"F231-F254","v":0},{"$f":"G231-G254","v":0},{"$f":"H231-H254","v":0},{"$f":"SUM(I33:I34)","v":0},{"$f":"SUM(J33:J34)","v":0},{"$f":"SUM(K33:K34)","v":0},{"$f":"SUM(L33:L34)","v":0},{"$f":"SUM(M33:M34)","v":0},null,{"$f":"SUM(D35:G35)","v":0},{"$f":"SUM(H35)","v":0},{"$f":"SUM(D35:H35)","v":0},null,{"$f":"SUM(I35:M35)","v":0},{"$f":"IF(Q35<>0,(S35-Q35)/Q35,\"0\")","v":"0"}]
[null,"Customer contributions (directs) for connections at EHV"]
[null,"HV end connections involving EHV work","£m",null,null,null,null,null,{"$f":"I233-I256","v":0},0,0,0,0]
[null,"EHV end connections involving only EHV work","£m",null,null,null,null,null,0,0,0,0,0]
[null,"EHV total","£m",{"$f":"D235-D258","v":0},{"$f":"E235-E258","v":0},{"$f":"F235-F258","v":0},{"$f":"G235-G258","v":0},{"$f":"H235-H258","v":0},{"$f":"SUM(I37:I38)","v":0},{"$f":"SUM(J37:J38)","v":0},{"$f":"SUM(K37:K38)","v":0},{"$f":"SUM(L37:L38)","v":0},{"$f":"SUM(M37:M38)","v":0},null,{"$f":"SUM(D39:G39)","v":0},{"$f":"SUM(H39)","v":0},{"$f":"SUM(D39:H39)","v":0},null,{"$f":"SUM(I39:M39)","v":0},{"$f":"IF(Q39<>0,(S39-Q39)/Q39,\"0\")","v":"0"}]
[null,"Customer contributions (directs) for connections at 132kV"]
[null," HV or EHV connections involving 132kV work","£m",null,null,null,null,null,{"$f":"I237-I260","v":0},0,0,0,0]
[null,"132kV end connections involving only 132kV work","£m",null,null,null,null,null,0,0,0,0,0]
[null,"132kV total","£m",{"$f":"D239-D262","v":0},{"$f":"E239-E262","v":0},{"$f":"F239-F262","v":0},{"$f":"G239-G262","v":0},{"$f":"H239-H262","v":0},{"$f":"SUM(I41:I42)","v":0},{"$f":"SUM(J41:J42)","v":0},{"$f":"SUM(K41:K42)","v":0},{"$f":"SUM(L41:L42)","v":0},{"$f":"SUM(M41:M42)","v":0},null,{"$f":"SUM(D43:G43)","v":0},{"$f":"SUM(H43)","v":0},{"$f":"SUM(D43:H43)","v":0},null,{"$f":"SUM(I43:M43)","v":0},{"$f":"IF(Q43<>0,(S43-Q43)/Q43,\"0\")","v":"0"}]
[]
[]
[null,"Metered connections volume - Table 3"]
[]
[null,null,"Units","DPCR4",null,null,null,null,"DPCR5"]
[null,null,null,"2005/06","2006/07","2007/08","2008/09","2009/10","2010/11","2011/12","2012/13","2013/14","2014/15"]
[null,"Metered connections"]
[null,"Estimated number demand connections at LV"]
[null,"IDNO connections","#",{"$f":"D83+D114","v":0},0,0,0,0,0,0,0,0,0]
[null,"Adopted connections",null,{"$f":"D84+D115","v":0},0,0,0,0,0,0,0,0,0]
[null,"Small scale LV domestic and one-off commercial connections",null,null,null,null,null,null,{"$f":"I85+I116","v":0},0,0,0,0]
[null,"All other LV connections (with only LV work)","#",null,null,null,null,null,0,0,0,0,0]
[null,"DNO total LV",null,{"$f":"D87+D118","v":0},{"$f":"E87+E118","v":0},{"$f":"F87+F118","v":0},{"$f":"G87+G118","v":0},{"$f":"H87+H118","v":0},0,0,0,0,0]
[null,"Estimated number demand connections at HV"]
[null,"IDNO connections","#",{"$f":"D89+D120","v":0},0,0,0,0,0,0,0,0,0]
[null,"Adopted connections",null,{"$f":"D90+D121","v":0},0,0,0,0,0,0,0,0,0]
[null,"LV end connections involving HV work",null,null,null,null,null,null,{"$f":"I91+I122","v":0},0,0,0,0]
[null,"HV end connections involving only HV work","#",null,null,null,null,null,0,0,0,0,0]
[null,"DNO total HV",null,{"$f":"D93+D124","v":0},{"$f":"E93+E124","v":0},{"$f":"F93+F124","v":0},{"$f":"G93+G124","v":0},{"$f":"H93+H124","v":0},0,0,0,0,0]
[null,"Estimated number demand connections at EHV"]
[null,"IDNO connections","#",{"$f":"D95+D126","v":0},0,0,0,0,0,0,0,0,0]
[null,"Adopted connections",null,{"$f":"D96+D127","v":0},0,0,0,0,0,0,0,0,0]
[null,"HV end connections involving EHV work",null,null,null,null,null,null,{"$f":"I97+I128","v":0},0,0,0,0]
[null,"EHV end connections involving only EHV work","#",null,null,null,null,null,0,0,0,0,0]
[null,"DNO total EHV",null,{"$f":"D99+D130","v":0},{"$f":"E99+E130","v":0},{"$f":"F99+F130","v":0},{"$f":"G99+G130","v":0},{"$f":"H99+H130","v":0},0,0,0,0,0]
[null,"Estimated number demand connections at 132kV"]
[null,"IDNO connections","#",{"$f":"D101+D132","v":0},0,0,0,0,0,0,0,0,0]
[null,"Adopted connections",null,{"$f":"D102+D133","v":0},0,0,0,0,0,0,0,0,0]
[null," HV or EHV connections involving 132kV work",null,null,null,null,null,null,{"$f":"I103+I134","v":0},0,0,0,0]
[null,"132kV end connections involving only 132kV work","#",null,null,null,null,null,0,0,0,0,0]
[null,"DNO total 132kV",null,{"$f":"D105+D136","v":0},{"$f":"E105+E136","v":0},{"$f":"F105+F136","v":0},{"$f":"G105+G136","v":0},{"$f":"H105+H136","v":0},0,0,0,0,0]
[null,"Total number of demand connections","#",{"$f":"SUM(D52:D55,D58:D61,D64:D67,D70:D73)","v":0},0,0,0,0,0,0,0,0,0]
[]
[null,"Metered connections volume - Sole use connections where there is no associated expenditure subject to the apportionment rule - Table 4"]
[]
[null,null,"Units","DPCR4",null,null,null,null,"DPCR5"]
[null,null,null,"2005/06","2006/07","2007/08","2008/09","2009/10","2010/11","2011/12","2012/13","2013/14","2014/15"]
[null,"Metered connections"]
[null,"Estimated number demand connections at LV"]
[null,"IDNO connections","#"]
[null,"Adopted connections"]
[null,"Small scale LV domestic and one-off commercial connections"]
[null,"All other LV connections (with only LV work)","#"]
[null,"DNO total LV",null,null,null,null,null,null,{"$f":"SUM(I85:I86)","v":0},{"$f":"SUM(J85:J86)","v":0},{"$f":"SUM(K85:K86)","v":0},{"$f":"SUM(L85:L86)","v":0},{"$f":"SUM(M85:M86)","v":0}]
[null,"Estimated number demand connections with HV work"]
[null,"IDNO connections","#"]
[null,"Adopted connections"]
[null,"LV end connections involving HV work"]
[null,"HV end connections involving only HV work","#"]
[null,"DNO total HV",null,null,null,null,null,null,{"$f":"SUM(I91:I92)","v":0},{"$f":"SUM(J91:J92)","v":0},{"$f":"SUM(K91:K92)","v":0},{"$f":"SUM(L91:L92)","v":0},{"$f":"SUM(M91:M92)","v":0}]
[null,"Estimated number demand connections with EHV work"]
[null,"IDNO connections","#"]
[null,"Adopted connections"]
[null,"HV end connections involving EHV work"]
[null,"EHV end connections involving only EHV work","#"]
[null,"DNO total EHV",null,null,null,null,null,null,{"$f":"SUM(I97:I98)","v":0},{"$f":"SUM(J97:J98)","v":0},{"$f":"SUM(K97:K98)","v":0},{"$f":"SUM(L97:L98)","v":0},{"$f":"SUM(M97:M98)","v":0}]
[null,"Estimated number demand connections with 132kV work"]
[null,"IDNO connections","#"]
[null,"Adopted connections"]
[null," HV or EHV connections involving 132kV work"]
[null,"132kV end connections involving only 132kV work","#"]
[null,"DNO total 132kV",null,null,null,null,null,null,{"$f":"SUM(I103:I104)","v":0},{"$f":"SUM(J103:J104)","v":0},{"$f":"SUM(K103:K104)","v":0},{"$f":"SUM(L103:L104)","v":0},{"$f":"SUM(M103:M104)","v":0}]
[null,"Total number of demand connections","#",{"$f":"SUM(D83:D84,D87,D89:D90,D93,D95:D96,D99,D101:D102,D105)","v":0},0,0,0,0,0,0,0,0,0]
[]
[null,"Metered connections volume - Connections where there is associated expenditure subject to the apportionment rule - Table 5"]
[]
[null,null,"Units","DPCR4",null,null,null,null,"DPCR5"]
[null,null,null,"2005/06","2006/07","2007/08","2008/09","2009/10","2010/11","2011/12","2012/13","2013/14","2014/15"]
[null,"Metered connections"]
[null,"Estimated number demand connections at LV"]
[null,"IDNO connections","#"]
[null,"Adopted connections"]
[null,"Small scale LV domestic and one-off commercial connections"]
[null,"All other LV connections (with only LV work)","#"]
[null,"DNO total LV",null,null,null,null,null,null,{"$f":"SUM(I116:I117)","v":0},{"$f":"SUM(J116:J117)","v":0},{"$f":"SUM(K116:K117)","v":0},{"$f":"SUM(L116:L117)","v":0},{"$f":"SUM(M116:M117)","v":0}]
[null,"Estimated number demand connections with HV work"]
[null,"IDNO connections","#"]
[null,"Adopted connections"]
[null,"LV end connections involving HV work"]
[null,"HV end connections involving only HV work","#"]
[null,"DNO total HV",null,null,null,null,null,null,{"$f":"SUM(I122:I123)","v":0},{"$f":"SUM(J122:J123)","v":0},{"$f":"SUM(K122:K123)","v":0},{"$f":"SUM(L122:L123)","v":0},{"$f":"SUM(M122:M123)","v":0}]
[null,"Estimated number demand connections with EHV work"]
[null,"IDNO connections","#"]
[null,"Adopted connections"]
[null,"HV end connections involving EHV work"]
[null,"EHV end connections involving only EHV work","#"]
[null,"DNO total EHV",null,null,null,null,null,null,{"$f":"SUM(I128:I129)","v":0},{"$f":"SUM(J128:J129)","v":0},{"$f":"SUM(K128:K129)","v":0},{"$f":"SUM(L128:L129)","v":0},{"$f":"SUM(M128:M129)","v":0}]
[null,"Estimated number demand connections with 132kV work"]
[null,"IDNO connections","#"]
[null,"Adopted connections"]
[null," HV or EHV connections involving 132kV work"]
[null,"132kV end connections involving only 132kV work","#"]
[null,"DNO total 132kV",null,null,null,null,null,null,{"$f":"SUM(I134:I135)","v":0},{"$f":"SUM(J134:J135)","v":0},{"$f":"SUM(K134:K135)","v":0},{"$f":"SUM(L134:L135)","v":0},{"$f":"SUM(M134:M135)","v":0}]
[null,"Total number of demand connections","#",{"$f":"SUM(D114:D115,D118,D120:D121,D124,D126:D127,D130,D132:D133,D136)","v":0},0,0,0,0,0,0,0,0,0]
[]
[]
[]
[null,"Customer specific demand investment - Sole use expenditure where there is no associated expenditure subject to the apportionment rule - Table 6"]
[]
[null,null,"Units","DPCR4",null,null,null,null,"DPCR5",null,null,null,null,null,"DPCR4",null,null,null,"DPCR5"]
[null,null,null,"2005/06","2006/07","2007/08","2008/09","2009/10","2010/11","2011/12","2012/13","2013/14","2014/15",null,"Actuals","Forecast","Total",null,"Forecast","% change"]
[null,"New connections & customer specific reinforcement:"]
[null,"Connections provided at LV"]
[null,"Small scale LV domestic and one-off commercial","£m"]
[null,"Ratio - small scale LV domestic and one-off commercial - non-contestable","%"]
[null,"Ratio - small scale LV domestic and one-off commercial - contestable","%",null,null,null,null,null,{"$f":"1-I148","v":1},{"$f":"1-J148","v":1},{"$f":"1-K148","v":1},{"$f":"1-L148","v":1},{"$f":"1-M148","v":1}]
[null,"All other LV (with only LV work)","£m"]
[null,"Ratio - all other LV (with only LV work) - non-contestable","%"]
[null,"Ratio - all other LV (with only LV work) - contestable","%",null,null,null,null,null,{"$f":"1-I151","v":1},{"$f":"1-J151","v":1},{"$f":"1-K151","v":1},{"$f":"1-L151","v":1},{"$f":"1-M151","v":1}]
[null,"LV total","£m",null,null,null,null,null,{"$f":"SUM(I147,I150)","v":0},{"$f":"SUM(J147,J150)","v":0},{"$f":"SUM(K147,K150)","v":0},{"$f":"SUM(L147,L150)","v":0},{"$f":"SUM(M147,M150)","v":0},null,{"$f":"SUM(D153:G153)","v":0},{"$f":"SUM(H153)","v":0},{"$f":"SUM(D153:H153)","v":0},null,{"$f":"SUM(I153:M153)","v":0},{"$f":"IF(Q153<>0,(S153-Q153)/Q153,\"0\")","v":"0"}]
[null,"Connections with HV work"]
[null,"LV end connections involving HV work","£m"]
[null,"Ratio - LV end connections involving HV work - non-contestable","%"]
[null,"Ratio - LV end connections involving HV work - contestable","%",null,null,null,null,null,{"$f":"1-I156","v":1},{"$f":"1-J156","v":1},{"$f":"1-K156","v":1},{"$f":"1-L156","v":1},{"$f":"1-M156","v":1}]
[null,"HV end connections involving only HV work","£m"]
[null,"Ratio - HV end connections involving only HV work - non-contestable","%"]
[null,"Ratio - HV end connections involving only HV work - contestable","%",null,null,null,null,null,{"$f":"1-I159","v":1},{"$f":"1-J159","v":1},{"$f":"1-K159","v":1},{"$f":"1-L159","v":1},{"$f":"1-M159","v":1}]
[null,"HV total","£m",null,null,null,null,null,{"$f":"SUM(I155,I158)","v":0},{"$f":"SUM(J155,J158)","v":0},{"$f":"SUM(K155,K158)","v":0},{"$f":"SUM(L155,L158)","v":0},{"$f":"SUM(M155,M158)","v":0},null,{"$f":"SUM(D161:G161)","v":0},{"$f":"SUM(H161)","v":0},{"$f":"SUM(D161:H161)","v":0},null,{"$f":"SUM(I161:M161)","v":0},{"$f":"IF(Q161<>0,(S161-Q161)/Q161,\"0\")","v":"0"}]
[null,"Connections with EHV work"]
[null,"HV end connections involving EHV work","£m"]
[null,"Ratio - HV end connections involving EHV work - non-contestable","%"]
[null,"Ratio - HV end connections involving EHV work - contestable","%",null,null,null,null,null,{"$f":"1-I164","v":1},{"$f":"1-J164","v":1},{"$f":"1-K164","v":1},{"$f":"1-L164","v":1},{"$f":"1-M164","v":1}]
[null,"EHV end connections involving only EHV work","£m"]
[null,"Ratio - EHV end connections involving only EHV work - non-contestable","%"]
[null,"Ratio - EHV end connections involving only EHV work - contestable","%",null,null,null,null,null,{"$f":"1-I167","v":1},{"$f":"1-J167","v":1},{"$f":"1-K167","v":1},{"$f":"1-L167","v":1},{"$f":"1-M167","v":1}]
[null,"EHV total","£m",null,null,null,null,null,{"$f":"SUM(I163,I166)","v":0},{"$f":"SUM(J163,J166)","v":0},{"$f":"SUM(K163,K166)","v":0},{"$f":"SUM(L163,L166)","v":0},{"$f":"SUM(M163,M166)","v":0},null,{"$f":"SUM(D169:G169)","v":0},{"$f":"SUM(H169)","v":0},{"$f":"SUM(D169:H169)","v":0},null,{"$f":"SUM(I169:M169)","v":0},{"$f":"IF(Q169<>0,(S169-Q169)/Q169,\"0\")","v":"0"}]
[null,"Connections with 132kV work"]
[null," HV or EHV connections involving 132kV work","£m"]
[null,"Ratio - HV or EHV connections involving 132kV work - non-contestable","%"]
[null,"Ratio - HV or EHV connections involving 132kV work - contestable","%",null,null,null,null,null,{"$f":"1-I172","v":1},{"$f":"1-J172","v":1},{"$f":"1-K172","v":1},{"$f":"1-L172","v":1},{"$f":"1-M172","v":1}]
[null,"132kV end connections involving only 132kV work","£m"]
[null,"Ratio - 132kV end connections involving only 132kV work - non-contestable","%"]
[null,"Ratio - 132kV end connections involving only 132kV work - contestable","%",null,null,null,null,null,{"$f":"1-I175","v":1},{"$f":"1-J175","v":1},{"$f":"1-K175","v":1},{"$f":"1-L175","v":1},{"$f":"1-M175","v":1}]
[null,"132kV total","£m",null,null,null,null,null,{"$f":"SUM(I171,I174)","v":0},{"$f":"SUM(J171,J174)","v":0},{"$f":"SUM(K171,K174)","v":0},{"$f":"SUM(L171,L174)","v":0},{"$f":"SUM(M171,M174)","v":0},null,{"$f":"SUM(D177:G177)","v":0},{"$f":"SUM(H177)","v":0},{"$f":"SUM(D177:H177)","v":0},null,{"$f":"SUM(I177:M177)","v":0},{"$f":"IF(Q177<>0,(S177-Q177)/Q177,\"0\")","v":"0"}]
[null,"Total sole use expenditure where there is no expenditure subject to the apportionment rule",null,{"$f":"SUM(D153,D161,D169,D177)","v":0},0,0,0,0,0,0,0,0,0,null,{"$f":"SUM(O153,O161,O169,O177)","v":0},{"$f":"SUM(P153,P161,P169,P177)","v":0},{"$f":"SUM(Q153,Q161,Q169,Q177)","v":0},null,{"$f":"SUM(S153,S161,S169,S177)","v":0},{"$f":"IF(Q178<>0,(S178-Q178)/Q178,\"0\")","v":"0"}]
[]
[null,"Customer specific demand investment - sole use expenditure where there is also associated expenditure subject to the apportionment rule - Table 7"]
[]
[null,null,null,"DPCR4",null,null,null,null,"DPCR5",null,null,null,null,null,"DPCR4",null,null,null,"DPCR5"]
[null,"Customer specific demand investment","Units","2005/06","2006/07","2007/08","2008/09","2009/10","2010/11","2011/12","2012/13","2013/14","2014/15",null,"Actuals","Forecast","Total",null,"Forecast","% change"]
[null,"New connections & customer specific reinforcement:"]
[null,"Connections provided at LV"]
[null,"Small scale LV domestic and one-off commercial","£m"]
[null,"Ratio - small scale LV domestic and one-off commercial - non-contestable","%"]
[null,"Ratio - small scale LV domestic and one-off commercial - contestable","%",null,null,null,null,null,{"$f":"1-I187","v":1},{"$f":"1-J187","v":1},{"$f":"1-K187","v":1},{"$f":"1-L187","v":1},{"$f":"1-M187","v":1}]
[null,"All other LV (with only LV work)","£m"]
[null,"Ratio - all other LV (with only LV work) - non-contestable","%"]
[null,"Ratio - all other LV (with only LV work) - contestable","%",null,null,null,null,null,{"$f":"1-I190","v":1},{"$f":"1-J190","v":1},{"$f":"1-K190","v":1},{"$f":"1-L190","v":1},{"$f":"1-M190","v":1}]
[null,"LV total","£m",null,null,null,null,null,{"$f":"SUM(I186,I189)","v":0},{"$f":"SUM(J186,J189)","v":0},{"$f":"SUM(K186,K189)","v":0},{"$f":"SUM(L186,L189)","v":0},{"$f":"SUM(M186,M189)","v":0},null,{"$f":"SUM(D192:G192)","v":0},{"$f":"SUM(H192)","v":0},{"$f":"SUM(D192:H192)","v":0},null,{"$f":"SUM(I192:M192)","v":0},{"$f":"IF(Q192<>0,(S192-Q192)/Q192,\"0\")","v":"0"}]
[null,"Connections with HV work"]
[null,"LV end connections involving HV work","£m"]
[null,"Ratio - LV end connections involving HV work - non-contestable","%"]
[null,"Ratio - LV end connections involving HV work - contestable","%",null,null,null,null,null,{"$f":"1-I195","v":1},{"$f":"1-J195","v":1},{"$f":"1-K195","v":1},{"$f":"1-L195","v":1},{"$f":"1-M195","v":1}]
[null,"HV end connections involving only HV work","£m"]
[null,"Ratio - HV end connections involving only HV work - non-contestable","%"]
[null,"Ratio - HV end connections involving only HV work - contestable","%",null,null,null,null,null,{"$f":"1-I198","v":1},{"$f":"1-J198","v":1},{"$f":"1-K198","v":1},{"$f":"1-L198","v":1},{"$f":"1-M198","v":1}]
[null,"HV total","£m",null,null,null,null,null,{"$f":"SUM(I194,I197)","v":0},{"$f":"SUM(J194,J197)","v":0},{"$f":"SUM(K194,K197)","v":0},{"$f":"SUM(L194,L197)","v":0},{"$f":"SUM(M194,M197)","v":0},null,{"$f":"SUM(D200:G200)","v":0},{"$f":"SUM(H200)","v":0},{"$f":"SUM(D200:H200)","v":0},null,{"$f":"SUM(I200:M200)","v":0},{"$f":"IF(Q200<>0,(S200-Q200)/Q200,\"0\")","v":"0"}]
[null,"Connections with EHV work"]
[null,"HV end connections involving EHV work","£m"]
[null,"Ratio - HV end connections involving EHV work - non-contestable","%"]
[null,"Ratio - HV end connections involving EHV work - contestable","%",null,null,null,null,null,{"$f":"1-I203","v":1},{"$f":"1-J203","v":1},{"$f":"1-K203","v":1},{"$f":"1-L203","v":1},{"$f":"1-M203","v":1}]
[null,"EHV end connections involving only EHV work","£m"]
[null,"Ratio - EHV end connections involving only EHV work - non-contestable","%"]
[null,"Ratio - EHV end connections involving only EHV work - contestable","%",null,null,null,null,null,{"$f":"1-I206","v":1},{"$f":"1-J206","v":1},{"$f":"1-K206","v":1},{"$f":"1-L206","v":1},{"$f":"1-M206","v":1}]
[null,"EHV total","£m",null,null,null,null,null,{"$f":"SUM(I202,I205)","v":0},{"$f":"SUM(J202,J205)","v":0},{"$f":"SUM(K202,K205)","v":0},{"$f":"SUM(L202,L205)","v":0},{"$f":"SUM(M202,M205)","v":0},null,{"$f":"SUM(D208:G208)","v":0},{"$f":"SUM(H208)","v":0},{"$f":"SUM(D208:H208)","v":0},null,{"$f":"SUM(I208:M208)","v":0},{"$f":"IF(Q208<>0,(S208-Q208)/Q208,\"0\")","v":"0"}]
[null,"Connections with 132kV work"]
[null," HV or EHV connections involving 132kV work","£m"]
[null,"Ratio - HV or EHV connections involving 132kV work - non-contestable","%"]
[null,"Ratio - HV or EHV connections involving 132kV work - contestable","%",null,null,null,null,null,{"$f":"1-I211","v":1},{"$f":"1-J211","v":1},{"$f":"1-K211","v":1},{"$f":"1-L211","v":1},{"$f":"1-M211","v":1}]
[null,"132kV end connections involving only 132kV work","£m"]
[null,"Ratio - 132kV end connections involving only 132kV work - non-contestable","%"]
[null,"Ratio - 132kV end connections involving only 132kV work - contestable","%",null,null,null,null,null,{"$f":"1-I214","v":1},{"$f":"1-J214","v":1},{"$f":"1-K214","v":1},{"$f":"1-L214","v":1},{"$f":"1-M214","v":1}]
[null,"132kV total","£m",null,null,null,null,null,{"$f":"SUM(I210,I213)","v":0},{"$f":"SUM(J210,J213)","v":0},{"$f":"SUM(K210,K213)","v":0},{"$f":"SUM(L210,L213)","v":0},{"$f":"SUM(M210,M213)","v":0},null,{"$f":"SUM(D216:G216)","v":0},{"$f":"SUM(H216)","v":0},{"$f":"SUM(D216:H216)","v":0},null,{"$f":"SUM(I216:M216)","v":0},{"$f":"IF(Q216<>0,(S216-Q216)/Q216,\"0\")","v":"0"}]
[null,"Total sole use expenditure where there is also expenditure subject to the apportionment rule",null,{"$f":"SUM(D192,D200,D208,D216)","v":0},0,0,0,0,0,0,0,0,0,null,{"$f":"SUM(O192,O200,O208,O216)","v":0},{"$f":"SUM(P192,P200,P208,P216)","v":0},{"$f":"SUM(Q192,Q200,Q208,Q216)","v":0},null,{"$f":"SUM(S192,S200,S208,S216)","v":0},{"$f":"IF(Q217<>0,(S217-Q217)/Q217,\"0\")","v":"0"}]
[]
[null,"Customer specific demand investment - all expenditure subject to the apportionment rule - Table 8"]
[]
[null,null,null,"DPCR4",null,null,null,null,"DPCR5",null,null,null,null,null,"DPCR4",null,null,null,"DPCR5"]
[null,"Customer specific demand investment","Units","2005/06","2006/07","2007/08","2008/09","2009/10","2010/11","2011/12","2012/13","2013/14","2014/15",null,"Actuals","Forecast","Total",null,"Forecast","% change"]
[null,"New connections & customer specific reinforcement:"]
[null,"Connections provided at LV"]
[null,"Small scale LV domestic and one-off commercial","£m"]
[null,"All other LV (with only LV work)","£m"]
[null,"LV total","£m",null,null,null,null,null,{"$f":"SUM(I225,I226)","v":0},{"$f":"SUM(J225,J226)","v":0},{"$f":"SUM(K225,K226)","v":0},{"$f":"SUM(L225,L226)","v":0},{"$f":"SUM(M225,M226)","v":0},null,{"$f":"SUM(D227:G227)","v":0},{"$f":"SUM(H227)","v":0},{"$f":"SUM(D227:H227)","v":0},null,{"$f":"SUM(I227:M227)","v":0},{"$f":"IF(Q227<>0,(S227-Q227)/Q227,\"0\")","v":"0"}]
[null,"Connections with HV work"]
[null,"LV end connections involving HV work","£m"]
[null,"HV end connections involving only HV work","£m"]
[null,"HV total","£m",null,null,null,null,null,{"$f":"SUM(I229,I230)","v":0},{"$f":"SUM(J229,J230)","v":0},{"$f":"SUM(K229,K230)","v":0},{"$f":"SUM(L229,L230)","v":0},{"$f":"SUM(M229,M230)","v":0},null,{"$f":"SUM(D231:G231)","v":0},{"$f":"SUM(H231)","v":0},{"$f":"SUM(D231:H231)","v":0},null,{"$f":"SUM(I231:M231)","v":0},{"$f":"IF(Q231<>0,(S231-Q231)/Q231,\"0\")","v":"0"}]
[null,"Connections with EHV work"]
[null,"HV end connections involving EHV work","£m"]
[null,"EHV end connections involving only EHV work","£m"]
[null,"EHV total","£m",null,null,null,null,null,{"$f":"SUM(I233,I234)","v":0},{"$f":"SUM(J233,J234)","v":0},{"$f":"SUM(K233,K234)","v":0},{"$f":"SUM(L233,L234)","v":0},{"$f":"SUM(M233,M234)","v":0},null,{"$f":"SUM(D235:G235)","v":0},{"$f":"SUM(H235)","v":0},{"$f":"SUM(D235:H235)","v":0},null,{"$f":"SUM(I235:M235)","v":0},{"$f":"IF(Q235<>0,(S235-Q235)/Q235,\"0\")","v":"0"}]
[null,"Connections with 132kV work"]
[null," HV or EHV connections involving 132kV work","£m"]
[null,"132kV end connections involving only 132kV work","£m"]
[null,"132kV total","£m",null,null,null,null,null,{"$f":"SUM(I237,I238)","v":0},{"$f":"SUM(J237,J238)","v":0},{"$f":"SUM(K237,K238)","v":0},{"$f":"SUM(L237,L238)","v":0},{"$f":"SUM(M237,M238)","v":0},null,{"$f":"SUM(D239:G239)","v":0},{"$f":"SUM(H239)","v":0},{"$f":"SUM(D239:H239)","v":0},null,{"$f":"SUM(I239:M239)","v":0},{"$f":"IF(Q239<>0,(S239-Q239)/Q239,\"0\")","v":"0"}]
[null,"Total connections expenditure subject to the apportionment rule",null,{"$f":"SUM(D227,D231,D235,D239)","v":0},0,0,0,0,0,0,0,0,0,null,{"$f":"SUM(O227,O231,O235,O239)","v":0},{"$f":"SUM(P227,P231,P235,P239)","v":0},{"$f":"SUM(Q227,Q231,Q235,Q239)","v":0},null,{"$f":"SUM(S227,S231,S235,S239)","v":0},{"$f":"IF(Q240<>0,(S240-Q240)/Q240,\"0\")","v":"0"}]
[]
[]
[null,"Customer contributions - customer specific demand investment - contributions associated with apportionment rule - Table 9"]
[]
[null,null,null,"DPCR4",null,null,null,null,"DPCR5",null,null,null,null,null,"DPCR4",null,null,null,"DPCR5"]
[null,"Customer contributions - customer specific demand investment","Units","2005/06","2006/07","2007/08","2008/09","2009/10","2010/11","2011/12","2012/13","2013/14","2014/15",null,"Actuals","Forecast","Total",null,"Forecast","% change"]
[null,"Customer contributions (directs) for connections at LV"]
[null,"Small scale LV domestic and one-off commercial","£m"]
[null,"All other LV (with only LV work)"]
[null,"LV total","£m",null,null,null,null,null,{"$f":"SUM(I248:I249)","v":0},{"$f":"SUM(J248:J249)","v":0},{"$f":"SUM(K248:K249)","v":0},{"$f":"SUM(L248:L249)","v":0},{"$f":"SUM(M248:M249)","v":0},null,{"$f":"SUM(D250:G250)","v":0},{"$f":"SUM(H250)","v":0},{"$f":"SUM(D250:H250)","v":0},null,{"$f":"SUM(I250:M250)","v":0},{"$f":"IF(Q250<>0,(S250-Q250)/Q250,\"0\")","v":"0"}]
[null,"Customer contributions (directs) for connections with HV work"]
[null,"LV end connections involving HV work","£m"]
[null,"HV end connections involving only HV work","£m"]
[null,"HV total","£m",null,null,null,null,null,{"$f":"SUM(I252:I253)","v":0},{"$f":"SUM(J252:J253)","v":0},{"$f":"SUM(K252:K253)","v":0},{"$f":"SUM(L252:L253)","v":0},{"$f":"SUM(M252:M253)","v":0},null,{"$f":"SUM(D254:G254)","v":0},{"$f":"SUM(H254)","v":0},{"$f":"SUM(D254:H254)","v":0},null,{"$f":"SUM(I254:M254)","v":0},{"$f":"IF(Q254<>0,(S254-Q254)/Q254,\"0\")","v":"0"}]
[null,"Customer contributions (directs) for connections with EHV work"]
[null,"HV end connections involving EHV work","£m"]
[null,"EHV end connections involving only EHV work","£m"]
[null,"EHV total","£m",null,null,null,null,null,{"$f":"SUM(I256:I257)","v":0},{"$f":"SUM(J256:J257)","v":0},{"$f":"SUM(K256:K257)","v":0},{"$f":"SUM(L256:L257)","v":0},{"$f":"SUM(M256:M257)","v":0},null,{"$f":"SUM(D258:G258)","v":0},{"$f":"SUM(H258)","v":0},{"$f":"SUM(D258:H258)","v":0},null,{"$f":"SUM(I258:M258)","v":0},{"$f":"IF(Q258<>0,(S258-Q258)/Q258,\"0\")","v":"0"}]
[null,"Customer contributions (directs) for connections with 132kV work"]
[null," HV or EHV connections involving 132kV work","£m"]
[null,"132kV end connections involving only 132kV work","£m"]
[null,"132kV total","£m",null,null,null,null,null,{"$f":"SUM(I260:I261)","v":0},{"$f":"SUM(J260:J261)","v":0},{"$f":"SUM(K260:K261)","v":0},{"$f":"SUM(L260:L261)","v":0},{"$f":"SUM(M260:M261)","v":0},null,{"$f":"SUM(D262:G262)","v":0},{"$f":"SUM(H262)","v":0},{"$f":"SUM(D262:H262)","v":0},null,{"$f":"SUM(I262:M262)","v":0},{"$f":"IF(Q262<>0,(S262-Q262)/Q262,\"0\")","v":"0"}]
[null,"Total customer contributions associated with apportionment rule",null,{"$f":"SUM(D250,D254,D258,D262)","v":0},0,0,0,0,0,0,0,0,0,null,{"$f":"SUM(O250,O254,O258,O262)","v":0},{"$f":"SUM(P250,P254,P258,P262)","v":0},{"$f":"SUM(Q250,Q254,Q258,Q262)","v":0},null,{"$f":"SUM(S250,S254,S258,S262)","v":0},{"$f":"IF(Q263<>0,(S263-Q263)/Q263,\"0\")","v":"0"}]
[]
[]
[null,null,null,{"$f":"SUM(D240:M240) - SUM(D263:M263)","v":0}]

{"sheet":"FBPQ LR4","index":15,"n_rows":99,"n_cols":37,"rows_kept":99,"cut":false,"hidden":false,"merged":[[42,35,43,35],[43,21,43,30],[6,18,6,19],[42,2,42,10],[42,11,42,15],[42,16,42,20],[42,21,42,34],[31,2,32,2],[23,2,24,2]]}
["June Forecast Business Plan DPCR5"]
["EDFE SPN"]
["LR4 - General reinforcement"]
[]
[null,"General reinforcement expenditure"]
[]
[null,null,null,"DPCR4",null,null,null,null,"DPCR5",null,null,null,null,null,"DPCR4",null,null,null,"DPCR5"]
[null,null,null,"2005/06","2006/07","2007/08","2008/09","2009/10","2010/11","2011/12","2012/13","2013/14","2014/15",null,"Actuals","Forecast","Total",null,"Forecast","% change"]
[null,null,null,"(£m)","(£m)","(£m)","(£m)","(£m)","(£m)","(£m)","(£m)","(£m)","(£m)",null,"(£m)","(£m)","(£m)",null,"(£m)","(£m)"]
[null,null,"General reinforcement:"]
[null,null,"LV System",0.1,0.1,0.3,0.2,0.2,0.2,0.2,0.2,0.2,0.2,null,{"$f":"SUM(D11:G11)","v":0.7},{"$f":"H11","v":0.2},{"$f":"SUM(D11:H11)","v":0.89999999999999991},null,{"$f":"SUM(I11:M11)","v":1},{"$f":"IF(Q11<>0,(S11-Q11)/Q11,\"0\")","v":0.11111111111111122}]
[null,null,"HV System",1.3,2,0.9,1,1.1000000000000001,1.2,1.2,1.3,1.3,1.3,null,5.2,1.1000000000000001,6.3000000000000007,null,6.3,-1.4098070153970241E-16]
[null,null,"EHV System",2.2000000000000002,1.6,1.4,2,2.7,2.6,1.8,1.5,1.1000000000000001,0.8,null,7.2,2.7,9.9,null,7.8,-0.21212121212121215]
[null,null,"132kV System",1.3,2,1.1000000000000001,0.9,0.8,1.2,0.2,0.6,0.6,0.6,null,5.3000000000000007,0.8,6.1000000000000005,null,3.2,-0.4754098360655738,null,null," "]
[null,null,"Expenditure on DSM to avoid general reinforcement",null,null,null,0,0,0,0,0,0,0,null,0,0,{"$f":"SUM(D15:H15)","v":0},null,0,"0"]
[null,null,"Total",4.9000000000000004,5.7,3.7,4.0999999999999996,4.8,{"$f":"SUM(I11:I15)","v":5.2},{"$f":"SUM(J11:J15)","v":3.4000000000000004},{"$f":"SUM(K11:K15)","v":3.6},{"$f":"SUM(L11:L15)","v":3.2},{"$f":"SUM(M11:M15)","v":2.9},null,18.399999999999999,4.8,23.2,null,18.3,-0.21120689655172409]
[]
[null,null,"Expenditure avoided due to DG",null,null,null,0,0,0,0,0,0,0,null,{"$f":"SUM(D18:G18)","v":0},{"$f":"H18","v":0},0,null,{"$f":"SUM(I18:M18)","v":0},{"$f":"IF(Q18<>0,(S18-Q18)/Q18,\"0\")","v":"0"}]
[null,null,"Expenditure avoided due to DSM",null,null,null,0,0,0,0,0,0,0,null,{"$f":"SUM(D19:G19)","v":0},{"$f":"H19","v":0},0,null,{"$f":"SUM(I19:M19)","v":0},{"$f":"IF(Q19<>0,(S19-Q19)/Q19,\"0\")","v":"0"}]
[]
[]
[null,"General reinforcement outputs"]
[]
[null,null,"Changes in general utilisation due to projected expenditure levels","At 31st March 2010",null,null,null,"At 31st March 2015",null,null,null,"At 31st March 2010","At 31st March 2015"]
[null,null,null,"132kV-EHV","132kV - HV","EHV - EHV","EHV - HV","132kV-EHV","132kV - HV","EHV - EHV","EHV - HV","Total","Total"]
[null,null,"Total number substations (operated by DNO)",null,null,null,null,null,null,null,null,{"$f":"SUM(D26:G26)","v":0},{"$f":"SUM(H26:K26)","v":0}]
[null,null,"Σ substation maximum demands",null,null,null,null,null,null,null,null,{"$f":"SUM(D27:G27)","v":0},{"$f":"SUM(H27:K27)","v":0}]
[null,null,"Σ substation firm capacities ",null,null,null,null,null,null,null,null,{"$f":"SUM(D28:G28)","v":0},{"$f":"SUM(H28:K28)","v":0}]
[null,null,"Σ substation maximum demands / Σ substation firm capacities ",{"$f":"IF(D27,D27/D28,\"-\")","v":"-"},{"$f":"IF(E27,E27/E28,\"-\")","v":"-"},"-","-","-","-","-","-","-","-"]
[]
[]
[null,null,"Changes in utilisation of highly loaded substations due to projected expenditure levels","At 31st March 2010",null,null,null,"At 31st March 2015",null,null,null,"At 31st March 2010","At 31st March 2015"]
[null,null,null,"132kV-EHV","132kV - HV","EHV - EHV","EHV - HV","132kV-EHV","132kV - HV","EHV - EHV","EHV - HV","Total","Total"]
[null,null,"Number of substations loaded >=80% of firm capacity",null,null,null,null,null,null,null,null,{"$f":"SUM(D34:G34)","v":0},{"$f":"SUM(H34:K34)","v":0}]
[null,null,"Σ substation maximum demands for substations loaded >=80% of firm capacity",null,null,null,null,null,null,null,null,0,0]
[null,null,"Σ substation firm capacities for substations loaded >=80% of firm capacity",null,null,null,null,null,null,null,null,0,0]
[null,null,"% Loading of substations which are operating at >=80% of firm capacity  = Σ demand /Σ firm capacity ",{"$f":"IF(D35,D35/D36,\"-\")","v":"-"},{"$f":"IF(E35,E35/E36,\"-\")","v":"-"},"-","-","-","-","-","-","-","-"]
[null,null,"Number of substations loaded above 100% of firm capacity",null,null,null,null,null,null,null,null,0,0]
[null,null,"Number of DNO substations requiring reinforcement within 5 yrs",null,null,null,null,null,null,null,null,0,0]
[]
[null,"General reinforcement projects"]
[]
[null,null,"Scheme details",null,null,null,null,null,null,null,null,"DPCR4 Expenditure",null,null,null,null,"DPCR5 Expenditure",null,null,null,null,"Utilisation",null,null,null,null,null,null,null,null,null,null,null,null,null,"(N-2) scheme?","Scheme description"]
[null,null,"Named scheme","Primary Voltage","Secondary Voltage","Limiting \nFactor","Forecast year in which substation demand will reach substation/group firm capacity","Planned reinforce-ment Year","MVA of additional firm capacity to be installed","Total cost of project","Total cost of project in DPCR5 period","2005/06","2006/07","2007/08","2008/09","2009/10","2010/11","2011/12","2012/13","2013/14","2014/15","Historic and forecast max demand (MVA)",null,null,null,null,null,null,null,null,null,"Substation/Group Total\nCapability","Substation/group firm capacity under single circuit outage conditions","Substation/Group Maximum Demand","Season of critical loading condition",null,"Brief description of work involved, substations affected, assets installed/replaced etc."]
[null,null,"(Unique name)","(kV)","(kV)","(a-j)","(Year)","(Year)","(MVA)","(£m)","(£m)","(£m)","(£m)","(£m)","(£m)","(£m)","(£m)","(£m)","(£m)","(£m)","(£m)","2005/06","2006/07","2007/08","2008/09","2009/10","2010/11","2011/12","2012/13","2013/14","2014/15","(MVA)","(MVA)","(MVA)","Season","(Y/N)","(Description)"]
[null,1,null,"33/11",null,"a","2008/9",null,10,0.6,{"$f":"SUM(Q46:U46)","v":0.6},null,null,null,null,null,0.6,0,0,0,0,null,null,null,null,null,null,null,null,null,null,null,null,null,null,null,"Change 33/11 transformer units to 12/24 and replace 11kV switchboard"]
[null,2,null,33,null,"c","2008/9",null,4.5999999999999996,1.4,{"$f":"SUM(Q47:U47)","v":1.4},null,null,null,null,null,0,0.7,0.7,0,0,null,null,null,null,null,null,null,null,null,null,null,null,null,null,null,"Establish new 33kV circuit into Tregaron site."]
[null,3,null,33,null,"a","2011/12",null,3,0.45,0.45,null,null,null,null,null,0,0.45,0,0,0,null,null,null,null,null,null,null,null,null,null,null,null,null,null,null,"11kV load transfer to Waterton 132/11"]
[null,4,null,33,null,"d","2014/15",null,23,0.8,0.8,null,null,null,null,null,0,0,0,0.6,0.2,null,null,null,null,null,null,null,null,null,null,null,null,null,null,null,"Establish 3rd 33kV circuit (cable) to s/s and additional 12/24 transformer & 11kV Swbd Change"]
[null,5,null,33,null,"b","2011/12",null,7.1,0.3,0.3,null,null,null,null,null,0,0.3,0,0,0,null,null,null,null,null,null,null,null,null,null,null,null,null,null,null,"Establish 33kV switchboard and 2nd transformer unit."]
[null,6,null,33,null,"c","2009/10",null,7.1,0.8,0.79999999999999993,null,null,null,null,null,0.3,0.4,0.1,0,0,null,null,null,null,null,null,null,null,null,null,null,null,null,null,null,"Install 2nd transformer, and 33kV circuit (o/h)"]
[null,7,null,33,null,"a/b","2013/14",null,6,1.2,1.2,null,null,null,null,null,0,0,1.2,0,0,null,null,null,null,null,null,null,null,null,null,null,null,null,null,null,"Increase 11kV Interconnection between  3 Tx Group"]
[null,8,null,"33/11",null,"a","2013/14",null,17.899999999999999,0.7,0.7,null,null,null,null,null,0,0,0,0.7,0,null,null,null,null,null,null,null,null,null,null,null,null,null,null,null,"Overlay 33kV circuits and install 19/38 MVA 33/11 units"]
[null,9,null,33,null,"b",2009,null,20,0.4,0.4,null,null,null,null,null,0.4,0,0,0,0,null,null,null,null,null,null,null,null,null,null,null,null,null,null,null,"Establish new 33kV circuit to Gas Yard, to remove load from  Gas Yard/Nelson 33kV ring."]
[null,10,null,66,null,"j","2009/10",null,6,0.2,0.2,null,null,null,null,null,0.2,0,0,0,0,null,null,null,null,null,null,null,null,null,null,null,null,null,null,null,"Establish 66kV bar with bus-section breaker"]
[null,11,null,66,null,"j","2008/9",null,12,0.3,0.3,null,null,null,null,null,0.3,0,0,0,0,null,null,null,null,null,null,null,null,null,null,null,null,null,null,null,"Reconductor front end of 66kV circuits Abergavenny to Crickhowell or apply higher operating Temp/increasing height"]
[null,12,null,33,null,"b","2008/9",null,6,0.9,0.9,null,null,null,null,null,0,0.5,0.4,0,0,null,null,null,null,null,null,null,null,null,null,null,null,null,null,null,"Increase height to allow higher Op Temp, installation of 11kV Cap Bank Brawdy"]
[null,13,null,"33/11",null,"a","2013/14",null,14,1.7,1.7,null,null,null,null,null,0.2,0,0.7,0.8,0,null,null,null,null,null,null,null,null,null,null,null,null,null,null,null,"Install addition 33/11 Tx capacity 11kV interconnection between sites"]
[null,14,null,33,null,"a","2008/9",null,15,1.6,1.6,null,null,null,null,null,0,0,0.4,0.6,0.6,null,null,null,null,null,null,null,null,null,null,null,null,null,null,null,"Additional Grid Tx at Rhos or 33 kV circuit uprating"]
[null,15,null,"33/11",null,"f","2008/9",null,6.2,0.8,0.8,null,null,null,null,null,0.6,0.2,0,0,0,null,null,null,null,null,null,null,null,null,null,null,null,null,null,null,"New 33kV tranformer circuit and 33/11kV transformer"]
[null,16,null,"33/11",null,"a","2008/9",null,15,0.45,0.45,null,null,null,null,null,0,0.45,0,0,0,null,null,null,null,null,null,null,null,null,null,null,null,null,null,null,"Transformer change to 19/38 MVA units & 33/11kV Swbd Change"]
[null,17,null,33,null," "," ",null," ",2.2999999999999998,2.2999999999999998,null,null,null,null,null,0.2,0.2,0.2,0.2,1.5,null,null,null,null,null,null,null,null,null,null,null,null,null,null,null,"Typically smaller schemes. Unidentified larger scheme(s) 2014/15."]
[null,18,null,"132/11",null,"a","2010/11",null,11.3,2.5,0.5,null,null,null,1,1,0.5,0,0,0,0,null,null,null,null,null,null,null,null,null,null,null,null,null,null,null,"Establish 132/11kV susbstaion at Abergavenny"]
[null,19,null,"132/11",null,"b","2010/11",null,14.5,2,1.5,null,null,null,null,0.5,1.5,0,0,0,0,null,null,null,null,null,null,null,null,null,null,null,null,null,null,null,"Establish 132/11kV substation near Pentrebach to deload existing 33kV ccts"]
[null,20,null,"132/33",null,"c","2011/12",null,11,1,1,null,null,null,null,null,0,1,0,0,0,null,null,null,null,null,null,null,null,null,null,null,null,null,null,null,"Establish a second 132/33 transformer"]
[null,21,null,"132/33",null,"a","2013/14",null,40,1,1,null,null,null,null,null,0,0,0,0,1,null,null,null,null,null,null,null,null,null,null,null,null,null,null,null,"Establish second 132/33kv unit and break parallel."]
[null,22,null,"132/33",null,"c","2014/15",null,40,1,1,null,null,null,null,null,0,0,0,1,0,null,null,null,null,null,null,null,null,null,null,null,null,null,null,null,"Establish second 132/33kv unit and break parallel."]
[null,23,null,"132/11",null,"a","2014/15",null,30,1.2,1.2,null,null,null,null,null,0,0,0,0,1.2,null,null,null,null,null,null,null,null,null,null,null,null,null,null,null,"Establish new 132/11kV site"]
[null,24,null,132,null," "," ",null," ",0.6,0.6,null,null,null,null,null,0,0,0.6,0," ",null,null,null,null,null,null,null,null,null,null,null,null,null,null,null,"Unidentified"]
[null,25,null,null,null,null,null,null,null,null,0]
[null,26,null,null,null,null,null,null,null,null,0]
[null,27,null,null,null,null,null,null,null,null,0]
[null,28,null,null,null,null,null,null,null,null,0]
[null,29,null,null,null,null,null,null,null,null,0]
[null,30,null,null,null,null,null,null,null,null,0]
[null,31,null,null,null,null,null,null,null,null,0]
[null,32,null,null,null,null,null,null,null,null,0]
[null,33,null,null,null,null,null,null,null,null,0]
[null,34,null,null,null,null,null,null,null,null,0]
[null,35,null,null,null,null,null,null,null,null,{"$f":"SUM(Q80:U80)","v":0}]
[null,36,null,null,null,null,null,null,null,null,{"$f":"SUM(Q81:U81)","v":0}]
[null,37,null,null,null,null,null,null,null,null,0]
[null,38,null,null,null,null,null,null,null,null,0]
[null,39,null,null,null,null,null,null,null,null,0]
[null,40,null,null,null,null,null,null,null,null,0]
[null,41,null,null,null,null,null,null,null,null,0]
[null,42,null,null,null,null,null,null,null,null,0]
[null,43,null,null,null,null,null,null,null,null,0]
[null,44,null,null,null,null,null,null,null,null,0]
[null,45,null,null,null,null,null,null,null,null,0]
[null,46,null,null,null,null,null,null,null,null,0]
[null,47,null,null,null,null,null,null,null,null,0]
[null,48,null,null,null,null,null,null,null,null,0]
[null,49,null,null,null,null,null,null,null,null,0]
[null,50,null,null,null,null,null,null,null,null,0]
[null,51,null,null,null,null,null,null,null,null,0]
[null,52,null,null,null,null,null,null,null,null,0]
[null,53,null,null,null,null,null,null,null,null,0]
[null,null,"Total",null,null,null,null,null,{"$f":"SUM(I46:I98)","v":319.7},24.2,21.7,0,0,0,1,1.5,4.8,4.2000000000000011,4.3,3.9,4.5,{"$f":"SUM(V46:V98)","v":0},{"$f":"SUM(W46:W98)","v":0},0,0,0,0,0,0,0,0,0,0,0]

{"sheet":"FBPQ LR6","index":16,"n_rows":32,"n_cols":19,"rows_kept":32,"cut":false,"hidden":false,"merged":[[23,1,25,1],[9,1,9,2],[10,1,10,2],[11,1,11,2],[7,1,8,2],[15,1,16,2],[17,1,17,2],[18,1,18,2],[19,1,19,2]]}
["Main Forecast Business Plan DPCR5",null,null,null,null,"Index"]
[]
["LR6 - Fault levels"]
[]
[]
[null,"Fault level system measures"]
[]
[null,null,null,"As at 31st March 2010",null,null,"As at 31st March 2015"]
[null,null,null,"132kV","EHV","HV","132kV","EHV","HV"]
[null,"No. of switchboards",null,127,172,207,127,172,207]
[null,"No. of switchboards @ >95% of F.L.",null,4,9,4,4,9,4]
[null,"No. of switchboards having fault level 'operational restrictions'",null,0,0,0,0,0,0]
[]
[null,"Number of fault level schemes"]
[]
[null,"No. of schemes",null,"DPCR4",null,null,"DPCR5"]
[null,null,null,"132kV","EHV","HV","132kV","EHV","HV"]
[null,"Switchboards",null,0,0,0,0,1,0]
[null,"Transformers",null,0,0,0,0,0,0]
[null,"Other",null,0,0,0,0,0,0]
[]
[null,"Fault level reinforcement"]
[]
[null,null,"DPCR4",null,null,null,null,"DPCR5",null,null,null,null,null,"DPCR4",null,null,null,"DPCR5"]
[null,null,"2005/06","2006/07","2007/08","2008/09","2009/10","2010/11","2011/12","2012/13","2013/14","2014/15",null,"Actuals","Forecast","Total",null,"Forecast","% change"]
[null,null,"(£m)","(£m)","(£m)","(£m)","(£m)","(£m)","(£m)","(£m)","(£m)","(£m)",null,"(£m)","(£m)","(£m)",null,"(£m)","(£m)"]
[null,"Fault level reinforcement:"]
[null,"LV ",0,0,0,0,0,0,0,0,0,0,null,0,0,0,null,0,"0"]
[null,"HV",0,0,0,0,0,0,0,0,0,0,null,0,0,0,null,0,"0"]
[null,"EHV ",0,0,0,0,0,0,0.7,0,0,0,null,0,0,0,null,0.7,"0"]
[null,"132kV ",0,0,0,0,0,0,0,0,0,0,null,0,0,0,null,0,"0"]
[null,"Total expenditure",0,0,0,0,0,0,0.7,0,0,0,null,0,0,0,null,0.7,"0"]

{"sheet":"FBPQ NL1 0309","index":17,"n_rows":153,"n_cols":20,"rows_kept":153,"cut":false,"hidden":false,"merged":[[120,1,123,1],[124,1,127,1],[129,1,132,1],[133,1,136,1],[88,1,93,1],[94,1,99,1],[108,1,113,1],[114,1,119,1],[75,1,76,1],[77,1,78,1],[79,1,81,1],[82,1,87,1],[46,1,48,1],[49,1,54,1],[55,1,60,1],[61,1,66,1],[6,1,8,2],[39,1,41,2],[72,1,74,2],[105,1,107,2],[141,1,143,2],[67,1,67,2],[34,1,34,2],[100,1,100,2],[22,1,27,1],[28,1,33,1],[42,1,43,1],[44,1,45,1],[9,1,10,1],[11,1,12,1],[13,1,15,1],[16,1,21,1]]}
["June Forecast Business Plan DPCR5",null,null,null,null,null," "]
["EDFE SPN"]
["NL1 - Condition based expenditure"]
[]
[null,"Total condition based replacement"]
[]
[null,"Asset Categories",null,"DPCR 4",null,null,null,null,"DPCR 5",null,null,null,null,null,"DPCR4",null,null,null,"DPCR5"]
[null,null,null,"2005/06","2006/07","2007/08","2008/09","2009/10","2010/11","2011/12","2012/13","2013/14","2014/15",null,"Actuals","Forecast","Total",null,"Forecast","% change"]
[null,null,null,"£m","£m","£m","£m","£m","£m","£m","£m","£m","£m"]
[null,"Metered LV Services","Overhead",1,0.9,1.5,0.97998063017283144,0.4485690832677206,0.82,0.89,1,1,1,null,3.4,1.428549713440552,4.8285497134405517,null,4.71,-2.4551826216174532E-2]
[null,null,"Underground",0.5,0.7,0.6,0.67949511643393978,0.39907437960130709,1.04,1.18,1.32,1.47,1.62,null,1.8,1.078569496035247,2.8785694960352468,null,6.63,1.3032273527290996]
[null,"Un-metered LV Services","Overhead",0,0,0,9.4228906747387629E-3,3.1592364042391595E-2,0,0,0,0,0,null,0,4.1015254717130356E-2,4.1015254717130356E-2,null,0,-1]
[null,null,"Underground",0,-0.10413095862701416,-0.2,-3.4053020369104861E-2,-5.3770690340651767E-2,-0.1,-0.1,-0.1,-0.1,-0.1,null,-0.30413095862701411,-8.7823710709756628E-2,-0.3919546693367707,null,-0.5,0.27565772043500231]
[null,"LV System","Overhead mains",1.7,1.7,2,1.457407091026262,1.4107007325510907,1.61,1.76,1.94,1.94,1.94,null,5.4,2.8681078235773527,8.2681078235773526,null,9.19,0.11149977674381281]
[null,null,"Underground mains",0.2,0.2,0.3,0.18008191067278526,0.22106157602826107,0.57999999999999996,0.67,0.75,0.83,0.93,null,0.7,0.40114348670104633,1.1011434867010463,null,3.76,2.4146321940882687]
[null,null,"Switchgear (incl other plant & equipment)",0.2,0.1,0.1,0.26593491459818286,0.30855208881402457,0.47,0.51,0.56000000000000005,0.61,0.66,null,0.4,0.57448700341220738,0.97448700341220751,null,2.81,1.8835684726021651]
[null,"HV","Overhead lines",1.9,5.2,5,3.4246972663411661,3.2169433076456775,5.15,7.1,9.07,9.07,9.07,null,12.1,6.6416405739868436,18.741640573986842,null,39.46,1.1054720286744788]
[null,null,"Underground cables",0.2,0.6,1.1000000000000001,0.43135899533248562,0.24747351833206749,0.43,0.48,0.55000000000000004,0.61,0.69,null,1.9,0.67883251366455311,2.5788325136645529,null,2.76,7.0251745848358971E-2]
[null,null,"Submarine",0,0,0,0,0,0.05,0.05,0.05,0.05,0.05,null,0,0,0,null,0.25,"0"]
[null,null,"Switchgear (incl other plant & equipment)",0.9,1.1000000000000001,2.6,1.9861359566643817,2.5316014385969798,1.81,1.88,1.94,1.99,2.04,null,4.5999999999999996,4.5177373952613618,9.1177373952613614,null,9.66,5.9473373846066414E-2]
[null,null,"Transformers ",0.1,0.8,0.8,0.48475537582267192,0.91512547842794323,1.76,1.85,1.93,2.0099999999999998,2.08,null,1.7,1.3998808542506151,3.0998808542506149,null,9.6300000000000008,2.1065710112035956]
[null,null,"Substation",0.6,1,0.8,0.6470384929987284,0.48757548505424364,0.7,0.7,0.7,0.7,0.7,null,2.4,1.134613978052972,3.5346139780529722,null,3.5,-9.7928594941049663E-3]
[null,"EHV","Overhead lines",0.3,0.4,0.9,2.0772238998535228,1.2089344640221851,0.66,1.08,1.51,1.51,1.52,null,1.6,3.2861583638757077,4.8861583638757082,null,6.28,0.28526329527696592]
[null,null,"Underground cables",0.8,0.9,0,4.7114453373693813E-2,0.10846711654554447,0.14000000000000001,0.17,0.2,0.23,0.26,null,1.7,0.15558156991923827,1.8555815699192384,null,1,-0.46108539974153567]
[null,null,"Submarine",0,0,0,0,0,0.1,0.1,0.1,0.1,0.1,null,0,0,0,null,0.5,"0"]
[null,null,"Switchgear (incl other plant & equipment)",0.5,1.3,1.9,1.0752565247729677,1.5185396316376227,0.65,0.66,0.67,0.67,0.67,null,3.7,2.5937961564105905,6.2937961564105906,null,3.32,-0.47249642068270825]
[null,null,"Transformers ",0.1,0.3,1,0.62191078453275839,0.36120602888467729,1.46,1.52,1.59,1.7,1.76,null,1.4,0.98311681341743573,2.3831168134174359,null,8.0299999999999994,2.369536883290595]
[null,null,"Substation",0.4,0.1,0.3,0.1382023965628352,0.21272191788543676,0.48,0.48,0.48,0.48,0.48,null,0.8,0.35092431444827199,1.1509243144482719,null,2.4,1.0852804740253557]
[null,"132kV","Overhead lines",0.5,1.3,1.1000000000000001,0.88575172342544373,0.3338259800479379,0.6,0.77,0.96,0.98,1,null,2.9,1.2195777034733817,4.1195777034733823,null,4.3099999999999996,4.6223741905891354E-2]
[null,null,"Underground cables",0,0,0.4,0.13087348159359394,0.16217413541761019,0.36,0.48,0.6,0.6,0.71,null,0.4,0.29304761701120413,0.6930476170112041,null,2.75,2.9679813226391087]
[null,null,"Submarine cables",0,0,0,0,0,0,0,0,0,0,null,0,0,0,null,0,"0"]
[null,null,"Switchgear (incl other plant & equipment)",1,1.8,0.1,0.55699753766233584,0.13584716538228386,0.16,0.17,0.18,0.2,0.21,null,2.9,0.69284470304461965,3.5928447030446198,null,0.92,-0.74393549511884527]
[null,null,"Transformers ",0.1,0.6,0.8,1.0417529134850076,0,2.29,2.29,2.29,2.14,2.14,null,1.5,1.0417529134850076,2.5417529134850074,null,11.15,3.3867363900105425]
[null,null,"Substation",0.2,0.2,0.9,0.23661925472121784,0.1937664994600018,0.21,0.21,0.21,0.21,0.21,null,1.3,0.4303857541812196,1.7303857541812198,null,1.05,-0.39319888789951535]
[null,"Total non-load replacement (£m)",null,11.2,19.095869041372989,22,17.323958590352451,14.399981701304355,21.43,24.9,28.5,29,29.74,null,52.295869041372988,31.723940291656806,84.019809333029798,null,133.57,0.58974414558081001]
[]
[]
[null,"Proactive condition based replacement (non fault)"]
[]
[null,"Asset Categories",null,"DPCR 4",null,null,null,null,"DPCR 5",null,null,null,null,null,"DPCR4",null,null,null,"DPCR5"]
[null,null,null,"2005/06","2006/07","2007/08","2008/09","2009/10","2010/11","2011/12","2012/13","2013/14","2014/15",null,"Actuals","Forecast","Total",null,"Forecast","% change"]
[null,null,null,"£m","£m","£m","£m","£m","£m","£m","£m","£m","£m"]
[null,"Metered LV Services","Overhead",1,0.9,1.5,0.97998063017283144,0.4485690832677206,0.82,0.89,1,1,1,null,3.4,1.428549713440552,4.8285497134405517,null,4.71,-2.4551826216174532E-2]
[null,null,"Underground",0.5,0.7,0.6,0.67949511643393978,0.39907437960130709,1.04,1.18,1.32,1.47,1.62,null,1.8,1.078569496035247,2.8785694960352468,null,6.63,1.3032273527290996]
[null,"Un-metered LV Services","Overhead",0,0,0,9.4228906747387629E-3,3.1592364042391595E-2,0,0,0,0,0,null,0,4.1015254717130356E-2,4.1015254717130356E-2,null,0,-1]
[null,null,"Underground",0,-0.10413095862701416,-0.2,-3.4053020369104861E-2,-5.3770690340651767E-2,-0.1,-0.1,-0.1,-0.1,-0.1,null,-0.30413095862701411,-8.7823710709756628E-2,-0.3919546693367707,null,-0.5,0.27565772043500231]
[null,"LV System","Overhead mains",1.7,1.7,2,1.457407091026262,1.4107007325510907,1.61,1.76,1.94,1.94,1.94,null,5.4,2.8681078235773527,8.2681078235773526,null,9.19,0.11149977674381281]
[null,null,"Underground mains",0.2,0.2,0.2,8.008191067278525E-2,0.12106157602826106,0.48,0.56999999999999995,0.65,0.73,0.83,null,0.6,0.20114348670104631,0.8011434867010464,null,3.26,3.0691836782247939]
[null,null,"Switchgear (incl other plant & equipment)",0.2,0.1,0.1,0.26593491459818286,0.30855208881402457,0.47,0.51,0.56000000000000005,0.61,0.66,null,0.4,0.57448700341220738,0.97448700341220751,null,2.81,1.8835684726021651]
[null,"HV","Overhead lines",1.9,5.2,5,3.4246972663411661,3.2169433076456775,5.15,7.1,9.07,9.07,9.07,null,12.1,6.6416405739868436,18.741640573986842,null,39.46,1.1054720286744788]
[null,null,"Underground cables",0.2,0.6,1.1000000000000001,0.43135899533248562,0.24747351833206749,0.43,0.48,0.55000000000000004,0.61,0.69,null,1.9,0.67883251366455311,2.5788325136645529,null,2.76,7.0251745848358971E-2]
[null,null,"Submarine",0,0,0,0,0,0,0,0,0,0,null,0,0,0,null,0,"0"]
[null,null,"Switchgear (incl other plant & equipment)",0.9,1.1000000000000001,2.5,1.8861359566643816,2.4316014385969797,1.71,1.78,1.84,1.89,1.94,null,4.5,4.3177373952613616,8.8177373952613607,null,9.16,3.8815241302442377E-2]
[null,null,"Transformers ",0.1,0.8,0.7,0.38475537582267194,0.81512547842794325,1.66,1.75,1.83,1.91,1.98,null,1.6,1.1998808542506152,2.7998808542506151,null,9.1300000000000008,2.2608530417068891]
[null,null,"Substation",0.6,1,0.8,0.6470384929987284,0.48757548505424364,0.7,0.7,0.7,0.7,0.7,null,2.4,1.134613978052972,3.5346139780529722,null,3.5,-9.7928594941049663E-3]
[null,"EHV","Overhead lines",0.3,0.4,0.9,2.0772238998535228,1.2089344640221851,0.66,1.08,1.51,1.51,1.52,null,1.6,3.2861583638757077,4.8861583638757082,null,6.28,0.28526329527696592]
[null,null,"Underground cables",0.8,0.9,0,4.7114453373693813E-2,0.10846711654554447,0.14000000000000001,0.17,0.2,0.23,0.26,null,1.7,0.15558156991923827,1.8555815699192384,null,1,-0.46108539974153567]
[null,null,"Submarine",0,0,0,0,0,0,0,0,0,0,null,0,0,0,null,0,"0"]
[null,null,"Switchgear (incl other plant & equipment)",0.5,1.3,1.9,1.0752565247729677,1.5185396316376227,0.65,0.66,0.67,0.67,0.67,null,3.7,2.5937961564105905,6.2937961564105906,null,3.32,-0.47249642068270825]
[null,null,"Transformers ",0.1,0.3,0.8,0.42191078453275838,0.16120602888467728,1.26,1.32,1.39,1.5,1.56,null,1.2,0.5831168134174356,1.7831168134174358,null,7.03,2.9425347498836274]
[null,null,"Substation",0.4,0.1,0.3,0.1382023965628352,0.21272191788543676,0.48,0.48,0.48,0.48,0.48,null,0.8,0.35092431444827199,1.1509243144482719,null,2.4,1.0852804740253557]
[null,"132kV","Overhead lines",0.5,1.3,1.1000000000000001,0.88575172342544373,0.3338259800479379,0.6,0.77,0.96,0.98,1,null,2.9,1.2195777034733817,4.1195777034733823,null,4.3099999999999996,4.6223741905891354E-2]
[null,null,"Underground cables",0,0,0.4,0.13087348159359394,0.16217413541761019,0.36,0.48,0.6,0.6,0.71,null,0.4,0.29304761701120413,0.6930476170112041,null,2.75,2.9679813226391087]
[null,null,"Submarine cables",0,0,0,0,0,0,0,0,0,0,null,0,0,0,null,0,"0"]
[null,null,"Switchgear (incl other plant & equipment)",1,1.8,0.1,0.55699753766233584,0.13584716538228386,0.16,0.17,0.18,0.2,0.21,null,2.9,0.69284470304461965,3.5928447030446198,null,0.92,-0.74393549511884527]
[null,null,"Transformers ",0.1,0.6,0.8,1.0417529134850076,0,2.29,2.29,2.29,2.14,2.14,null,1.5,1.0417529134850076,2.5417529134850074,null,11.15,3.3867363900105425]
[null,null,"Substation",0.2,0.2,0.9,0.23661925472121784,0.1937664994600018,0.21,0.21,0.21,0.21,0.21,null,1.3,0.4303857541812196,1.7303857541812198,null,1.05,-0.39319888789951535]
[null,"Total proactive condition based replacement (£m)",null,11.2,19.095869041372989,21.5,16.823958590352451,13.899981701304355,20.78,24.25,27.85,28.35,29.09,null,51.795869041372988,30.723940291656806,82.519809333029798,null,130.32,0.57925716325955534]
[]
[]
[null,"Reactive condition-based replacement (fault)"]
[]
[null,"Asset Categories",null,"DPCR 4",null,null,null,null,"DPCR 5",null,null,null,null,null,"DPCR4",null,null,null,"DPCR5"]
[null,null,null,"2005/06","2006/07","2007/08","2008/09","2009/10","2010/11","2011/12","2012/13","2013/14","2014/15",null,"Actuals","Forecast","Total",null,"Forecast","% change"]
[null,null,null,"£m","£m","£m","£m","£m","£m","£m","£m","£m","£m"]
[null,"Metered LV Services","Overhead",0,0,0,0,0,0,0,0,0,0,null,0,0,0,null,0,"0"]
[null,null,"Underground",0,0,0,0,0,0,0,0,0,0,null,0,0,0,null,0,"0"]
[null,"Un-metered LV Services","Overhead",0,0,0,0,0,0,0,0,0,0,null,0,0,0,null,0,"0"]
[null,null,"Underground",0,0,0,0,0,0,0,0,0,0,null,0,0,0,null,0,"0"]
[null,"LV System","Overhead mains",0,0,0,0,0,0,0,0,0,0,null,0,0,0,null,0,"0"]
[null,null,"Underground mains",0,0,0.1,0.1,0.1,0.1,0.1,0.1,0.1,0.1,null,0.1,0.2,0.3,null,0.5,0.66666666666666641]
[null,null,"Switchgear (incl other plant & equipment)",0,0,0,0,0,0,0,0,0,0,null,0,0,0,null,0,"0"]
[null,"HV","Overhead lines",0,0,0,0,0,0,0,0,0,0,null,0,0,0,null,0,"0"]
[null,null,"Underground cables",0,0,0,0,0,0,0,0,0,0,null,0,0,0,null,0,"0"]
[null,null,"Submarine",0,0,0,0,0,0.05,0.05,0.05,0.05,0.05,null,0,0,0,null,0.25,"0"]
[null,null,"Switchgear (incl other plant & equipment)",0,0,0.1,0.1,0.1,0.1,0.1,0.1,0.1,0.1,null,0.1,0.2,0.3,null,0.5,0.66666666666666641]
[null,null,"Transformers ",0,0,0.1,0.1,0.1,0.1,0.1,0.1,0.1,0.1,null,0.1,0.2,0.3,null,0.5,0.66666666666666641]
[null,null,"Substation",0,0,0,0,0,0,0,0,0,0,null,0,0,0,null,0,"0"]
[null,"EHV","Overhead lines",0,0,0,0,0,0,0,0,0,0,null,0,0,0,null,0,"0"]
[null,null,"Underground cables",0,0,0,0,0,0,0,0,0,0,null,0,0,0,null,0,"0"]
[null,null,"Submarine",0,0,0,0,0,0.1,0.1,0.1,0.1,0.1,null,0,0,0,null,0.5,"0"]
[null,null,"Switchgear (incl other plant & equipment)",0,0,0,0,0,0,0,0,0,0,null,0,0,0,null,0,"0"]
[null,null,"Transformers ",0,0,0.2,0.2,0.2,0.2,0.2,0.2,0.2,0.2,null,0.2,0.4,0.6,null,1,0.66666666666666641]
[null,null,"Substation",0,0,0,0,0,0,0,0,0,0,null,0,0,0,null,0,"0"]
[null,"132kV","Overhead lines",0,0,0,0,0,0,0,0,0,0,null,0,0,0,null,0,"0"]
[null,null,"Underground cables",0,0,0,0,0,0,0,0,0,0,null,0,0,0,null,0,"0"]
[null,null,"Submarine cables",0,0,0,0,0,0,0,0,0,0,null,0,0,0,null,0,"0"]
[null,null,"Switchgear (incl other plant & equipment)",0,0,0,0,0,0,0,0,0,0,null,0,0,0,null,0,"0"]
[null,null,"Transformers ",0,0,0,0,0,0,0,0,0,0,null,0,0,0,null,0,"0"]
[null,null,"Substation",0,0,0,0,0,0,0,0,0,0,null,0,0,0,null,0,"0"]
[null,"Total reactive condition based replacement (£m)",null,0,0,0.5,0.5,0.5,0.65,0.65,0.65,0.65,0.65,null,0.5,1,1.5,null,3.25,1.1666666666666663]
[]
[]
[null,"Overhead line refurbishment / replacement"]
[]
[null,"Asset Categories",null,"DPCR 4",null,null,null,null,"DPCR 5",null,null,null,null,null,"DPCR4",null,null,null,"DPCR5"]
[null,null,null,"2005/06","2006/07","2007/08","2008/09","2009/10","2010/11","2011/12","2012/13","2013/14","2014/015",null,"Actuals","Forecast","Total",null,"Forecast","% change"]
[null,null,null,"£m","£m","£m","£m","£m","£m","£m","£m","£m","£m"]
[null,"LV Mains","Refurbishment",0.5,0.6,0.7,0.63238066306024587,0.580033988907392,0.35,0.43,0.52,0.52,0.52,null,1.8,1.212414651967638,3.0124146519676378,null,2.34,-0.22321450718228072]
[null,null,"Full rebuild",0,0,0,0,0,0,0,0,0,0,null,0,0,0,null,0,"0"]
[null,null,"Undergrounding",0,0,0,0,0,0,0,0,0,0]
[null,null,"Covered Conductor",0,0,0,0,0,0,0,0,0,0]
[null,null,"Pole replacement only (i.e. D poles)",1.2,1.1000000000000001,1.3,0.82502642796601622,0.83066674364369875,1.26,1.33,1.42,1.42,1.42]
[null,null,"Total OHL expenditure (£m)",1.7,1.7,2,1.457407091026262,1.4107007325510907,1.61,1.76,1.94,1.94,1.94,null,5.4,2.8681078235773527,8.2681078235773526,null,9.19,0.11149977674381281]
[null,"HV","Refurbishment",1.3,4.3,3.9,2.6698190245093163,2.3452064907468695,3.9,4.43,5.04,5.04,5.04,null,9.5,5.0150255152561858,14.515025515256186,null,23.45,0.61556725996469008]
[null,null,"Full rebuild",0,0,0,0,0,0,0,0,0,0,null,0,0,0,null,0,"0"]
[null,null,"Undergrounding",0,0,0,0,0,0,0,0,0,0]
[null,null,"Covered Conductor",0,0,0,0,0,0,0,0,0,0]
[null,null,"Pole replacement only (i.e. D poles)",0.6,0.9,1.1000000000000001,0.75487824183184982,0.87173681689880778,1.25,2.67,4.03,4.03,4.03]
[null,null,"Total OHL expenditure (£m)",1.9,5.2,5,3.4246972663411661,3.2169433076456775,5.15,7.1,9.07,9.07,9.07,null,12.1,6.6416405739868436,18.741640573986842,null,39.46,1.1054720286744788]
[null,"EHV - Pole line","Refurbishment",0,0.1,0.4,1.6908853821892336,1.1394312631289236,0.24,0.38,0.52,0.52,0.52,null,0.5,2.830316645318157,3.3303166453181574,null,2.1800000000000002,-0.34540758967628538]
[null,null,"Full rebuild",0,0,0,0,0,0,0,0,0,0,null,0,0,0,null,0,"0"]
[null,null,"Undergrounding",0,0,0,0,0,0,0,0,0,0]
[null,null,"Pole replacement only (i.e. D poles)",0.3,0.3,0.5,0.38633851766428928,6.9503200893261521E-2,0.27,0.53,0.8,0.8,0.8]
[null,"EHV - Tower line","Fittings only",0,0,0,0,0,0,0,0,0,0,null,0,0,0,null,0,"0"]
[null,null,"Reconductoring",0,0,0,0,0,0.12,0.11,0.1,0.1,0.1,null,0,0,0,null,0.53,"0"]
[null,null,"Undergrounding",0,0,0,0,0,0,0,0,0,0]
[null,null,"Tower Refurbishment",0,0,0,0,0,0.03,0.06,0.09,0.09,0.1]
[null,"EHV Total","Total OHL expenditure (£m)",0.3,0.4,0.9,2.0772238998535228,1.2089344640221851,0.66,1.08,1.51,1.51,1.52,null,1.6,3.2861583638757077,4.8861583638757082,null,6.28,0.28526329527696592]
[null,"132kV - Pole Line","Refurbishment",0,0,0,0,0,0,0,0,0,0,null,0,0,0,null,0,"0"]
[null,null,"Full rebuild",0,0,0,0,0,0,0,0,0,0,null,0,0,0,null,0,"0"]
[null,null,"Undergrounding",0,0,0,0,0,0,0,0,0,0]
[null,null,"Pole replacement only (i.e. D poles)",0,0,0,0,0,0.04,0.06,0.08,0.08,0.08]
[null,"132kV - Tower line","Fittings only",0,0,0,0,0,0.27,0.28999999999999998,0.31,0.31,0.31]
[null,null,"Reconductoring",0.5,1.3,1.1000000000000001,0.88575172342544373,0.3338259800479379,0.2,0.33,0.46,0.46,0.46,null,2.9,1.2195777034733817,4.1195777034733823,null,1.91,-0.53636024430620599]
[null,null,"Undergrounding",0,0,0,0,0,0,0,0,0,0]
[null,null,"Tower Refurbishment",0,0,0,0,0,0.09,0.09,0.11,0.13,0.15,null,0,0,0,null,0.56999999999999995,"0"]
[null,"132 kV Total","Total OHL expenditure (£m)",0.5,1.3,1.1000000000000001,0.88575172342544373,0.3338259800479379,0.6,0.77,0.96,0.98,1,null,2.9,1.2195777034733817,4.1195777034733823,null,4.3099999999999996,4.6223741905891354E-2]
[]
[null,"LV Services - Split of activities "]
[]
[null,"Asset Categories"]
[]
[]
[null,"LV Services - metered only","OHL"]
[null,null,"Service Replacement",null,null,null,null,null,null,null,null,null,null,null,{"$f":"SUM(D146:G146)","v":0},{"$f":"H146","v":0},{"$f":"SUM(D146:H146)","v":0},null,{"$f":"SUM(I146:M146)","v":0},{"$f":"IF(Q146<>0,(S146-Q146)/Q146,\"0\")","v":"0"}]
[null,null,"Cut out Replacement",null,null,null,null,null,null,null,null,null,null,null,0,0,0,null,0,"0"]
[null,null,null,null,null,null,0,null,null,null,null,null,null,null,0,0,0,null,0,"0"]
[]
[null,null,"UG"]
[null,null,"Service Replacement",null,null,null,null,null,null,null,null,null,null,null,0,0,0,null,0,"0"]
[null,null,"Cut out Replacement",null,null,null,null,null,null,null,null,null,null,null,0,0,0,null,0,"0"]
[null,null,null,null,null,null,0,null,null,null,null,null,null,null,0,0,0,null,0,"0"]

{"sheet":"NL9 - Legal & Safety","index":18,"n_rows":137,"n_cols":24,"rows_kept":137,"cut":false,"hidden":false,"merged":[[57,9,57,15],[57,17,57,23],[58,2,59,2],[58,10,59,10],[58,18,59,18],[58,3,58,7],[58,19,58,23],[58,17,59,17],[84,1,84,7],[84,9,84,15],[84,17,84,23],[85,2,86,2],[85,10,86,10],[85,18,86,18],[85,3,85,7],[85,1,86,1],[85,17,86,17],[66,9,66,15],[66,17,66,23],[67,18,68,18],[66,1,66,7],[67,2,68,2],[67,10,68,10],[67,17,68,17],[103,1,103,7],[103,9,103,15],[103,17,103,23],[104,2,105,2],[104,3,104,7],[104,10,105,10],[104,18,105,18],[104,1,105,1],[113,2,114,2],[112,1,112,7],[112,9,112,15],[112,17,112,23],[130,9,130,15],[130,17,130,23],[113,10,114,10],[113,18,114,18],[113,1,114,1],[75,1,75,7],[75,9,75,15],[76,2,77,2],[76,10,77,10],[75,17,75,23],[76,18,77,18],[76,1,77,1],[76,17,77,17],[131,2,132,2],[131,10,132,10],[131,18,132,18],[121,1,121,7],[121,9,121,15],[121,17,121,23],[122,2,123,2],[122,10,123,10],[122,18,123,18],[130,1,130,7],[122,1,123,1],[131,1,132,1],[6,1,7,2],[30,1,31,2],[39,1,40,2],[58,1,59,1],[67,1,68,1],[57,1,57,7]]}
["June Forecast Business Plan DPCR5"]
["EDFE SPN"]
["NL9 - Legal and safety"]
[]
[null,"Legal and Safety"]
[]
[null,null,null,"DPCR4",null,null,null,null,"DPCR5"]
[null,null,null,"2005/06","2006/07","2007/08","2008/09","2009/10","2010/11","2011/12","2012/13","2013/14","2014/15"]
[null,"ESQCR"]
[null,"ESQCR 43-8 Clearance","£m"]
[null,"ESQCR tree continuity","£m"]
[null,"ESQCR Other","£m"]
[null,"CNI"]
[null,"Black Start","£m"]
[null,"Emergency Batteries","£m"]
[null,"Critical National Infrastructure","£m"]
[null,"Other"]
[null,"Site Security","£m"]
[null,"Asbestos clearance","£m"]
[null,"Safety climbing devices","£m"]
[null,"Rising mains and laterals","£m"]
[null,null,"£m"]
[null,"Retrofit ABSD & Earthing theft & Replace 0.025 OH conductor","£m"]
[null,"Fire Prevention","£m"]
[null,"Total","£m",{"$f":"SUM(D10:D24)","v":0},0,0,0,0,0,0,0,0,0]
[]
[]
[null,"ESQCR 43-8 Safety Clearance Expenditure"]
[]
[null,"Horizontal"]
[null,null,null,"DPCR4",null,null,null,null,"DPCR5"]
[null,null,null,"2005/06","2006/07","2007/08","2008/09","2009/10","2010/11","2011/12","2012/13","2013/14","2014/15"]
[null,"LV ","£m"]
[null,"HV","£m"]
[null,"EHV","£m"]
[null,"132 kV","£m"]
[null,"Total","£m",{"$f":"SUM(D33:D36)","v":0},0,0,0,0,0,0,0,0,0]
[]
[null,"Vertical"]
[null,null,null,"DPCR4",null,null,null,null,"DPCR5"]
[null,null,null,"2005/06","2006/07","2007/08","2008/09","2009/10","2010/11","2011/12","2012/13","2013/14","2014/15"]
[null,"LV ","£m"]
[null,"HV","£m"]
[null,"EHV","£m"]
[null,"132 kV","£m"]
[null,"Total","£m",{"$f":"SUM(D42:D45)","v":0},0,0,0,0,0,0,0,0,0]
[]
[null,"Horizontal - Detailed Information"]
[]
[null,null,"Sites affected as at April 2005","No of sites resolved 05/06 - 07/08","Sites affected as at April 2008","No of sites to be resolved 08/09 - 09/10","No of sites to be resolved in DPCR5","Sites affected as at April 2015"]
[null,"LV ",{"$f":"D51+E51","v":0},{"$f":"C61","v":0},null,{"$f":"K61","v":0},{"$f":"S61","v":0},{"$f":"E51-SUM(F51:G51)","v":0}]
[null,"HV",{"$f":"D52+E52","v":0},{"$f":"C62","v":0},null,{"$f":"K62","v":0},{"$f":"S62","v":0},{"$f":"E52-SUM(F52:G52)","v":0}]
[null,"EHV",{"$f":"D53+E53","v":0},{"$f":"C63","v":0},null,{"$f":"K63","v":0},{"$f":"S63","v":0},{"$f":"E53-SUM(F53:G53)","v":0}]
[null,"132 kV",{"$f":"D54+E54","v":0},{"$f":"C64","v":0},null,{"$f":"K64","v":0},{"$f":"S64","v":0},{"$f":"E54-SUM(F54:G54)","v":0}]
[null,"Total",{"$f":"SUM(C51:C54)","v":0},0,0,0,0,0]
[]
[]
[null,"05/06 - 07/08",null,null,null,null,null,null,null,"08/09-09/10",null,null,null,null,null,null,null,"DPCR5"]
[null,null,"No of sites resolved","Actual Solutions (#)",null,null,null,null,null,null,"No of sites resolved","Forecast Solutions (#)",null,null,null,null,null,null,"No of sites resolved","Forecast Solutions (#)"]
[null,null,null,"Shrouding","Diversions","Under-grounding","Covered conductors","As part of other planned work",null,null,null,"Shrouding","Diversions","Under-grounding","Covered conductors","As part of other planned work",null,null,null,"Shrouding","Diversions","Under-grounding","Covered conductors","As part of other planned work"]
[null,"LV ",{"$f":"SUM(D61:H61)","v":0},null,null,null,null,null,null,"LV ",{"$f":"SUM(L61:P61)","v":0},null,null,null,null,null,null,"LV ",{"$f":"SUM(T61:X61)","v":0}]
[null,"HV",{"$f":"SUM(D62:H62)","v":0},null,null,null,null,null,null,"HV",{"$f":"SUM(L62:P62)","v":0},null,null,null,null,null,null,"HV",{"$f":"SUM(T62:X62)","v":0}]
[null,"EHV",{"$f":"SUM(D63:H63)","v":0},null,null,null,null,null,null,"EHV",{"$f":"SUM(L63:P63)","v":0},null,null,null,null,null,null,"EHV",{"$f":"SUM(T63:X63)","v":0}]
[null,"132 kV",{"$f":"SUM(D64:H64)","v":0},null,null,null,null,null,null,"132 kV",{"$f":"SUM(L64:P64)","v":0},null,null,null,null,null,null,"132 kV",{"$f":"SUM(T64:X64)","v":0}]
[null,"Total",{"$f":"SUM(C61:C64)","v":0},0,0,0,0,0,null,"Total",{"$f":"SUM(K61:K64)","v":0},0,0,0,0,0,null,"Total",{"$f":"SUM(S61:S64)","v":0},0,0,0,0,0]
[]
[null,"05/06 - 07/08",null,null,null,null,null,null,null,"08/09-09/10",null,null,null,null,null,null,null,"DPCR5"]
[null,null,"No of spans changed","Actual Solutions (#)",null,null,null,null,null,null,"No of spans changed","Forecast Solutions (#)",null,null,null,null,null,null,"No of spans changed","Forecast Solutions (#)"]
[null,null,null,"Shrouding","Diversions","Under-grounding","Covered conductors","As part of other planned work",null,null,null,"Shrouding","Diversions","Under-grounding","Covered conductors","As part of other planned work",null,null,null,"Shrouding","Diversions","Under-grounding","Covered conductors","As part of other planned work"]
[null,"LV ",null,null,null,null,null,null,null,"LV ",null,null,null,null,null,null,null,"LV "]
[null,"HV",null,null,null,null,null,null,null,"HV",null,null,null,null,null,null,null,"HV"]
[null,"EHV",null,null,null,null,null,null,null,"EHV",null,null,null,null,null,null,null,"EHV"]
[null,"132 kV",null,null,null,null,null,null,null,"132 kV",null,null,null,null,null,null,null,"132 kV"]
[null,"Total",{"$f":"SUM(C70:C73)","v":0},0,0,0,0,0,null,"Total",{"$f":"SUM(K70:K73)","v":0},0,0,0,0,0,null,"Total",{"$f":"SUM(S70:S73)","v":0},0,0,0,0,0]
[]
[null,"05/06 - 07/08",null,null,null,null,null,null,null,"08/09-09/10",null,null,null,null,null,null,null,"DPCR5"]
[null,null,"Total Cost £m","Expenditure £m",null,null,null,null,null,null,"Total Cost £m","Forecast Solutions (£m)",null,null,null,null,null,null,"Total Cost £m","Forecast Solutions (£m)"]
[null,null,null,"Shrouding","Diversions","Under-grounding","Covered conductors","As part of other planned work",null,null,null,"Shrouding","Diversions","Under-grounding","Covered conductors","As part of other planned work",null,null,null,"Shrouding","Diversions","Under-grounding","Covered conductors","As part of other planned work"]
[null,"LV ",null,null,null,null,null,null,null,"LV ",{"$f":"SUM(G33:H33)","v":0},null,null,null,null,null,null,"LV ",{"$f":"SUM(I33:M33)","v":0}]
[null,"HV",null,null,null,null,null,null,null,"HV",{"$f":"SUM(G34:H34)","v":0},null,null,null,null,null,null,"HV",{"$f":"SUM(I34:M34)","v":0}]
[null,"EHV",null,null,null,null,null,null,null,"EHV",{"$f":"SUM(G35:H35)","v":0},null,null,null,null,null,null,"EHV",{"$f":"SUM(I35:M35)","v":0}]
[null,"132 kV",null,null,null,null,null,null,null,"132 kV",{"$f":"SUM(G36:H36)","v":0},null,null,null,null,null,null,"132 kV",{"$f":"SUM(I36:M36)","v":0}]
[null,"Total",{"$f":"SUM(C79:C82)","v":0},0,0,0,0,0,null,"Total",{"$f":"SUM(K79:K82)","v":0},0,0,0,0,0,null,"Total",{"$f":"SUM(S79:S82)","v":0},0,0,0,0,0]
[]
[null,"05/06 - 07/08",null,null,null,null,null,null,null,"08/09-09/10",null,null,null,null,null,null,null,"DPCR5"]
[null,null,"Total unit Cost £k/per span","Unit cost £k/span",null,null,null,null,null,null,"Total unit Cost £k/per span","Forecast Unit cost £k/span",null,null,null,null,null,null,"Total unit Cost £k/per span","Forecast Unit cost £k/span"]
[null,null,null,"Shrouding","Diversions","Under-grounding","Covered conductors","As part of other planned work",null,null,null,"Shrouding","Diversions","Under-grounding","Covered conductors",null,null,null,null,"Shrouding","Diversions","Under-grounding","Covered conductors"]
[null,"LV ",{"$f":"IF(C70>0,C79*1000/C70,0)","v":0},0,0,0,0,null,null,"LV ",{"$f":"IF(K70>0,K79*1000/K70,0)","v":0},0,0,0,0,null,null,"LV ",{"$f":"IF(S70>0,S79*1000/S70,0)","v":0},0,0,0,0]
[null,"HV",0,0,0,0,0,null,null,"HV",0,0,0,0,0,null,null,"HV",0,0,0,0,0]
[null,"EHV",0,0,0,0,0,null,null,"EHV",0,0,0,0,0,null,null,"EHV",0,0,0,0,0]
[null,"132 kV",0,0,0,0,0,null,null,"132 kV",0,0,0,0,0,null,null,"132 kV",0,0,0,0,0]
[]
[]
[null,"Vertical - Detailed Information"]
[]
[null,null,"Sites affected as at April 2005","No of sites resolved 05/06 - 07/08","Sites affected as at April 2008","No of sites to be resolved 08/09 - 09/10","No of sites to be resolved in DPCR5","Sites affected as at April 2015"]
[null,"LV ",{"$f":"D97+E97","v":0},{"$f":"C107","v":0},null,{"$f":"K107","v":0},{"$f":"S107","v":0},{"$f":"E97-SUM(F97:G97)","v":0}]
[null,"HV",{"$f":"D98+E98","v":0},{"$f":"C108","v":0},null,{"$f":"K108","v":0},{"$f":"S108","v":0},{"$f":"E98-SUM(F98:G98)","v":0}]
[null,"EHV",{"$f":"D99+E99","v":0},{"$f":"C109","v":0},null,{"$f":"K109","v":0},{"$f":"S109","v":0},{"$f":"E99-SUM(F99:G99)","v":0}]
[null,"132 kV",{"$f":"D100+E100","v":0},{"$f":"C110","v":0},null,{"$f":"K110","v":0},{"$f":"S110","v":0},{"$f":"E100-SUM(F100:G100)","v":0}]
[null,"Total",{"$f":"SUM(C97:C100)","v":0},0,0,0,0,0]
[]
[]
[null,"05/06 - 07/08",null,null,null,null,null,null,null,"08/09-09/10",null,null,null,null,null,null,null,"DPCR5"]
[null,null,"No of sites resolved","Actual Solutions (#)",null,null,null,null,null,null,"No of sites resolved","Forecast Solutions (#)",null,null,null,null,null,null,"No of sites resolved","Forecast Solutions (#)"]
[null,null,null,"Rebuild","Under-grounding","Other","Derogation","As part of other planned work",null,null,null,"Rebuild","Under-grounding","Other","Derogation","As part of other planned work",null,null,null,"Rebuild","Under-grounding","Other","Derogation","As part of other planned work"]
[null,"LV ",{"$f":"SUM(D107:H107)","v":0},null,null,null,null,null,null,"LV ",{"$f":"SUM(L107:P107)","v":0},null,null,null,null,null,null,"LV ",{"$f":"SUM(T107:X107)","v":0}]
[null,"HV",{"$f":"SUM(D108:H108)","v":0},null,null,null,null,null,null,"HV",{"$f":"SUM(L108:P108)","v":0},null,null,null,null,null,null,"HV",{"$f":"SUM(T108:X108)","v":0}]
[null,"EHV",{"$f":"SUM(D109:H109)","v":0},null,null,null,null,null,null,"EHV",{"$f":"SUM(L109:P109)","v":0},null,null,null,null,null,null,"EHV",{"$f":"SUM(T109:X109)","v":0}]
[null,"132 kV",{"$f":"SUM(D110:H110)","v":0},null,null,null,null,null,null,"132 kV",{"$f":"SUM(L110:P110)","v":0},null,null,null,null,null,null,"132 kV",{"$f":"SUM(T110:X110)","v":0}]
[null,"Total",{"$f":"SUM(C107:C110)","v":0},0,0,0,0,0,null,"Total",{"$f":"SUM(K107:K110)","v":0},0,0,0,0,0,null,"Total",{"$f":"SUM(S107:S110)","v":0},0,0,0,0,0]
[]
[null,"05/06 - 07/08",null,null,null,null,null,null,null,"08/09-09/10",null,null,null,null,null,null,null,"DPCR5"]
[null,null,"No of spans changed","Actual Solutions (#)",null,null,null,null,null,null,"No of spans changed","Forecast Solutions (#)",null,null,null,null,null,null,"No of spans changed","Forecast Solutions (#)"]
[null,null,null,"Rebuild","Under-grounding","Other","Derogation","As part of other planned work",null,null,null,"Rebuild","Under-grounding","Other","Derogation","As part of other planned work",null,null,null,"Rebuild","Under-grounding","Other","Derogation","As part of other planned work"]
[null,"LV ",null,null,null,null,null,null,null,"LV ",null,null,null,null,null,null,null,"LV "]
[null,"HV",null,null,null,null,null,null,null,"HV",null,null,null,null,null,null,null,"HV"]
[null,"EHV",null,null,null,null,null,null,null,"EHV",null,null,null,null,null,null,null,"EHV"]
[null,"132 kV",null,null,null,null,null,null,null,"132 kV",null,null,null,null,null,null,null,"132 kV"]
[null,"Total",{"$f":"SUM(C116:C119)","v":0},{"$f":"SUM(D116:D119)","v":0},{"$f":"SUM(E116:E119)","v":0},{"$f":"SUM(F116:F119)","v":0},null,{"$f":"SUM(H116:H119)","v":0},null,"Total",{"$f":"SUM(K116:K119)","v":0},0,0,0,0,0,null,"Total",{"$f":"SUM(S116:S119)","v":0},0,0,0,0,0]
[]
[null,"05/06 - 07/08",null,null,null,null,null,null,null,"08/09-09/10",null,null,null,null,null,null,null,"DPCR5"]
[null,null,"Total Cost £m","Expenditure £m",null,null,null,null,null,null,"Total Cost £m","Forecast Solutions (£m)",null,null,null,null,null,null,"Total Cost £m","Forecast Solutions (£m)"]
[null,null,null,"Rebuild","Under-grounding","Other","Derogation","As part of other planned work",null,null,null,"Rebuild","Under-grounding","Other","Derogation","As part of other planned work",null,null,null,"Rebuild","Under-grounding","Other","Derogation","As part of other planned work"]
[null,"LV ",{"$f":"SUM(D42:F42)","v":0},null,null,null,null,null,null,"LV ",{"$f":"SUM(G42:H42)","v":0},null,null,null,null,null,null,"LV ",{"$f":"SUM(I42:M42)","v":0}]
[null,"HV",{"$f":"SUM(D43:F43)","v":0},null,null,null,null,null,null,"HV",{"$f":"SUM(G43:H43)","v":0},null,null,null,null,null,null,"HV",{"$f":"SUM(I43:M43)","v":0}]
[null,"EHV",{"$f":"SUM(D44:F44)","v":0},null,null,null,null,null,null,"EHV",{"$f":"SUM(G44:H44)","v":0},null,null,null,null,null,null,"EHV",{"$f":"SUM(I44:M44)","v":0}]
[null,"132 kV",{"$f":"SUM(D45:F45)","v":0},null,null,null,null,null,null,"132 kV",{"$f":"SUM(G45:H45)","v":0},null,null,null,null,null,null,"132 kV",{"$f":"SUM(I45:M45)","v":0}]
[null,"Total",{"$f":"SUM(C125:C128)","v":0},{"$f":"SUM(D125:D128)","v":0},{"$f":"SUM(E125:E128)","v":0},{"$f":"SUM(F125:F128)","v":0},null,{"$f":"SUM(H125:H128)","v":0},null,"Total",{"$f":"SUM(K125:K128)","v":0},{"$f":"SUM(L125:L128)","v":0},{"$f":"SUM(M125:M128)","v":0},{"$f":"SUM(N125:N128)","v":0},null,{"$f":"SUM(P125:P128)","v":0},null,"Total",{"$f":"SUM(S125:S128)","v":0},{"$f":"SUM(T125:T128)","v":0},{"$f":"SUM(U125:U128)","v":0},{"$f":"SUM(V125:V128)","v":0},null,{"$f":"SUM(X125:X128)","v":0}]
[]
[null,"05/06 - 07/08",null,null,null,null,null,null,null,"08/09-09/10",null,null,null,null,null,null,null,"DPCR5"]
[null,null,"Total unit Cost £k/per span","Unit cost £k/span",null,null,null,null,null,null,"Total unit Cost £k/per span","Forecast Unit cost £k/span",null,null,null,null,null,null,"Total unit Cost £k/per span","Forecast Unit cost £k/span"]
[null,null,null,"Rebuild","Under-grounding","Other","Derogation","As part of other planned work",null,null,null,"Rebuild","Under-grounding","Other","Derogation","As part of other planned work",null,null,null,"Rebuild","Under-grounding","Other","Derogation","As part of other planned work"]
[null,"LV ",{"$f":"IF(C116>0,C125*1000/C116,0)","v":0},0,0,0,null,null,null,"LV ",{"$f":"IF(K116>0,K125*1000/K116,0)","v":0},0,0,0,null,null,null,"LV ",{"$f":"IF(S116>0,S125*1000/S116,0)","v":0},0,0,0]
[null,"HV",0,0,0,0,null,null,null,"HV",0,0,0,0,null,null,null,"HV",0,0,0,0]
[null,"EHV",0,0,0,0,null,null,null,"EHV",0,0,0,0,null,null,null,"EHV",0,0,0,0]
[null,"132 kV",0,0,0,0,null,null,null,"132 kV",0,0,0,0,null,null,null,"132 kV",0,0,0,0]

{"sheet":"FBPQ C2","index":19,"n_rows":155,"n_cols":10,"rows_kept":155,"cut":false,"hidden":false,"merged":[[6,1,8,4],[6,5,8,5],[6,6,6,7],[6,8,6,9]]}
["Main Forecast Business Plan DPCR5",null,null,null,null,"Index"]
[]
["C2 - Unit costs"]
[]
[]
[]
[null,"Asset categories",null,null,null,"Units","New build ",null,"Replacement"]
[null,null,null,null,null,null,"Direct costs","Cost including indirects (absorbed costs in T2A)","Direct costs","Cost including indirects (absorbed costs in T2A)"]
[null,null,null,null,null,null,"(£k)","(£k)","(£k)","(£k)"]
[null,null,"LV Network"]
[null,null,null,"Overhead lines"]
[null,null,null,null,"LV Main (OHL)","km",null,null,14.06,19.989999999999998]
[null,null,null,null,"LV Service (OHL)","Each",null,null,0.2,0.32]
[]
[null,null,null,"Overhead lines - Support"]
[null,null,null,null,"LV Support","Each",null,null,1.43,1.92]
[]
[null,null,null,"Underground cables"]
[null,null,null,null,"LV Main (UG Consac)","km"]
[null,null,null,null,"LV Main (UG Plastic)","km",33.4,40.08,67.22,67.22]
[null,null,null,null,"LV Main (UG Paper)","km",null,null,67.22,75.91]
[null,null,null,null,"LV Service (UG)","Each",0.93,1.1160000000000001,0.6,0.71]
[]
[null,null,null,"Switchgear "]
[null,null,null,null,"LV Pillar (ID)","Each",2.2200000000000002,2.6640000000000001,6.41,8.06]
[null,null,null,null,"LV Pillar (OD)","Each",null,null,6.78,8.4700000000000006]
[null,null,null,null,"LV Board (WM)","Each",null,null,8.3699999999999992,10.53]
[null,null,null,null,"LV UGB","Each"]
[null,null,null,null,"LV Fuses (PM)","Each"]
[null,null,null,null,"LV Fuses (TM)","Each"]
[]
[null,null,"HV network"]
[null,null,null,"Overhead lines"]
[null,null,null,null,"6.6/11 kV OHL (Open)","km",35.26,42.311999999999998,18.350000000000001,20.82]
[null,null,null,null,"6.6/11 kV OHL (Covered)","km"]
[null,null,null,null,"20 kV OHL (Open)","km"]
[null,null,null,null,"20 kV OHL (Covered)","km"]
[]
[null,null,null,"Overhead lines - Support"]
[null,null,null,null,"6.6/11 kV Support","Each",null,null,1.52,2.0499999999999998]
[null,null,null,null,"20 kV Support","Each"]
[]
[null,null,null,"Underground cables (kms)"]
[null,null,null,null,"6.6/11kV UG Cable","km",32.92,39.503999999999998,73.02,84.36]
[null,null,null,null,"20kV UG Cable","km"]
[]
[null,null,null,"Submarine cables (kms)"]
[null,null,null,null,"HV Sub Cable","km",null,null,471.36,535.69000000000005]
[]
[null,null,null,"Switchgear "]
[null,null,null,null,"6.6/11 kV CB (PM)","Each",7.13,8.5559999999999992,7.17,8.31]
[null,null,null,null,"6.6/11 kV CB (GM)","Each",20.49,24.587999999999997,21.37,24.52]
[null,null,null,null,"6.6/11 kV Switch (PM)","Each",6.01,7.2119999999999997,6.05,7.06]
[null,null,null,null,"6.6/11 kV Switch (GM)","Each",6.71,8.0519999999999996,8.17,10.15]
[null,null,null,null,"6.6/11 kV RMU","Each",6.99,8.3879999999999999,10,12.28]
[null,null,null,null,"6.6/11 kV Switchgear - Other (PM)","Each"]
[null,null,null,null,"6.6/11 kV Switchgear - Other (GM)","Each"]
[null,null,null,null,"20 kV CB (PM)","Each"]
[null,null,null,null,"20 kV CB (GM)","Each"]
[null,null,null,null,"20 kV Switch (PM)","Each"]
[null,null,null,null,"20 kV Switch (GM)","Each"]
[null,null,null,null,"20 kV RMU","Each"]
[null,null,null,null,"20 kV Switchgear - Other (PM)","Each"]
[null,null,null,null,"20 kV Switchgear - Other (GM)","Each"]
[]
[null,null,null,"Transformers  "]
[null,null,null,null,"6.6/11 kV Transformer (PM)","Each",1.66,1.9919999999999998,1.33,1.78]
[null,null,null,null,"6.6/11 kV Transformer (GM)","Each",9.32,11.183999999999999,10.86,12.82]
[null,null,null,null,"20 kV Transformer (PM)","Each"]
[null,null,null,null,"20 kV Transformer (GM)","Each"]
[]
[null,null,"EHV Network"]
[null,null,null,"Overhead lines"]
[null,null,null,null,"33kV OHL (Pole Line)","km",41.59,49.908000000000001,23.76,26.88]
[null,null,null,null,"33kV OHL (Tower Line)","km",null,null,29.82,33.67]
[null,null,null,null,"66kV OHL (Pole Line)","km",55.8,66.959999999999994,36.97,41.55]
[null,null,null,null,"66kV OHL (Tower Line)","km",null,null,46.81,52.49]
[]
[null,null,null,"Overhead lines - Support"]
[null,null,null,null,"33kV Pole","Each",null,null,1.99,2.61]
[null,null,null,null,"33kV Tower","Each",null,null,39.15,45.36]
[null,null,null,null,"66kV Pole","Each",null,null,2.74,3.61]
[null,null,null,null,"66kV Tower","Each",null,null,64.959999999999994,74.53]
[]
[null,null,null,"Underground cables (kms)"]
[null,null,null,null,"33kV UG Cable (Non Pressurised)","km",148.69,178.428,152.88999999999999,173.04]
[null,null,null,null,"33kV UG Cable (Oil)","km",null,null,152.88999999999999,152.88999999999999]
[null,null,null,null,"33kV UG Cable (Gas)","km",null,null,152.88999999999999,173.42]
[null,null,null,null,"66kV UG Cable (Non Pressurised)","km",440.09,528.10799999999995,444.45]
[null,null,null,null,"66kV UG Cable (Oil)","km",null,null,444.45]
[null,null,null,null,"66kV UG Cable (Gas)","km",null,null,444.45]
[]
[null,null,null,"Submarine cables (kms)"]
[null,null,null,null,"EHV Sub Cable","km",null,null,1020.97,1134.52]
[]
[null,null,null,"Switchgear "]
[null,null,null,null,"33 KV CB (ID)","Each",74.239999999999995,89.087999999999994,59.25,66.58]
[null,null,null,null,"33 kV CB (OD)","Each",51.24,61.488,44.23,51.4]
[null,null,null,null,"33 kV Switch (GM)","Each",null,null,29.05,33.17]
[null,null,null,null,"33 kV Switch (PM)","Each"]
[null,null,null,null,"33 kV RMU","Each"]
[null,null,null,null,"33 kV Switchgear - Other","Each"]
[null,null,null,null,"66 KV CB (ID & OD)","Each",77.239999999999995,92.687999999999988,77.239999999999995,88.11]
[null,null,null,null,"66 KV Switchgear - Other","Each"]
[]
[null,null,null,"Transformers  "]
[null,null,null,null,"33 kV Transformer (PM)","Each"]
[null,null,null,null,"33 kV Transformer (GM)","Each",228.25,273.89999999999998,223.81,262.73]
[null,null,null,null,"33 kV AuxiliaryTransfomer","Each"]
[null,null,null,null,"66 kV Transformer","Each",411.49,493.78800000000001,399.61,457.92]
[null,null,null,null,"66 kV AuxiliaryTransfomer","Each"]
[]
[null,null,"132kV Network"]
[null,null,null,"Overhead lines"]
[null,null,null,null,"132kV OHL Conductor (Pole Line)","km",74.69,89.628,52.85,52.85]
[null,null,null,null,"132kV OHL Conductor (Tower Line)","km",637,764.4,47.77,53.51]
[]
[null,null,null,"Overhead lines - Support"]
[null,null,null,null,"132kV Pole","Each",null,null,2.61,3.64]
[null,null,null,null,"132kV Tower","Each",null,null,86.15,98.62]
[null,null,null,null,"132kV Fittings (Tower Line)","Each",null,null,2.98,3.8]
[]
[null,null,null,"Underground cables (kms)"]
[null,null,null,null,"132kV UG Cable (Non Pressurised)","km",1170.8800000000001,1405.056,1191.4000000000001,0]
[null,null,null,null,"132kV UG Cable (Oil)","km",null,null,1191.4000000000001,1323.44]
[null,null,null,null,"132kV UG Cable (Gas)","km"]
[]
[null,null,null,"Submarine cables (kms)"]
[null,null,null,null,"132 kV Sub Cable","km"]
[]
[null,null,null,"Switchgear "]
[null,null,null,null,"132 kV CB (ID & OD)","Each",120.95,145.13999999999999,131.08000000000001,146.88]
[null,null,null,null,"132 kV Switchgear (other)","Each"]
[]
[null,null,null,"Transformers  "]
[null,null,null,null,"132 kV Transformer","Each",975.14,1170.1679999999999,1018.69,1139.95]
[null,null,null,null,"132 kV AuxiliaryTransfomer","Each"]
[]
[null,null,"Tele-control / SCADA"]
[null,null,null,"Primary substation"]
[null,null,null,null,"132 kV/EHV RTU (PM)","Each"]
[null,null,null,null,"132 kV/EHV RTU (GM)","Each"]
[]
[null,null,null,"Secondary substation"]
[null,null,null,null,"HV RTU (PM)","Each"]
[null,null,null,null,"HV RTU (GM)","Each"]
[]
[]
[null,null,"HV network switchgear"]
[null,null,null,null,"6.6/11 kV CB (GM)"]
[null,null,null,null,"Primary","Each",20.49,24.587999999999997,21.37,24.52]
[null,null,null,null,"Distribution","Each",20.49,24.587999999999997,21.37,24.52]
[null,null,null,null,"20 kV Switch (GM)"]
[null,null,null,null,"Primary","Each"]
[null,null,null,null,"Distribution","Each"]

{"sheet":"RRP 1.3","index":20,"n_rows":26,"n_cols":37,"rows_kept":26,"cut":false,"hidden":false,"merged":[[25,3,25,26],[21,3,21,26],[22,3,22,26],[23,3,23,26],[24,3,24,26],[6,26,8,26],[6,36,8,36],[7,3,7,8],[7,9,7,23],[6,31,8,31],[6,32,8,32],[6,33,8,33],[6,34,8,34],[6,27,8,27],[6,28,8,28],[6,29,8,29],[6,35,8,35],[6,30,8,30],[6,3,6,23],[6,24,8,24],[6,25,8,25]]}
["Regulatory Reporting Pack (RRP)",null,null,null,null,"Index",null,"CAUTION - THIS PACK DOES NOT BALANCE"]
[]
["2007/08"]
[]
[null,null,"Electricity Distribution Industry Activity Costs - individual DNO input"]
[]
[null,null,null,"Cash typical costs (excluding disallowed related party margins)",null,null,null,null,null,null,null,null,null,null,null,null,null,null,null,null,null,null,null,null,"Atypical cash costs","Pension deficit payments","Metering","Excluded services & de minimis","Relevant distributed generation (less contributions)","IFI","Disallowed Related Party Margins","Statutory Depreciation","Network Rates","Transmission Exit Charges","Pension deficit repair payments by related parties (note 2)","Non activity costs and reconciling amounts (note 3)","Total Annual Operating & Capital Expenditure per Regulatory Accounts"]
[null,null,null,"Direct activities",null,null,null,null,null,"Indirect activities"]
[null,null,"Year ended","Load related new connections & reinforcement (net of contributions)","Non-load new & replacement assets (net of contributions)","Non-operational capex","Faults","Inspections, & Maintenance","Tree Cutting","Network Policy","Network Design & Engineering","Project Management","Engineering Mgt & Clerical Support","Control Centre","System Mapping - Cartographical","Customer Call Centre","Stores","Vehicles & Transport","IT & Telecoms","Property Mgt","HR & Non-operational Training","Health & Safety & Operational Training","Finance & Regulation","CEO etc"]
[null,null,null,"£'m","£'m","£'m","£'m","£'m","£'m","£'m","£'m","£'m","£'m","£'m","£'m","£'m","£'m","£'m","£'m","£'m","£'m","£'m","£'m","£'m","£'m","£'m","£'m","£'m","£'m","£'m","£'m","£'m","£'m","£'m","£'m","£'m","£'m"]
[]
[null,null,"31 March 2008",-0.50000000000000178,32.299999999999997,3,8.3000000000000007,5.5,4.0999999999999996,0.6,3.5,2.9,7.2,1.9,1,0.7,0.9,2.7,6.8,2.1,0.9,1.1000000000000001,5.8,1.8,4.3,13.4,1.8,8.9,-0.1,0.1,-2.7755575615628914E-17,25.3,15.1,4.2,0,-2.9000000000000057,162.69999999999999]
[null,null,"Adjustments on T4.3",null,null,null,null,null,null,null,null,null,null,null,null,null,null,null,null,null,null,null,null,null,null,null,null,null,null,null,null,null,null,null,null,null,0]
[null,null,"31 March 2008",-0.50000000000000178,32.299999999999997,3,8.3000000000000007,5.5,4.0999999999999996,0.6,3.5,2.9,7.2,1.9,1,0.7,0.9,2.7,6.8,2.1,0.9,1.1000000000000001,5.8,1.8,4.3,13.4,1.8,8.9,-0.1,0.1,-2.7755575615628914E-17,25.3,15.1,4.2,0,-2.9000000000000057,162.69999999999999]
[]
[null,null,"31 March 2007",2.8,25.5,4.3,8.6,5.3,2.9,0.6,3,2.2000000000000002,5.2,1.9,0.8,0.6,1.6,2.8,6.3,2.1,1,0.9,4.8,1.5,4.9000000000000004,6.9,5.9,13.7,0.2,0,0,33.9,14.6,4.2,0,-8.8000000000000114,160.19999999999999]
[]
[null,null,"31 March 2006",5.5,17.3,2.4,8.1,6.8,3.3,0.6,3.2,2.2999999999999998,6.5,2.5,0.8,0.9,1.5,2.9,6.2,2.2000000000000002,0.8,0.7,4,1.9,1.6,4.3,5.0999999999999996,5,0,0,0,31.395595999999998,14.3,3.9,-0.9,-4.8955959999999834,140.19999999999999]
[]
[]
[null,null,"Notes"]
[null,null,1,"The individual activities are defined in the Electricity Distribution Price Control Review Price control cost reporting rules: Instructions and Guidance April 2008 "]
[null,null,2,"Pension deficit payments made by a related party and not charged in the regulatory accounts of the DNO"]
[null,null,3,"Non-activity costs include Ofgem licence fee, Shetland Balancing Costs (SHEPD only), Scottish Electricity Settlements run-off (Scottish DNOs only) and proceeds of asset sales; and reconciling amounts, e.g. intra-group recharges treated as de minimis costs"]
[null,null,4,"Total Annual Operating & Capital Expenditure per Regulatory Accounts has been adjusted, where appropriate, to include intangible fixed assets and customer contributions, the latter may be reported within Creditors as deferred income"]
[null,null,5,"This information has not been audited."]

{"sheet":"RRP 2.3","index":21,"n_rows":48,"n_cols":17,"rows_kept":48,"cut":false,"hidden":false,"merged":[[23,0,26,0],[23,1,23,2],[26,1,26,2],[31,0,31,2],[32,0,32,2],[28,0,28,2],[29,0,29,2],[30,0,30,2],[27,0,27,2],[13,6,15,6],[14,1,14,2],[15,1,15,2],[16,0,18,0],[16,1,16,2],[17,1,17,2],[18,1,18,2],[12,0,15,0],[12,1,12,2],[13,1,13,2],[13,4,15,4],[13,5,15,5],[19,0,22,0],[19,1,19,2],[22,1,22,2],[8,0,9,2],[10,0,11,0],[10,1,10,2],[11,1,11,2],[10,4,11,4],[5,12,5,16],[6,4,6,6],[6,8,6,10],[6,12,7,14],[6,16,7,16],[10,6,11,6],[10,5,11,5],[46,2,46,5],[43,12,43,13],[35,4,36,7],[41,14,42,14],[33,0,33,2],[43,2,43,5],[44,2,44,5],[45,2,45,5],[41,12,42,13],[37,4,37,7],[38,4,38,7],[39,4,39,7],[41,2,42,5],[41,6,42,6]]}
["Regulatory Reporting Pack (RRP)",null,null,null,"Index"]
[]
["2007/08"]
[]
["Inspections & Maintenance, Tree Cutting and Fault Costs"]
[null,null,null,null,null,null,null,null,null,null,null,null,"Memorandum Information - Scottish DNOs 132kV"]
[null,null,null,null,"Inspections & Maintenance",null,null,null,"Fault Costs",null,null,null,"Inspections & Maintenance",null,null,null,"Faults"]
[null,null,null,null,null,"Cash typicals",null,null,"Cash typicals",null,"Atypicals"]
["Inspection and Maintenance",null,null,null,"Inspections ","Maintenance ","Total ",null,"Total ",null,"Total ",null,"Inspections ","Maintenance ","Total ",null,"Total "]
[null,null,null,null,"£'m","£'m","£'m",null,"£'m",null,"£'m",null,"£'m","£'m","£'m",null,"£'m"]
["LV Services","Overhead",null,null,0.1,0.3,0.4,null,0.6]
[null,"Underground",null,null,null,null,null,null,1.4]
["LV System","Overhead Mains",null,null,0.1,0.1,0.2,null,0.5]
[null,"Underground Mains - Consac",null,null,null,0.1,0.1]
[null,"Underground Mains - Non Consac",null,null,null,null,null,null,2.1]
[null,"Switchgear (incl other plant & equipment)",null,null,null,null,null,null,0.3]
["HV ","Overhead lines",null,null,0.5,0.1,0.6,null,0.8]
[null,"Underground Cables",null,null,null,null,0,null,1.5]
[null,"Switchgear, Transformers, Substation",null,null,0.1,1.5,1.6,null,0.2]
["EHV","Overhead lines",null,null,0.1,null,0.1,null,0.1]
[null,"Underground - Pressure assisted",null,null,null,null,0]
[null,"Underground - Non Pressure assisted",null,null,null,null,0,null,0.3]
[null,"Switchgear, Transformers, Substation",null,null,0.1,0.7,0.8,null,0.2]
["132kV","Overhead lines",null,null,0.2,0.6,0.8,null,null,null,null,null,null,null,0]
[null,"Underground - Pressure assisted",null,null,null,null,0,null,null,null,null,null,null,null,0]
[null,"Underground - Non Pressure assisted",null,null,null,null,0,null,null,null,null,null,null,null,0]
[null,"Switchgear, Transformers, Substation",null,null,0.1,0.5,0.6,null,null,null,null,null,null,null,0]
["Submarine cables - all voltages",null,null,null,null,null,null,null,null,null,null,null,null,null,0]
["Non-QoS Faults",null,null,null,null,null,null,null,1]
["Substation electricity",null,null,null,null,0.6,0.6]
["Diesel generation costs (permanent emergency back up on islands)",null,null,null,null,0.1,0.1]
["Third party cable damage - recoveries",null,null,null,null,null,null,null,-0.6]
["Dismantlement",null,null,null,null,null,0]
["Total",null,null,null,1.3,4.5999999999999996,5.9,null,8.4,null,null,null,0,0,0,null,0]
[]
[null,null,null,null,"Fault costs allocated to Opex and Capex",null,null,null,"Cash typicals",null,"Atypicals"]
[null,null,null,null,null,null,null,null,"£'m",null,"£'m"]
[null,null,null,null,"Fault opex",null,null,null,2.4]
[null,null,null,null,"Fault capex",null,null,null,6]
[null,null,null,null,"Total Fault Costs",null,null,null,8.4]
[]
[null,null,"Tree Cutting",null,null,null,"£'m",null,null,null,null,null,"Tree Cutting",null,"£'m"]
[]
[null,null,"LV",null,null,null,1.1655181170566711,null,null,null,null,null,"132kV",null,0.1]
[null,null,"HV",null,null,null,2.3630693363750601]
[null,null,"EHV",null,null,null,0.48131015744404471]
[null,null,"132kV",null,null,null,0.14846693171693162]
[null,null,"Total Tree Cutting",null,null,null,4.1583645425927083]

{"sheet":"RRP 2.4","index":22,"n_rows":89,"n_cols":12,"rows_kept":89,"cut":false,"hidden":false,"merged":[[27,4,27,5],[30,2,31,2],[32,2,33,2],[34,2,36,2],[37,2,42,2],[27,2,29,3],[7,2,8,3],[9,2,9,3],[14,2,14,3],[15,2,15,3],[16,2,16,3],[10,2,10,3],[11,2,11,3],[12,2,12,3],[13,2,13,3],[17,2,17,3],[18,2,18,3],[19,2,19,3],[55,2,55,3],[56,2,56,3],[20,2,20,3],[21,2,21,3],[43,2,48,2],[49,2,54,2],[22,2,22,3],[23,2,23,3],[24,2,24,3],[57,2,57,3],[60,2,60,3],[61,2,61,3],[62,2,62,3],[63,2,63,3],[64,2,64,3],[65,2,65,3],[66,2,66,3],[67,2,67,3],[68,2,68,3],[69,2,69,3],[70,2,70,3],[71,2,71,3],[72,2,72,3],[74,2,74,3],[75,2,75,3],[76,2,76,3],[81,2,81,3],[87,2,87,3],[88,2,88,3],[79,2,80,3],[82,2,82,3],[83,2,83,3],[84,2,84,3],[85,2,85,3],[86,2,86,3]]}
["Regulatory Reporting Pack (RRP)",null,null,null,"Index"]
[]
["2007/08"]
[]
["NEW AND REPLACEMENT ASSETS (EXCL. FAULTS)"]
[]
[null,null,"          Load Related New Connections & Reinforcement"]
[null,null,"Direct Costs only",null,"New Connections (carried out by DNO/RP)","New Connections (carried out by Third Parties)","Customer Specific Reinforcement - Chargeable","Customer Specific Reinforcement - Non Chargeable","General Reinforcement","Fault Level Reinforcement","Non Relevant Distributed Generation","Total"]
[null,null,null,null,"£'m","£'m","£'m","£'m","£'m","£'m","£'m","£'m"]
[null,null,"New Connections & Customer Specific Reinforcement:"]
[null,null,"Connections provided at LV",null,13.8,null,0.9,0.8,null,null,null,15.5]
[null,null,"Connections provided at HV",null,2.4,null,0.2,0.3,null,null,null,2.9]
[null,null,"Connections provided at EHV",null,0.5,null,1.1000000000000001,0.6,null,null,null,2.2000000000000002]
[null,null,"Connections provided at 132kV",null,0,null,0,0,null,null,null,0]
[null,null,"General Reinforcement:",null,null,null,null,null,null,null,null,0]
[null,null,"LV System",null,null,null,null,null,0.3,null,null,0.3]
[null,null,"HV System",null,null,null,null,null,0.9,null,null,0.9]
[null,null,"EHV System",null,null,null,null,null,1.4,null,null,1.4]
[null,null,"132kV System",null,null,null,null,null,1.1000000000000001,null,null,1.1000000000000001]
[null,null,"Non Relevant Distributed Generation",null,null,null,null,null,null,null,null,0]
[null,null,"Total Direct Costs excluding Reallocations",null,16.7,0,2.2000000000000002,1.7,3.7,0,0,24.3]
[null,null,"Direct Cost Reallocation ",null,null,null,null,null,null,null,null,0]
[null,null,"Total Costs including Reallocations",null,16.7,0,2.2000000000000002,1.7,3.7,0,0,24.3]
[null,null,"Customer Contributions (-ve)",null,-22,null,-2.8,null,null,null,null,-24.8]
[null,null,"Total Costs less Capital Contributions",null,-5.3,0,-0.6,1.7,3.7,0,0,-0.5]
[]
[null,null,"          Non-load related replacement (Condition based)"]
[null,null,"Direct Costs only",null,"Condition based"]
[null,null,null,null,"Non-fault Related","Fault Related","Total\n"]
[null,null,null,null,"£'m","£'m","£'m"]
[null,null,"Metered LV Services","Overhead",1.5,0,1.5]
[null,null,null,"Underground",0.6,0,0.6]
[null,null,"Un-metered LV Services","Overhead",0,0,0]
[null,null,null,"Underground",0.1,0,0.1]
[null,null,"LV System","Overhead Mains",2,0,2]
[null,null,null,"Underground Mains",0.2,0.1,0.3]
[null,null,null,"Switchgear (incl other plant & equipment)",0.1,0,0.1]
[null,null,"HV","Overhead lines",5.6,0,5.6]
[null,null,null,"Underground Cables",1.1000000000000001,0,1.1000000000000001]
[null,null,null,"Submarine",0,0,0]
[null,null,null,"Switchgear (incl other plant & equipment)",2.5,0.1,2.6]
[null,null,null,"Transformers ",0.7,0.1,0.8]
[null,null,null,"Substation",0.8,0,0.8]
[null,null,"EHV","Overhead lines",1,0,1]
[null,null,null,"Underground Cables",0,0,0]
[null,null,null,"Submarine",0,0,0]
[null,null,null,"Switchgear (incl other plant & equipment)",1.9,0,1.9]
[null,null,null,"Transformers ",0.8,0.2,1]
[null,null,null,"Substation",0.3,0,0.3]
[null,null,"132kV","Overhead lines",2,0,2]
[null,null,null,"Underground Cables",0.4,0,0.4]
[null,null,null,"Submarine Cables",0,0,0]
[null,null,null,"Switchgear (incl other plant & equipment)",0.1,0,0.1]
[null,null,null,"Transformers ",0.8,0,0.8]
[null,null,null,"Substation",0.9,0,0.9]
[null,null,"Total Non-load replacement",null,23.4,0.5,23.9]
[null,null,"Customer Contributions (-ve)",null,-0.3,null,-0.3]
[null,null,"Total Net Non-load replacement",null,23.1,0.5,23.6]
[]
[null,null,"Non-load related (other)",null,"LV","HV","EHV","132kV","Total"]
[null,null,"Direct Costs only",null,"£'m","£'m","£'m","£'m","£'m"]
[null,null,"Quality of Service",null,0.2,3.4,0,0,3.6]
[null,null,"Safety",null,0,0,0,0,0]
[null,null,"Environment",null,0,0,0,0,0]
[null,null,"Visual Amenity",null,0,0,0,0,0]
[null,null,"ESQCR",null,0,0,0,0,0]
[null,null,"Resilience",null,0,0,0,0,0]
[null,null,"Operational IT & Telecoms - BT 21CN",null,0,0,0,0,0]
[null,null,"Operational IT & Telecoms - other",null,0,3.4,0,0,3.4]
[null,null,"Non - rechargeable diversions",null,0.4,0.8,0.1,0,1.3]
[null,null,"Total Non-load related (other non-fault)",null,0.6,7.6,0.1,0,8.3000000000000007]
[null,null,"Customer Contributions (-ve)",null,null,null,null,null,0]
[null,null,"Total Net Non-load related (other non-fault)",null,0.6,7.6,0.1,0,8.3000000000000007]
[]
[null,null,"Total Non-load related expenditure (direct costs)",null,32.200000000000003]
[null,null,"Customer Contributions (-ve)",null,-0.3]
[null,null,"Total Net Non-load replacement (Direct Costs)",null,31.9]
[]
[null,null,"          Non-operational "]
[null,null,"Direct Costs only",null,"Total","Owned by DNO","Owned by related party"]
[null,null,null,null,"£'m","£'m","£'m"]
[null,null,"Vehicles",null,0.2,0.2,0]
[null,null,"Plant & Machinery",null,0,0,0]
[null,null,"Small Tools & Equipment",null,1.3,1.3,0]
[null,null,"Office Equipment",null,0.1,0.1,0]
[null,null,"Non-operational property",null,0.3,0.3,0]
[null,null,"IT Non-operational Capital Expenditure",null,0.6,0.6,0]
[null,null,"Telecoms Non-operational Capital Expenditures",null,0.5,0,0.5]
[null,null,"Total Non-operational New Assets & Replacement",null,3,2.5,0.5]

{"sheet":"RRP 2.6","index":23,"n_rows":99,"n_cols":12,"rows_kept":99,"cut":false,"hidden":false,"merged":[[13,3,13,5],[15,2,15,5],[19,2,19,5],[24,2,24,5],[21,3,21,5],[22,3,22,5],[17,3,17,5],[14,3,14,5],[16,3,16,5],[20,3,20,5],[18,3,18,5],[8,2,8,5],[9,3,9,5],[10,3,10,5],[11,3,11,5],[12,3,12,5],[75,3,75,5],[77,4,77,5],[78,4,78,5],[79,4,79,5],[50,4,50,5],[33,4,33,5],[35,4,35,5],[36,4,36,5],[59,3,59,4],[64,3,64,4],[39,4,39,5],[40,4,40,5],[41,4,41,5],[42,4,42,5],[43,4,43,5],[49,4,49,5],[44,4,44,5],[45,4,45,5],[46,4,46,5],[47,4,47,5],[48,4,48,5],[80,4,80,5],[98,2,98,5],[97,4,97,5],[82,3,82,5],[87,3,87,5],[88,3,88,5],[91,3,91,5],[93,3,93,5]]}
["Regulatory Reporting Pack",null,null,null,null,"Index"]
[]
["2007/08"]
[]
["MISCELLANEOUS"]
[]
[null,null,"Non-activity based costs (excluded from Table 2.2)(enter as positive)"]
[null,null,null,null,null,null,"£'m","£'m"]
[null,null,"Pass through Costs"]
[null,null,null,"Transmission exit charges",null,null,4.2]
[null,null,null,"Wheeled units imported",null,null,0.2]
[null,null,null,"Network rates",null,null,15.1]
[null,null,null,"Ofgem licence fee",null,null,0.5]
[null,null,null,"Shetland Balancing Costs (SHEPD only)",null,null,0]
[null,null,null,"Scottish Electricity Settlements run-off (Scottish DNOs only)",null,null,0,20]
[null,null,"Costs inside scope of DPCR4 allowances"]
[null,null,null,"Guaranteed standard of performance compensation payments",null,null,0]
[null,null,null,"Ex-gratia compensation payments",null,null,0]
[null,null,null,"Bad debt expense (net of recoveries)",null,null,0.1,0.1]
[null,null,"Costs outside scope of DPCR4 allowances"]
[null,null,null,"(Profit)/loss on sale of fixed assets and scrap[(-ve)/+ve]",null,null,-0.3]
[null,null,null,"Statutory Depreciation on operational assets",null,null,17.8]
[null,null,null,"Pension deficit repair payments",null,null,13.5,31]
[]
[null,null,"Total Non-Activity Based Costs",null,null,null,null,51.1]
[]
[]
[null,null,"OTHER ITEMS adjusting RAV"]
[null,null,null,"Proceeds of sale of assets and scrap (not recorded on Table 2.2)"]
[null,null,null,null,"Cash proceeds received on sale of:",null,"£'m"]
[null,null,null,null,"Operational assets (-ve)",null,-9.9999999999997868E-2]
[null,null,null,null,"Sales of scrap (-ve)",null,-0.5]
[null,null,null,null,"Non-operational assets (-ve)",null,0]
[null,null,null,null,"Total",null,-0.59999999999999787]
[]
[null,null,null,null,"ANALYSIS OF ASSET DISPOSALS",null,"Cost","Depn.","Net Book Value","Net Sales Proceeds","(Profit) / Loss on Disposal","Asset Owner"]
[null,null,null,null,"Asset Type",null,"£m","£m","£m","£m","£m"]
[null,null,null,null,"Redundant operational assets",null,20.9,20.8,9.9999999999997868E-2,9.9999999999997868E-2,0]
[null,null,null,null,"Sales of scrap etc",null,1.1000000000000001,0.9,0.2,0.5,-0.3]
[]
[]
[]
[]
[]
[]
[]
[]
[]
[]
[]
[null,null,null,null,"Total",null,22,21.7,0.29999999999999793,0.59999999999999787,-0.3]
[null,null,null,null,null,null,null,null,null,"OK","OK"]
[]
[null,null,null,"Use of System Bad Debts",null,null,"£m","£m"]
[null,null,null,null,null,null,null,"previously allowed"]
[null,null,null,null,"Costs incurred (excluding VAT)",null,0.1,0]
[null,null,null,null,"Receipts/(recoveries)",null,0,0]
[null,null,null,null,"Total Use of System Bad Debts",null,0]
[]
[null,null,null,"Salary sacrifice schemes (including flexible benefit schemes)",null,null,"Total","Direct capex","Direct opex, faults & Non-op capex","Indirect costs","All Other non-distrib'n activities"]
[null,null,null,null,null,null,"£m","£m","£m","£m","£m"]
[null,null,null,null,"Salary element sacrificed by employee(-ve)",null,0,0,0,0,0]
[null,null,null,null,"Additional employer pension contributions (+ve)",null,0,0,0,0,0]
[]
[null,null,null,"Lane rentals analysis: including logged up costs (see below):",null,null,"Total","Load Related New Connections & Reinforcement","Non-load non-fault new & replacement assets","Faults","Inspectns & Maint. (exc. Tree Cutting)","Tree Cutting"]
[null,null,null,null,null,null,"£m","£m","£m","£m","£m","£m"]
[null,null,null,null,"Fines and penalties"]
[null,null,null,null,"Road occupation costs"]
[null,null,null,null,"Permit scheme costs"]
[null,null,null,null,"Congestion charges"]
[null,null,null,null,"Total per Table 2.2"]
[]
[]
[null,null,"Uncertain Costs (included in table 2.2 costs)"]
[]
[null,null,null,"Road Occupation & Permit Scheme Costs included within Lane Rentals, previously agreed in writing with Ofgem to be treated as logged up costs:",null,null,"Total","Load Related New Connections & Reinforcement","Non-load non-fault new & replacement assets","Faults","Inspectns & Maint. (exc. Tree Cutting)","Tree Cutting"]
[null,null,null,null,null,null,"£m","£m","£m","£m","£m","£m"]
[null,null,null,null,"Road occupation costs",null,0]
[null,null,null,null,"Permit scheme costs",null,0]
[null,null,null,null,"Congestion charges",null,0]
[null,null,null,null,"Total",null,0,0,0,0,0,0]
[]
[null,null,null,"Costs previously agreed with Ofgem in writing for additional security",null,null,0,null,0]
[]
[]
[null,null,"Miscellaneous costs (included in table 2.2 costs)"]
[null,null,null,null,null,null,"£m"]
[null,null,null,"Pension administration costs (reported in HR & Non-op training)"]
[null,null,null,"LV Control centre costs (where it remotely controls LV network)"]
[]
[null,null,null,null,null,null,"£m","km"]
[null,null,null,"Expenditure replacing Pressure Assisted cables"]
[]
[null,null,null,"Undergrounding in National Parks / AONB - direct costs",null,null,"£m","km"]
[null,null,null,null,"LV"]
[null,null,null,null,"HV"]
[null,null,null,null,"EHV/132kV"]
[null,null,null,null,"Undergrounding in National Parks / AONB - indirect costs"]
[null,null,"Total Undergrounding in National Parks / AONB"]

{"sheet":"RRP 5.1","index":24,"n_rows":73,"n_cols":9,"rows_kept":73,"cut":false,"hidden":false,"merged":[[4,0,4,2],[7,7,7,8],[7,4,7,6]]}
["Regulatory Reporting Pack (RRP)",null,null,null,null,"Index"]
[]
["2007/08"]
[]
["Network Data"]
[]
[null,null,null,"Units","2005/06","2006/07","2007/08","2008/09","2009/10"]
[null,null,"QUALITY OF SERVICE",null,"Historical data",null,null,"For Future years"]
[null,null,"Customer Numbers ","Millions",null,null,1.079585]
[null,null,"Total CIs (Excluding EE)","CIs",null,null,80.599999999999994]
[null,null,"Total CMLs (Excluding EE)","CMLs",null,null,46.3]
[]
[null,null,"NETWORK ACTIVITY INDICATORS"]
[]
[null,null,"CONNECTIONS"]
[null,null,"Number of new connections"]
[null,null,"EHV (Includes 132kV)","No. Connections",null,null,1]
[null,null,"HV","No. Connections",null,null,19]
[null,null,"LV","No. Connections",null,null,10819]
[null,null,"DG","No. Connections",null,null,1]
[]
[null,null,"Total Connected Distributed Generation "]
[null,null,"132kV","MW",null,null,277.60000000000002]
[null,null,"EHV","MW",null,null,186.7]
[null,null,"HV","MW",null,null,93.7]
[null,null,"LV","MW",null,null,12.3]
[null,null,"Total",null,null,null,570.29999999999995]
[]
[null,null,"DEMANDS"]
[null,null,"System Maximum Demand ","MW",null,null,2179.2925999999998]
[null,null,"System Maximum Demand (Weather corrected)","MW",null,null,2179.2925999999998]
[]
[null,null,"Units Distributed"]
[null,null,"EHV (Includes 132kV)","GWh",null,null,2954.8379382999997]
[null,null,"HV","GWh",null,null,2482.1083529999996]
[null,null,"LV","GWh",null,null,7216.2041944999992]
[null,null,"Total",null,null,null,12653.150485799997]
[]
[null,null,"LOSSES"]
[null,null,"Units of distribution losses ","(GWh)",null,null,675.23700000000008]
[null,null,"Losses ","(%)",null,null,5.3365128373189352E-2]
[]
[]
[null,null,"SYSTEM PARAMETERS"]
[]
[null,null,"Distribution Circuit Length - Overhead (km)"]
[null,null,"132kV","Circuit km",null,null,1180]
[null,null,"EHV","Circuit km",null,null,1584]
[null,null,"HV","Circuit km",null,null,12207]
[null,null,"LV","Circuit km",null,null,3193]
[null,null,"Total","Circuit km",null,null,18164]
[]
[null,null,"Distribution Circuit Length - Underground (km)"]
[null,null,"132kV","Circuit km",null,null,93.4]
[null,null,"EHV","Circuit km",null,null,397.26400000000001]
[null,null,"HV","Circuit km",null,null,5366.7]
[null,null,"LV","Circuit km",null,null,10735.59]
[null,null,"Total","Circuit km",null,null,16592.953999999998]
[]
[null,null,"Distribution Circuit Length - Total (km)"]
[null,null,"132kV","Circuit km",null,null,1273.4000000000001]
[null,null,"EHV","Circuit km",null,null,1981.2640000000001]
[null,null,"HV","Circuit km",null,null,17573.7]
[null,null,"LV","Circuit km",null,null,13928.59]
[null,null,"Total","Circuit km",null,null,34756.953999999998]
[]
[null,null,"Number of Substations and Switching Stations "]
[null,null,"132kV","No. Subs",null,null,77]
[null,null,"EHV ground mounted","No. Subs",null,null,196]
[null,null,"EHV pole mounted","No. Subs",null,null,0]
[null,null,"HV ground mounted","No. Subs",null,null,8329]
[null,null,"HV pole mounted","No. Subs",null,null,31138]
[null,null,"Total","No. Subs",null,null,39740]

{"sheet":"LR1 Refs","index":25,"n_rows":55,"n_cols":3,"rows_kept":55,"cut":false,"hidden":false,"merged":[[37,1,37,2],[38,1,38,2],[7,1,7,2],[8,1,8,2],[16,1,16,2],[17,1,17,2],[28,1,28,2],[29,1,29,2]]}
[]
[]
[]
[null,"LR1 an LR1 (opt3) formula references"]
[]
[null,"LR1 (opt3) variant"]
[null,"Cell Ref: B16"]
[null,"Connections Capex 2005/06 -2014/15 (£m)"]
[null,"Connections spend minus customer contributions (from FBPQ LR1 v5 opt3)"]
[]
[null,"LV",{"$f":"SUM('FBPQ LR1 - V5 opt3'!D227:M227,'FBPQ LR1 - V5 opt3'!I229:M229)-SUM('FBPQ LR1 - V5 opt3'!D250:M250,'FBPQ LR1 - V5 opt3'!I252:M252)","v":0}]
[null,"HV",{"$f":"(SUM('FBPQ LR1 - V5 opt3'!D231:H231,'FBPQ LR1 - V5 opt3'!I230:M230,'FBPQ LR1 - V5 opt3'!I233:M233)-SUM('FBPQ LR1 - V5 opt3'!D254:H254,'FBPQ LR1 - V5 opt3'!I253:M253,'FBPQ LR1 - V5 opt3'!I256:M256))","v":0}]
[null,"EHV",{"$f":"SUM('FBPQ LR1 - V5 opt3'!D235:H235,'FBPQ LR1 - V5 opt3'!I234:M234,'FBPQ LR1 - V5 opt3'!I237:M237)-SUM('FBPQ LR1 - V5 opt3'!D258:H258,'FBPQ LR1 - V5 opt3'!I257:M257,'FBPQ LR1 - V5 opt3'!I260:M260)","v":0}]
[null,"132 kV",{"$f":"SUM('FBPQ LR1 - V5 opt3'!D239:H239,'FBPQ LR1 - V5 opt3'!I238:M238)-SUM('FBPQ LR1 - V5 opt3'!D262:H262,'FBPQ LR1 - V5 opt3'!I261:M261)","v":0}]
[]
[null,"Cell Ref B36"]
[null,"Connections Capex 2005/06 -2014/15 (£m)"]
[null,"Connections spend minus customer contributions (from FBPQ LR1 v5 opt3)"]
[]
[null,"LV",{"$f":"SUM('FBPQ LR1 - V5 opt3'!D227:M227,'FBPQ LR1 - V5 opt3'!I229:M229)-SUM('FBPQ LR1 - V5 opt3'!D250:M250,'FBPQ LR1 - V5 opt3'!I252:M252)","v":0}]
[null,"LV/HV",{"$f":"(SUM('FBPQ LR1 - V5 opt3'!D231:H231,'FBPQ LR1 - V5 opt3'!I230:M230,'FBPQ LR1 - V5 opt3'!I233:M233)-SUM('FBPQ LR1 - V5 opt3'!D254:H254,'FBPQ LR1 - V5 opt3'!I253:M253,'FBPQ LR1 - V5 opt3'!I256:M256))*(C55)","v":0}]
[null,"HV",{"$f":"(SUM('FBPQ LR1 - V5 opt3'!D231:H231,'FBPQ LR1 - V5 opt3'!I230:M230,'FBPQ LR1 - V5 opt3'!I233:M233)-SUM('FBPQ LR1 - V5 opt3'!D254:H254,'FBPQ LR1 - V5 opt3'!I253:M253,'FBPQ LR1 - V5 opt3'!I256:M256))*(1-C55)","v":0}]
[null,"EHV",{"$f":"SUM('FBPQ LR1 - V5 opt3'!D235:H235,'FBPQ LR1 - V5 opt3'!I234:M234,'FBPQ LR1 - V5 opt3'!I237:M237)-SUM('FBPQ LR1 - V5 opt3'!D258:H258,'FBPQ LR1 - V5 opt3'!I257:M257,'FBPQ LR1 - V5 opt3'!I260:M260)","v":0}]
[null,"132 kV",{"$f":"SUM('FBPQ LR1 - V5 opt3'!D239:H239,'FBPQ LR1 - V5 opt3'!I238:M238)-SUM('FBPQ LR1 - V5 opt3'!D262:H262,'FBPQ LR1 - V5 opt3'!I261:M261)","v":0}]
[]
[]
[null,"LR1 variant"]
[null,"Cell Ref: B16"]
[null,"Connections Capex 2005/06 -2014/15 (£m)"]
[null,"Connections spend minus customer contributions (from FBPQ LR1 v5 opt3)"]
[]
[null,"LV",{"$f":"SUM('FBPQ LR1'!D82:M82)-SUM('FBPQ LR1'!D110:M110)","v":3.0999999999999943}]
[null,"HV",{"$f":"(SUM('FBPQ LR1'!D86:M86)-SUM('FBPQ LR1'!D114:M114))","v":1.1999999999999993}]
[null,"EHV",{"$f":"(SUM('FBPQ LR1'!D90:M90)-SUM('FBPQ LR1'!D118:M118))","v":1.5500000000000016}]
[null,"132 kV",{"$f":"(SUM('FBPQ LR1'!D94:M94)-SUM('FBPQ LR1'!D122:M122))","v":0}]
[]
[null,"Cell Ref B36"]
[null,"Connections Capex 2005/06 -2014/15 (£m)"]
[null,"Connections spend minus customer contributions (from FBPQ LR1 v5 opt3)"]
[]
[null,"LV",{"$f":"SUM('FBPQ LR1'!D82:M82)-SUM('FBPQ LR1'!D110:M110)","v":3.0999999999999943}]
[null,"LV/HV",{"$f":"(SUM('FBPQ LR1'!D86:M86)-SUM('FBPQ LR1'!D114:M114))*C55","v":0.28724606794854218}]
[null,"HV",{"$f":"(SUM('FBPQ LR1'!D86:M86)-SUM('FBPQ LR1'!D114:M114))*(1-C55)","v":0.91275393205145705}]
[null,"EHV",{"$f":"(SUM('FBPQ LR1'!D90:M90)-SUM('FBPQ LR1'!D118:M118))","v":1.5500000000000016}]
[null,"132 kV",{"$f":"(SUM('FBPQ LR1'!D94:M94)-SUM('FBPQ LR1'!D122:M122))","v":0}]
[]
[]
[]
[]
[]
[]
[]
[]
[]
[null,null,{"$f":"'Calc-Net capex'!C50/'Calc-Net capex'!C51","v":0.23937172329045198}]