{"text_format":"1","workbook":"xlsx","n_sheets":26,"sheets":["Change Log","Inputs","Outputs","Allocation Summary","DNO - Final Allocation","Calc - DNO Opex Allocation","Calc-Units","Calc-Drivers","Calc-MEAV","Calc-Net capex","Summary of revenue","Allowed revenue -DPCR4","FBPQ T4","FBPQ LR1","FBPQ LR1 - V5 opt3","FBPQ LR4","FBPQ LR6","FBPQ NL1 0309","NL9 - Legal & Safety","FBPQ C2","RRP 1.3","RRP 2.3","RRP 2.4","RRP 2.6","RRP 5.1","LR1 Refs"],"not_rendered":{"charts":0,"images":3,"macros":1,"external_links":9,"defined_names":65,"comments":0,"pivot_tables":0},"unopened":[],"bounds":{"document_bytes":16777216,"sheet_cells":100000,"rows_first":2000,"rows_last":500,"rows_between":2000,"halvings":0,"cell_chars":16384,"cell_head_chars":4096},"cells_cut":0,"cells_raw":0,"read":"whole","date_system":"1900"}

{"sheet":"Change Log","index":0,"n_rows":13,"n_cols":4,"rows_kept":13,"cut":false,"hidden":false,"merged":[]}
[]
["Method M Version No.",null,"[Extended Disaggregation Model PB LZ v1.0]"]
["Release Date:",null,"[01 April 2013]"]
[]
[]
[]
{"$rows_left_out":8}
{"sheet":"Inputs","index":1,"n_rows":41,"n_cols":6,"rows_kept":41,"cut":false,"hidden":false,"merged":[]}
[{"$f":"\"Extended Method M for \"&B5&\" in \"&B6&\"  Status: \"&B7&\"\"","v":"Extended Method M for WPD South Wales in 2014/15  Status: Indicative"}]
[]
[]
["1000. Company, charging year, data version"]
["DNO","WPD South Wales"]
["Charging Year","2014/15"]
{"$rows_left_out":36}
{"sheet":"Outputs","index":2,"n_rows":28,"n_cols":7,"rows_kept":28,"cut":false,"hidden":false,"merged":[[4,1,4,4]]}
[{"$f":"\"Extended Method M for \"&Inputs!B5&\" in \"&Inputs!B6&\"  Status: \"&Inputs!B7&\"\"","v":"Extended Method M for WPD South Wales in 2014/15  Status: Indicative"},null,null,null,null,null,"Index"]
[]
["The data table below is used to populate EDCM table 1181 (LDNO discounts)"]
[]
[]
["Boundary category","LV demand end user","LV Sub demand or LV generation end user","HV demand or LV Sub generation end user","HV generation end user"]
{"$rows_left_out":23}
{"sheet":"Allocation Summary","index":3,"n_rows":26,"n_cols":9,"rows_kept":26,"cut":false,"hidden":false,"merged":[[2,1,2,5],[19,1,19,4],[19,5,19,8],[19,9,19,12]]}
[null,null,null,null,null,null,"Index"]
[]
["Category","% by network tier "]
[null,"LV","LV/HV","HV","EHV","Unallocated"]
["Opex and transmission exit charges",{"$f":"'DNO - Final Allocation'!I47","v":0.41429082693770697},{"$f":"'DNO - Final Allocation'!H47","v":8.3502633405527271E-2},{"$f":"'DNO - Final Allocation'!G47","v":0.28905190907172873},{"$f":"'DNO - Final Allocation'!E47","v":0.21315463058503697}]
["Depreciation",{"$f":"'DNO - Final Allocation'!I46","v":0.18558934458027709},{"$f":"'DNO - Final Allocation'!H46","v":8.6838733515246375E-2},{"$f":"'DNO - Final Allocation'!G46","v":0.35034237125516859},{"$f":"'DNO - Final Allocation'!E46","v":0.37722955064930797}]
{"$rows_left_out":21}
{"sheet":"DNO - Final Allocation","index":4,"n_rows":81,"n_cols":19,"rows_kept":81,"cut":false,"hidden":false,"merged":[[69,3,69,9],[69,11,69,17],[42,4,42,8],[42,10,42,13],[42,15,42,19],[68,3,68,10],[68,11,68,17]]}
["Step 1. Format price control allowed revenue data"]
["Index"]
[]
[null,"I) DPCR3 type presentation",null,null,null,null,null,null,null,null,null,"ii) DPCR4 type presentation"]
[]
[null,null,null,"2005/06","2006/07",null,"2007/08","2008/09","2009/10",null,null,null,null,null,"2005/06","2006/07","2007/08","2008/09","2009/10"]
{"$rows_left_out":76}
{"sheet":"Calc - DNO Opex Allocation","index":5,"n_rows":49,"n_cols":49,"rows_kept":49,"cut":false,"hidden":false,"merged":[[41,38,41,42],[41,0,61,0],[41,1,46,1],[47,1,61,1],[3,4,3,7],[2,4,2,8],[5,0,10,0],[5,1,10,1],[11,1,25,1],[38,45,38,48],[38,29,38,32],[3,11,3,14],[38,23,38,26],[38,39,38,42],[2,17,2,20],[2,23,2,26],[2,45,2,48],[2,34,2,36],[2,39,2,42],[2,29,2,32],[2,10,2,14],[1,34,1,48],[1,3,1,8],[1,10,1,14],[1,17,1,20],[1,23,1,26],[1,29,1,32]]}
["Index"]
[null,null,null,"Step 1 - extract total activity costs from cost report",null,null,null,null,null,null,"Step 2. Identify costs included in price control revenues to be allocated by MEAV",null,null,null,null,null,null,"Step 3.  Allocate costs not directly attributable to network teirs to network tiers using MEAV",null,null,null,null,null,"Step 4.  Sum directly attributed and allocated costs",null,null,null,null,null,"Step 5. Divide cost by units flowing - effectively adjust the cost because of electricity lost as it flows through the network meaning that there is more cost in the lower tiers",null,null,null,null,"Step 6.   Adjust costs so that they are aligned with the definition of opex in the allowed price control revenues"]
[null,null,null,null,"Costs extracted from RRP Tables",null,null,null,null,null,"Cost drivers - lookup from \"Calc-Drivers\"",null,null,null,null,null,null,"Allocation of \"Unallocated\" costs by cost driver to network tiers",null,null,null,null,null,"Sum of allocated and \"unallocated\" costs",null,null,null,null,null,"Sum of allocated and \"unallocated\" costs expressed per unit throughput (p/kWh)",null,null,null,null,"Proportion of costs allocated to Opex and Capex",null,null,null,null,"Operating costs = sum of allocated and unallocated multiplied by 1 minus capitalised proportion",null,null,null,null,null,"Opex only on p/kWh throughput"]
[null,null,null,"Total activity cost - from RRP 1.3","Costs allocated to network tiers in RRP - from 2.2 amd 2.3",null,null,null,"Unallocated costs = Total - costs allocated to network tiers",null,"Insert name of cost driver","Proportion of cost allocated to each network tier",null,null,null,null,null,null,null,null,null,null,null,null,null,null,null,null,null,null,null,null,null,null,"% Cost capitalised (from DCPR settlement - same for all DNOs)","Capex","Opex",null,null,"EHV","HV","HV/LV","LV",null,null,"EHV","HV","HV/LV","LV"]
[null,null,null,null,"EHV","HV","HV/LV","LV",null,null,null,"EHV","HV","HV/LV","LV",null,null,"EHV","HV","HV/LV","LV",null,null,"EHV","HV","HV/LV","LV",null,null,"EHV","HV","HV/LV","LV"]
["Cash typical costs (excluding disallowed related party margins)","Direct activities - From RRP 2.2 Detailed Cost Matrix","Load related new connections & reinforcement (net of contributions)",{"$f":"'RRP 1.3'!D$12","v":-0.50000000000000178},{"$f":"'RRP 2.4'!L13+'RRP 2.4'!L14+'RRP 2.4'!L18+'RRP 2.4'!L19","v":4.7},{"$f":"'RRP 2.4'!L12+'RRP 2.4'!L17-'Calc - DNO Opex Allocation'!G6","v":3.8},0,{"$f":"'RRP 2.4'!L11+'RRP 2.4'!L16+'RRP 2.4'!L24","v":-9},{"$f":"D6-E6-F6-G6-H6","v":0},null,"MEAV",{"$f":"IF(ISERROR(VLOOKUP($K6,'Calc-Drivers'!$B$17:$F$27,L$42,FALSE)),\" \",VLOOKUP($K6,'Calc-Drivers'!$B$17:$F$27,L$42,FALSE))","v":0.22063382481052818},{"$f":"IF(ISERROR(VLOOKUP($K6,'Calc-Drivers'!$B$17:$F$27,M$42,FALSE)),\" \",VLOOKUP($K6,'Calc-Drivers'!$B$17:$F$27,M$42,FALSE))","v":0.27826178252589195},{"$f":"IF(ISERROR(VLOOKUP($K6,'Calc-Drivers'!$B$17:$F$27,N$42,FALSE)),\" \",VLOOKUP($K6,'Calc-Drivers'!$B$17:$F$27,N$42,FALSE))","v":6.8102560342398366E-2},{"$f":"IF(ISERROR(VLOOKUP($K6,'Calc-Drivers'!$B$17:$F$27,O$42,FALSE)),\" \",VLOOKUP($K6,'Calc-Drivers'!$B$17:$F$27,O$42,FALSE))","v":0.43300183232118161},null,null,{"$f":"IF(ISERROR($I6*L6),\" \",$I6*L6)","v":0},0,0,0,null,null,{"$f":"IF($K6=\"Do not allocate\",\" \",R6+E6)","v":4.7},{"$f":"IF($K6=\"Do not allocate\",\" \",S6+F6)","v":3.8},{"$f":"IF($K6=\"Do not allocate\",\" \",T6+G6)","v":0},{"$f":"IF($K6=\"Do not allocate\",\" \",U6+H6)","v":-9},null,null,{"$f":"IF(ISERROR(X6*100000000/'Calc-Units'!$E$21),\" \",X6*100000000/'Calc-Units'!$E$21)","v":3.7852360544718015E-2},{"$f":"IF(ISERROR(Y6*100000000/'Calc-Units'!$D$21),\" \",Y6*100000000/'Calc-Units'!$D$21)","v":3.9528082196430385E-2},{"$f":"IF(ISERROR(Z6*100000000/'Calc-Units'!$C$21),\" \",Z6*100000000/'Calc-Units'!$C$21)","v":0},{"$f":"IF(ISERROR(AA6*100000000/'Calc-Units'!$C$21),\" \",AA6*100000000/'Calc-Units'!$C$21)","v":-0.12471930889732255},null,1,{"$f":"AI6*D6","v":-0.50000000000000178},{"$f":"D6*(1-AI6)","v":0},null,null,{"$f":"IF(ISERROR(X6*(1-$AI6)),\" \",X6*(1-$AI6))","v":0},{"$f":"IF(ISERROR(Y6*(1-$AI6)),\" \",Y6*(1-$AI6))","v":0},{"$f":"IF(ISERROR(Z6*(1-$AI6)),\" \",Z6*(1-$AI6))","v":0},{"$f":"IF(ISERROR(AA6*(1-$AI6)),\" \",AA6*(1-$AI6))","v":0},null,null,{"$f":"IF(ISERROR(AN6*100000000/'Calc-Units'!$E$21),\" \",AN6*100000000/'Calc-Units'!$E$21)","v":0},{"$f":"IF(ISERROR(AO6*100000000/'Calc-Units'!$D$21),\" \",AO6*100000000/'Calc-Units'!$D$21)","v":0},{"$f":"IF(ISERROR(AP6*100000000/'Calc-Units'!$C$21),\" \",AP6*100000000/'Calc-Units'!$C$21)","v":0},{"$f":"IF(ISERROR(AQ6*100000000/'Calc-Units'!$C$21),\" \",AQ6*100000000/'Calc-Units'!$C$21)","v":0}]
{"$rows_left_out":44}
{"sheet":"Calc-Units","index":6,"n_rows":21,"n_cols":6,"rows_kept":21,"cut":false,"hidden":false,"merged":[]}
["103. Units distributed (GWh) from RRP table 5.1",null,null,"Index"]
[null,"Units distributed (GWh) from RRP table 5.1"]
["Units distributed at LV",{"$f":"'RRP 5.1'!G36","v":7216.2041944999992}]
["Units distributed at HV",{"$f":"'RRP 5.1'!G35","v":2482.1083529999996}]
["Units distributed at EHV+",{"$f":"'RRP 5.1'!G34","v":2954.8379382999997}]
["Losses",{"$f":"'RRP 5.1'!G40","v":675.23700000000008}]
{"$rows_left_out":16}
{"sheet":"Calc-Drivers","index":7,"n_rows":27,"n_cols":8,"rows_kept":27,"cut":false,"hidden":false,"merged":[]}
["Drivers - LV, HV, EHV split",null,null,null,null,null,null,"Index"]
[]
[null,"Category","LV","HV","EHV",null,"Source"]
[null,"Net Capex",{"$f":"'Calc-Net capex'!$D$6","v":0.18558934458027707},{"$f":"'Calc-Net capex'!$D$7","v":0.43718110477041494},{"$f":"'Calc-Net capex'!$D$8+'Calc-Net capex'!$D$9","v":0.37722955064930797},null,"FBPQ capex - see \"Calc Net capex\""]
[null,"Customers",1,0,0,null,"Assumption"]
[null,"Network Length",{"$f":"'RRP 5.1'!$G$64/'RRP 5.1'!$G$65","v":0.40074253917647679},{"$f":"'RRP 5.1'!$G$63/'RRP 5.1'!$G$65","v":0.50561680405020537},{"$f":"('RRP 5.1'!$G$61+'RRP 5.1'!$G$62)/'RRP 5.1'!$G$65","v":9.3640656773317954E-2},null,"RRP table 5.1"]
{"$rows_left_out":22}
{"sheet":"Calc-MEAV","index":8,"n_rows":164,"n_cols":18,"rows_kept":164,"cut":false,"hidden":false,"merged":[[2,14,2,16],[3,14,3,16],[2,1,2,3],[3,1,3,3],[2,5,2,7],[3,5,3,7],[2,9,2,11],[3,9,3,11]]}
["MEAV by Voltage Level",null,null,null,null,"Index"]
[]
[null,"MEAV  - LV, HV, EHV, 132kV split",null,null,null,"MEAV  - LV, LV/HV, HV, EHV, 132kV split",null,null,null,"MEAV  - LV (excl. services), LV/HV, HV, EHV, 132kV split",null,null,null,null,"MEAV  - LV (excl. services + 50%LV), LV/HV, HV, EHV, 132kV split"]
[null,"Sum of MEAV of asset classified in voltage tier (as calculated below)",null,null,null,"Sum of MEAV of asset classified in voltage tier",null,null,null,"Sum of MEAV of asset classified in voltage tier (as calculated below)",null,null,null,null,"Sum of MEAV of asset classified in voltage tier (as calculated below)"]
[null,null,"£m","% of Total",null,null,"£m","% of Total",null,null,"£m","% of Total",null,null,null,"£m","% of Total"]
[null,"LV",{"$f":"SUM(I20:I39)","v":1763568.7248},{"$f":"C6/$C$10","v":0.43300183232118161},null,"LV",{"$f":"SUM(I20:I39)","v":1763568.7248},{"$f":"G6/$G$11","v":0.43300183232118161},null,"LV",{"$f":"SUM(I20:I39)-I21-I30","v":1109148.0648000001},{"$f":"K6/$K$11","v":0.32445753799232402},null,null,"LV",{"$f":"(SUM(I20:I39)-I21-I30)*0.5","v":554574.03240000003},{"$f":"P6/P$11","v":0.19364327992234293}]
{"$rows_left_out":159}
{"sheet":"Calc-Net capex","index":9,"n_rows":55,"n_cols":15,"rows_kept":55,"cut":false,"hidden":false,"merged":[[24,1,24,2],[16,4,16,5],[45,1,45,2],[46,1,46,2],[25,1,25,2],[36,4,36,5],[46,4,46,5],[35,1,35,2],[35,4,35,5],[36,1,36,2],[25,4,25,5],[45,4,45,5],[3,1,3,3],[2,1,2,3],[15,4,15,5],[15,1,15,2],[16,1,16,2],[46,7,46,8],[36,7,36,8],[2,9,2,11],[2,13,2,15],[3,9,3,11],[3,13,3,15],[45,7,45,8],[2,5,2,7],[3,5,3,7],[16,7,16,8],[15,7,15,8],[24,4,24,5],[35,7,35,8]]}
["Total Net Capex",null,null,null,null,"Index"]
[]
[null,"Total Net Capex 2005/06 -2014/15 LV, HV, EHV, 132kV split",null,null,null,"Total Net Capex 2005/06 -2014/15 LV, LV/HV, HV, EHV, 132kV split",null,null,null,"IP Appendix 6 Table 5 Reductions to EHV",null,null,null,"IP Appendix 7 Reductions to EHV"]
[null,"Sum connecions/reinforcement/replacement capex -see below",null,null,null,"Sum connecions/reinforcement/replacement capex -see below",null,null,null,"Appendix 6 Table 5 EHV & 132",null,null,null,"Appendix 7 Table 18"]
[null,null,"£m","% of Total",null,null,"£m","% of Total",null,"EHV",null,{"$f":"K5*(F21/(F21+F22))","v":0},null,null,"£m"]
[null,"LV",{"$f":"C19+F19+I19+C28+F28-O6","v":49.299918108546755},{"$f":"C6/SUM($C$6:$C$9)","v":0.18558934458027707},null,"LV",{"$f":"+C39+F39+I39+C49+F49-O6","v":49.299918108546755},{"$f":"G6/SUM($G$6:$G$10)","v":0.18558934458027709},null,"132kV",null,{"$f":"K5*(F22/(F21+F22))","v":0},null,"LV"]
{"$rows_left_out":50}
{"sheet":"Summary of revenue","index":10,"n_rows":49,"n_cols":12,"rows_kept":49,"cut":false,"hidden":false,"merged":[[46,1,46,4],[31,1,31,4],[33,1,33,4],[37,1,37,4],[38,1,38,4],[44,1,44,4],[45,1,45,4],[29,1,29,4],[10,1,10,4],[11,1,11,4],[12,1,12,4],[13,1,13,4],[15,1,15,4],[17,1,17,4],[18,1,18,4],[20,1,20,4],[25,1,25,4],[26,1,26,4],[27,1,27,4]]}
[null,null,"Summary of Revenue",null,null,null,null,null,null,"Index"]
[]
[]
[]
[]
[]
{"$rows_left_out":44}
{"sheet":"Allowed revenue -DPCR4","index":11,"n_rows":33,"n_cols":10,"rows_kept":33,"cut":false,"hidden":false,"merged":[]}
[null,null,"2004/05","2005/6","2006/7","2007/8","2008/9","2009/10",null,"Index"]
[null,null,"(£M)","(£M)","(£M)","(£M)","(£M)","(£M)"]
[1,"Opening asset value",null,573.6,577.79999999999995,579.29999999999995,578.4,575," "]
[2,"Total capex",null,49.9,49.7,49.7,49.7,49.7," "]
[3,"Depreciation",null,-45.7,-48.2,-50.6,-53.1,-55.6," "]
[4,"Closing asset value",null,577.79999999999995,579.29999999999995,578.4,575,569.1," "]
{"$rows_left_out":28}
{"sheet":"FBPQ T4","index":12,"n_rows":146,"n_cols":31,"rows_kept":146,"cut":false,"hidden":false,"merged":[[6,11,6,15],[6,16,6,20],[6,21,6,25],[6,1,8,4],[6,5,8,5],[7,28,7,29],[6,26,6,30],[7,6,7,7],[7,8,7,9],[7,11,7,12],[7,13,7,14],[7,16,7,17],[7,18,7,19],[7,21,7,22],[7,23,7,24],[7,26,7,27],[6,6,6,10]]}
["Main Forecast Business Plan DPCR5",null,null,null,null," ","Index",null," ",null," "," ",null," ",null," "," ",null," ",null," "," ",null," ",null," "," ",null," ",null," "]
[]
["T4 - Volume Summary"]
[]
[null,"Total Asset Register Movement"]
[]
{"$rows_left_out":141}
{"sheet":"FBPQ LR1","index":13,"n_rows":136,"n_cols":20,"rows_kept":136,"cut":false,"hidden":false,"merged":[[104,1,105,1],[104,2,105,2],[130,1,131,1],[130,2,131,2],[7,1,8,1],[7,2,8,2],[17,2,18,2],[50,2,51,2],[75,1,76,1],[75,2,76,2],[50,1,51,1],[17,1,18,1]]}
["Main Forecast Business Plan DPCR5",null,null,null,null,"Index"]
[]
["LR1 - Demand"]
[]
[]
[null,"Demand Totals"]
{"$rows_left_out":131}
{"sheet":"FBPQ LR1 - V5 opt3","index":14,"n_rows":266,"n_cols":20,"rows_kept":266,"cut":false,"hidden":false,"merged":[[7,1,8,1],[7,2,8,2],[25,2,26,2],[25,1,26,1],[47,1,48,1],[47,2,48,2],[78,1,79,1],[78,2,79,2],[109,1,110,1],[109,2,110,2],[142,1,143,1],[142,2,143,2]]}
["Main Forecast Business Plan DPCR5"]
[]
["LR1a - Demand - metered connections"]
[]
[]
[null,"Demand Totals - Table 1"]
{"$rows_left_out":261}
{"sheet":"FBPQ LR4","index":15,"n_rows":99,"n_cols":37,"rows_kept":99,"cut":false,"hidden":false,"merged":[[42,35,43,35],[43,21,43,30],[6,18,6,19],[42,2,42,10],[42,11,42,15],[42,16,42,20],[42,21,42,34],[31,2,32,2],[23,2,24,2]]}
["June Forecast Business Plan DPCR5"]
["EDFE SPN"]
["LR4 - General reinforcement"]
[]
[null,"General reinforcement expenditure"]
[]
{"$rows_left_out":94}
{"sheet":"FBPQ LR6","index":16,"n_rows":32,"n_cols":19,"rows_kept":32,"cut":false,"hidden":false,"merged":[[23,1,25,1],[9,1,9,2],[10,1,10,2],[11,1,11,2],[7,1,8,2],[15,1,16,2],[17,1,17,2],[18,1,18,2],[19,1,19,2]]}
["Main Forecast Business Plan DPCR5",null,null,null,null,"Index"]
[]
["LR6 - Fault levels"]
[]
[]
[null,"Fault level system measures"]
{"$rows_left_out":27}
{"sheet":"FBPQ NL1 0309","index":17,"n_rows":153,"n_cols":20,"rows_kept":153,"cut":false,"hidden":false,"merged":[[120,1,123,1],[124,1,127,1],[129,1,132,1],[133,1,136,1],[88,1,93,1],[94,1,99,1],[108,1,113,1],[114,1,119,1],[75,1,76,1],[77,1,78,1],[79,1,81,1],[82,1,87,1],[46,1,48,1],[49,1,54,1],[55,1,60,1],[61,1,66,1],[6,1,8,2],[39,1,41,2],[72,1,74,2],[105,1,107,2],[141,1,143,2],[67,1,67,2],[34,1,34,2],[100,1,100,2],[22,1,27,1],[28,1,33,1],[42,1,43,1],[44,1,45,1],[9,1,10,1],[11,1,12,1],[13,1,15,1],[16,1,21,1]]}
["June Forecast Business Plan DPCR5",null,null,null,null,null," "]
["EDFE SPN"]
["NL1 - Condition based expenditure"]
[]
[null,"Total condition based replacement"]
[]
{"$rows_left_out":148}
{"sheet":"NL9 - Legal & Safety","index":18,"n_rows":137,"n_cols":24,"rows_kept":137,"cut":false,"hidden":false,"merged":[[57,9,57,15],[57,17,57,23],[58,2,59,2],[58,10,59,10],[58,18,59,18],[58,3,58,7],[58,19,58,23],[58,17,59,17],[84,1,84,7],[84,9,84,15],[84,17,84,23],[85,2,86,2],[85,10,86,10],[85,18,86,18],[85,3,85,7],[85,1,86,1],[85,17,86,17],[66,9,66,15],[66,17,66,23],[67,18,68,18],[66,1,66,7],[67,2,68,2],[67,10,68,10],[67,17,68,17],[103,1,103,7],[103,9,103,15],[103,17,103,23],[104,2,105,2],[104,3,104,7],[104,10,105,10],[104,18,105,18],[104,1,105,1],[113,2,114,2],[112,1,112,7],[112,9,112,15],[112,17,112,23],[130,9,130,15],[130,17,130,23],[113,10,114,10],[113,18,114,18],[113,1,114,1],[75,1,75,7],[75,9,75,15],[76,2,77,2],[76,10,77,10],[75,17,75,23],[76,18,77,18],[76,1,77,1],[76,17,77,17],[131,2,132,2],[131,10,132,10],[131,18,132,18],[121,1,121,7],[121,9,121,15],[121,17,121,23],[122,2,123,2],[122,10,123,10],[122,18,123,18],[130,1,130,7],[122,1,123,1],[131,1,132,1],[6,1,7,2],[30,1,31,2],[39,1,40,2],[58,1,59,1],[67,1,68,1],[57,1,57,7]]}
["June Forecast Business Plan DPCR5"]
["EDFE SPN"]
["NL9 - Legal and safety"]
[]
[null,"Legal and Safety"]
[]
{"$rows_left_out":132}
{"sheet":"FBPQ C2","index":19,"n_rows":155,"n_cols":10,"rows_kept":155,"cut":false,"hidden":false,"merged":[[6,1,8,4],[6,5,8,5],[6,6,6,7],[6,8,6,9]]}
["Main Forecast Business Plan DPCR5",null,null,null,null,"Index"]
[]
["C2 - Unit costs"]
[]
[]
[]
{"$rows_left_out":150}
{"sheet":"RRP 1.3","index":20,"n_rows":26,"n_cols":37,"rows_kept":26,"cut":false,"hidden":false,"merged":[[25,3,25,26],[21,3,21,26],[22,3,22,26],[23,3,23,26],[24,3,24,26],[6,26,8,26],[6,36,8,36],[7,3,7,8],[7,9,7,23],[6,31,8,31],[6,32,8,32],[6,33,8,33],[6,34,8,34],[6,27,8,27],[6,28,8,28],[6,29,8,29],[6,35,8,35],[6,30,8,30],[6,3,6,23],[6,24,8,24],[6,25,8,25]]}
["Regulatory Reporting Pack (RRP)",null,null,null,null,"Index",null,"CAUTION - THIS PACK DOES NOT BALANCE"]
[]
["2007/08"]
[]
[null,null,"Electricity Distribution Industry Activity Costs - individual DNO input"]
[]
{"$rows_left_out":21}
{"sheet":"RRP 2.3","index":21,"n_rows":48,"n_cols":17,"rows_kept":48,"cut":false,"hidden":false,"merged":[[23,0,26,0],[23,1,23,2],[26,1,26,2],[31,0,31,2],[32,0,32,2],[28,0,28,2],[29,0,29,2],[30,0,30,2],[27,0,27,2],[13,6,15,6],[14,1,14,2],[15,1,15,2],[16,0,18,0],[16,1,16,2],[17,1,17,2],[18,1,18,2],[12,0,15,0],[12,1,12,2],[13,1,13,2],[13,4,15,4],[13,5,15,5],[19,0,22,0],[19,1,19,2],[22,1,22,2],[8,0,9,2],[10,0,11,0],[10,1,10,2],[11,1,11,2],[10,4,11,4],[5,12,5,16],[6,4,6,6],[6,8,6,10],[6,12,7,14],[6,16,7,16],[10,6,11,6],[10,5,11,5],[46,2,46,5],[43,12,43,13],[35,4,36,7],[41,14,42,14],[33,0,33,2],[43,2,43,5],[44,2,44,5],[45,2,45,5],[41,12,42,13],[37,4,37,7],[38,4,38,7],[39,4,39,7],[41,2,42,5],[41,6,42,6]]}
["Regulatory Reporting Pack (RRP)",null,null,null,"Index"]
[]
["2007/08"]
[]
["Inspections & Maintenance, Tree Cutting and Fault Costs"]
[null,null,null,null,null,null,null,null,null,null,null,null,"Memorandum Information - Scottish DNOs 132kV"]
{"$rows_left_out":43}
{"sheet":"RRP 2.4","index":22,"n_rows":89,"n_cols":12,"rows_kept":89,"cut":false,"hidden":false,"merged":[[27,4,27,5],[30,2,31,2],[32,2,33,2],[34,2,36,2],[37,2,42,2],[27,2,29,3],[7,2,8,3],[9,2,9,3],[14,2,14,3],[15,2,15,3],[16,2,16,3],[10,2,10,3],[11,2,11,3],[12,2,12,3],[13,2,13,3],[17,2,17,3],[18,2,18,3],[19,2,19,3],[55,2,55,3],[56,2,56,3],[20,2,20,3],[21,2,21,3],[43,2,48,2],[49,2,54,2],[22,2,22,3],[23,2,23,3],[24,2,24,3],[57,2,57,3],[60,2,60,3],[61,2,61,3],[62,2,62,3],[63,2,63,3],[64,2,64,3],[65,2,65,3],[66,2,66,3],[67,2,67,3],[68,2,68,3],[69,2,69,3],[70,2,70,3],[71,2,71,3],[72,2,72,3],[74,2,74,3],[75,2,75,3],[76,2,76,3],[81,2,81,3],[87,2,87,3],[88,2,88,3],[79,2,80,3],[82,2,82,3],[83,2,83,3],[84,2,84,3],[85,2,85,3],[86,2,86,3]]}
["Regulatory Reporting Pack (RRP)",null,null,null,"Index"]
[]
["2007/08"]
[]
["NEW AND REPLACEMENT ASSETS (EXCL. FAULTS)"]
[]
{"$rows_left_out":84}
{"sheet":"RRP 2.6","index":23,"n_rows":99,"n_cols":12,"rows_kept":99,"cut":false,"hidden":false,"merged":[[13,3,13,5],[15,2,15,5],[19,2,19,5],[24,2,24,5],[21,3,21,5],[22,3,22,5],[17,3,17,5],[14,3,14,5],[16,3,16,5],[20,3,20,5],[18,3,18,5],[8,2,8,5],[9,3,9,5],[10,3,10,5],[11,3,11,5],[12,3,12,5],[75,3,75,5],[77,4,77,5],[78,4,78,5],[79,4,79,5],[50,4,50,5],[33,4,33,5],[35,4,35,5],[36,4,36,5],[59,3,59,4],[64,3,64,4],[39,4,39,5],[40,4,40,5],[41,4,41,5],[42,4,42,5],[43,4,43,5],[49,4,49,5],[44,4,44,5],[45,4,45,5],[46,4,46,5],[47,4,47,5],[48,4,48,5],[80,4,80,5],[98,2,98,5],[97,4,97,5],[82,3,82,5],[87,3,87,5],[88,3,88,5],[91,3,91,5],[93,3,93,5]]}
["Regulatory Reporting Pack",null,null,null,null,"Index"]
[]
["2007/08"]
[]
["MISCELLANEOUS"]
[]
{"$rows_left_out":94}
{"sheet":"RRP 5.1","index":24,"n_rows":73,"n_cols":9,"rows_kept":73,"cut":false,"hidden":false,"merged":[[4,0,4,2],[7,7,7,8],[7,4,7,6]]}
["Regulatory Reporting Pack (RRP)",null,null,null,null,"Index"]
[]
["2007/08"]
[]
["Network Data"]
[]
{"$rows_left_out":68}
{"sheet":"LR1 Refs","index":25,"n_rows":55,"n_cols":3,"rows_kept":55,"cut":false,"hidden":false,"merged":[[37,1,37,2],[38,1,38,2],[7,1,7,2],[8,1,8,2],[16,1,16,2],[17,1,17,2],[28,1,28,2],[29,1,29,2]]}
[]
[]
[]
[null,"LR1 an LR1 (opt3) formula references"]
[]
[null,"LR1 (opt3) variant"]
{"$rows_left_out":49}